Build failed in Jenkins: webtools-common_R3_10 #42

classic Classic list List threaded Threaded
2 messages Options
Reply | Threaded
Open this post in threaded view
|

Build failed in Jenkins: webtools-common_R3_10 #42

hudsonbuild
See <https://ci.eclipse.org/webtools/job/webtools-common_R3_10/42/display/redirect>

------------------------------------------
[...truncated 3.01 MB...]
[INFO] The project's OSGi version is 1.0.100.v201004201859
[INFO]
[INFO] --- tycho-packaging-plugin:1.1.0:validate-id (default-validate-id) @ org.eclipse.wst.internet.cache.tests ---
[INFO]
[INFO] --- tycho-packaging-plugin:1.1.0:validate-version (default-validate-version) @ org.eclipse.wst.internet.cache.tests ---
[INFO]
[INFO] --- build-helper-maven-plugin:3.0.0:regex-property (regex-property) @ org.eclipse.wst.internet.cache.tests ---
[INFO]
[INFO] --- maven-resources-plugin:2.4.3:resources (default-resources) @ org.eclipse.wst.internet.cache.tests ---
[WARNING] Using platform encoding (UTF-8 actually) to copy filtered resources, i.e. build is platform dependent!
[INFO] skip non existing resourceDirectory /jobs/genie.webtools/webtools-common_R3_10/workspace/tests/org.eclipse.wst.internet.cache.tests/src/main/resources
[INFO]
[INFO] --- tycho-compiler-plugin:1.1.0:compile (default-compile) @ org.eclipse.wst.internet.cache.tests ---
[INFO] Compiling 7 source files to /jobs/genie.webtools/webtools-common_R3_10/workspace/tests/org.eclipse.wst.internet.cache.tests/target/classes
[INFO]
[INFO] --- maven-resources-plugin:2.4.3:testResources (default-testResources) @ org.eclipse.wst.internet.cache.tests ---
[WARNING] Using platform encoding (UTF-8 actually) to copy filtered resources, i.e. build is platform dependent!
[INFO] skip non existing resourceDirectory /jobs/genie.webtools/webtools-common_R3_10/workspace/tests/org.eclipse.wst.internet.cache.tests/src/test/resources
[INFO]
[INFO] --- tycho-source-plugin:1.1.0:plugin-source (plugin-source) @ org.eclipse.wst.internet.cache.tests ---
[INFO] Building jar: /jobs/genie.webtools/webtools-common_R3_10/workspace/tests/org.eclipse.wst.internet.cache.tests/target/org.eclipse.wst.internet.cache.tests-1.0.100-SNAPSHOT-sources.jar
[INFO]
[INFO] --- target-platform-configuration:1.1.0:target-platform (default-target-platform) @ org.eclipse.wst.internet.cache.tests ---
[INFO]
[INFO] --- tycho-packaging-plugin:1.1.0:package-plugin (default-package-plugin) @ org.eclipse.wst.internet.cache.tests ---
[INFO] Building jar: /jobs/genie.webtools/webtools-common_R3_10/workspace/tests/org.eclipse.wst.internet.cache.tests/tests.jar
[INFO] Building jar: /jobs/genie.webtools/webtools-common_R3_10/workspace/tests/org.eclipse.wst.internet.cache.tests/target/org.eclipse.wst.internet.cache.tests-1.0.100-SNAPSHOT.jar
[INFO]
[INFO] --- tycho-p2-plugin:1.1.0:p2-metadata-default (default-p2-metadata-default) @ org.eclipse.wst.internet.cache.tests ---
[INFO]
[INFO] --- tycho-surefire-plugin:1.1.0:test (default-test) @ org.eclipse.wst.internet.cache.tests ---
[INFO] Expected eclipse log file: /jobs/genie.webtools/webtools-common_R3_10/workspace/tests/org.eclipse.wst.internet.cache.tests/target/work/data/.metadata/.log
[INFO] Command line:
        [/opt/public/common/java/oracle/jdk1.8.0_162_x64/jre/bin/java, -Dosgi.noShutdown=false, -Dosgi.os=linux, -Dosgi.ws=gtk, -Dosgi.arch=x86_64, -Dosgi.clean=true, -jar, /jobs/genie.webtools/webtools-common_R3_10/workspace/.repository/p2/osgi/bundle/org.eclipse.equinox.launcher/1.5.0.v20180119-0753/org.eclipse.equinox.launcher-1.5.0.v20180119-0753.jar, -data, /jobs/genie.webtools/webtools-common_R3_10/workspace/tests/org.eclipse.wst.internet.cache.tests/target/work/data, -install, /jobs/genie.webtools/webtools-common_R3_10/workspace/tests/org.eclipse.wst.internet.cache.tests/target/work, -configuration, /jobs/genie.webtools/webtools-common_R3_10/workspace/tests/org.eclipse.wst.internet.cache.tests/target/work/configuration, -application, org.eclipse.tycho.surefire.osgibooter.headlesstest, -testproperties, /jobs/genie.webtools/webtools-common_R3_10/workspace/tests/org.eclipse.wst.internet.cache.tests/target/surefire.properties]
Picked up JAVA_TOOL_OPTIONS: -Xmx2G -Djava.io.tmpdir=/tmp/genie.webtools

-------------------------------------------------------
 T E S T S
-------------------------------------------------------
Running org.eclipse.wst.internet.cache.internal.CacheTest
Tests run: 10, Failures: 0, Errors: 0, Skipped: 0, Time elapsed: 1.954 sec - in org.eclipse.wst.internet.cache.internal.CacheTest
testResultStartsWithFile(org.eclipse.wst.internet.cache.internal.CacheTest)  Time elapsed: 0.192 sec
testClearCacheWithSingleEntry(org.eclipse.wst.internet.cache.internal.CacheTest)  Time elapsed: 0.077 sec
testDeleteNullCacheEntry(org.eclipse.wst.internet.cache.internal.CacheTest)  Time elapsed: 0.756 sec
testGetResourceThatExists(org.eclipse.wst.internet.cache.internal.CacheTest)  Time elapsed: 0.056 sec
testClearCacheWithMultipleEntries(org.eclipse.wst.internet.cache.internal.CacheTest)  Time elapsed: 0.571 sec
testGetNullResource(org.eclipse.wst.internet.cache.internal.CacheTest)  Time elapsed: 0.001 sec
testGetNonExistantResource(org.eclipse.wst.internet.cache.internal.CacheTest)  Time elapsed: 0.054 sec
testDeleteCacheEntry(org.eclipse.wst.internet.cache.internal.CacheTest)  Time elapsed: 0.072 sec
testGetCacheEntries(org.eclipse.wst.internet.cache.internal.CacheTest)  Time elapsed: 0.149 sec
testGetInstance(org.eclipse.wst.internet.cache.internal.CacheTest)  Time elapsed: 0.001 sec
Running org.eclipse.wst.internet.cache.internal.CacheURIResolverExtensionTest
Tests run: 7, Failures: 0, Errors: 0, Skipped: 0, Time elapsed: 0.194 sec - in org.eclipse.wst.internet.cache.internal.CacheURIResolverExtensionTest
testAbsoluteSystemIdNullBaselocation(org.eclipse.wst.internet.cache.internal.CacheURIResolverExtensionTest)  Time elapsed: 0.096 sec
testRelativeSystemIdWillNullBaselocation(org.eclipse.wst.internet.cache.internal.CacheURIResolverExtensionTest)  Time elapsed: 0 sec
testReturnsNullWhenDisabled(org.eclipse.wst.internet.cache.internal.CacheURIResolverExtensionTest)  Time elapsed: 0.001 sec
testResolveNullSystemIdAndBaselocation(org.eclipse.wst.internet.cache.internal.CacheURIResolverExtensionTest)  Time elapsed: 0 sec
testResolveNullSystemId(org.eclipse.wst.internet.cache.internal.CacheURIResolverExtensionTest)  Time elapsed: 0 sec
testRelativeSystemId(org.eclipse.wst.internet.cache.internal.CacheURIResolverExtensionTest)  Time elapsed: 0.056 sec
testAbsoluteSystemId(org.eclipse.wst.internet.cache.internal.CacheURIResolverExtensionTest)  Time elapsed: 0.037 sec
Running org.eclipse.wst.internet.cache.internal.LicenseRegistryTest
Tests run: 6, Failures: 0, Errors: 0, Skipped: 0, Time elapsed: 0.003 sec - in org.eclipse.wst.internet.cache.internal.LicenseRegistryTest
testDisgreeToLicense(org.eclipse.wst.internet.cache.internal.LicenseRegistryTest)  Time elapsed: 0.001 sec
testAddLicenseToRegistryTwice(org.eclipse.wst.internet.cache.internal.LicenseRegistryTest)  Time elapsed: 0 sec
testAddLicenseToRegistry(org.eclipse.wst.internet.cache.internal.LicenseRegistryTest)  Time elapsed: 0.001 sec
testAgreeToLicense(org.eclipse.wst.internet.cache.internal.LicenseRegistryTest)  Time elapsed: 0 sec
testAgreeToLicenseNotInRegistry(org.eclipse.wst.internet.cache.internal.LicenseRegistryTest)  Time elapsed: 0 sec
testDisagreeToLicenseNotInRegistry(org.eclipse.wst.internet.cache.internal.LicenseRegistryTest)  Time elapsed: 0 sec
Running org.eclipse.wst.internet.cache.internal.CacheEntryTest
Tests run: 3, Failures: 0, Errors: 0, Skipped: 0, Time elapsed: 0.002 sec - in org.eclipse.wst.internet.cache.internal.CacheEntryTest
testExpiredWhenLessThanSystemTime(org.eclipse.wst.internet.cache.internal.CacheEntryTest)  Time elapsed: 0.001 sec
testNotExpiredWhenMinusOne(org.eclipse.wst.internet.cache.internal.CacheEntryTest)  Time elapsed: 0 sec
testNotExpiredWhenGreaterThanSystemTime(org.eclipse.wst.internet.cache.internal.CacheEntryTest)  Time elapsed: 0 sec

Results :

Tests run: 26, Failures: 0, Errors: 0, Skipped: 0

[INFO] All tests passed!
[INFO]
[INFO] --- tycho-pack200a-plugin:1.1.0:normalize (pack200-normalize) @ org.eclipse.wst.internet.cache.tests ---
[INFO] Pack200 normalizing jar /jobs/genie.webtools/webtools-common_R3_10/workspace/tests/org.eclipse.wst.internet.cache.tests/target/org.eclipse.wst.internet.cache.tests-1.0.100-SNAPSHOT.jar
Picked up JAVA_TOOL_OPTIONS: -Xmx2G -Djava.io.tmpdir=/tmp/genie.webtools
Picked up JAVA_TOOL_OPTIONS: -Xmx2G -Djava.io.tmpdir=/tmp/genie.webtools
[INFO]
[INFO] --- eclipse-jarsigner-plugin:1.1.4:sign (sign) @ org.eclipse.wst.internet.cache.tests ---
[INFO] Signing of nested jars of '/jobs/genie.webtools/webtools-common_R3_10/workspace/tests/org.eclipse.wst.internet.cache.tests/target/org.eclipse.wst.internet.cache.tests-1.0.100-SNAPSHOT.jar_unpacked_1328144086105874389/tests.jar' is disabled.
[INFO] Signing jar: /jobs/genie.webtools/webtools-common_R3_10/workspace/tests/org.eclipse.wst.internet.cache.tests/target/org.eclipse.wst.internet.cache.tests-1.0.100-SNAPSHOT.jar_unpacked_1328144086105874389/tests.jar
[INFO] Signing jar: /jobs/genie.webtools/webtools-common_R3_10/workspace/tests/org.eclipse.wst.internet.cache.tests/target/org.eclipse.wst.internet.cache.tests-1.0.100-SNAPSHOT.jar
[INFO] Signing jar: /jobs/genie.webtools/webtools-common_R3_10/workspace/tests/org.eclipse.wst.internet.cache.tests/target/org.eclipse.wst.internet.cache.tests-1.0.100-SNAPSHOT-sources.jar
[INFO]
[INFO] --- tycho-pack200b-plugin:1.1.0:pack (pack200-pack) @ org.eclipse.wst.internet.cache.tests ---
[INFO] Pack200 packing jar /jobs/genie.webtools/webtools-common_R3_10/workspace/tests/org.eclipse.wst.internet.cache.tests/target/org.eclipse.wst.internet.cache.tests-1.0.100-SNAPSHOT.jar
Picked up JAVA_TOOL_OPTIONS: -Xmx2G -Djava.io.tmpdir=/tmp/genie.webtools
[INFO]
[INFO] --- tycho-p2-plugin:1.1.0:p2-metadata (p2-metadata) @ org.eclipse.wst.internet.cache.tests ---
[INFO] No baseline version MavenProject: org.eclipse.webtools.common:org.eclipse.wst.internet.cache.tests:1.0.100-SNAPSHOT @ /jobs/genie.webtools/webtools-common_R3_10/workspace/tests/org.eclipse.wst.internet.cache.tests/pom.xml
[INFO]
[INFO] --- maven-install-plugin:2.3.1:install (default-install) @ org.eclipse.wst.internet.cache.tests ---
[INFO] Installing /jobs/genie.webtools/webtools-common_R3_10/workspace/tests/org.eclipse.wst.internet.cache.tests/target/org.eclipse.wst.internet.cache.tests-1.0.100-SNAPSHOT.jar to <https://ci.eclipse.org/webtools/job/webtools-common_R3_10/ws/.repository/org/eclipse/webtools/common/org.eclipse.wst.internet.cache.tests/1.0.100-SNAPSHOT/org.eclipse.wst.internet.cache.tests-1.0.100-SNAPSHOT.jar>
[INFO] Installing /jobs/genie.webtools/webtools-common_R3_10/workspace/tests/org.eclipse.wst.internet.cache.tests/pom.xml to <https://ci.eclipse.org/webtools/job/webtools-common_R3_10/ws/.repository/org/eclipse/webtools/common/org.eclipse.wst.internet.cache.tests/1.0.100-SNAPSHOT/org.eclipse.wst.internet.cache.tests-1.0.100-SNAPSHOT.pom>
[INFO] Installing /jobs/genie.webtools/webtools-common_R3_10/workspace/tests/org.eclipse.wst.internet.cache.tests/target/org.eclipse.wst.internet.cache.tests-1.0.100-SNAPSHOT-sources.jar to <https://ci.eclipse.org/webtools/job/webtools-common_R3_10/ws/.repository/org/eclipse/webtools/common/org.eclipse.wst.internet.cache.tests/1.0.100-SNAPSHOT/org.eclipse.wst.internet.cache.tests-1.0.100-SNAPSHOT-sources.jar>
[INFO] Installing /jobs/genie.webtools/webtools-common_R3_10/workspace/tests/org.eclipse.wst.internet.cache.tests/target/org.eclipse.wst.internet.cache.tests-1.0.100-SNAPSHOT.jar.pack.gz to <https://ci.eclipse.org/webtools/job/webtools-common_R3_10/ws/.repository/org/eclipse/webtools/common/org.eclipse.wst.internet.cache.tests/1.0.100-SNAPSHOT/org.eclipse.wst.internet.cache.tests-1.0.100-SNAPSHOT-pack200.jar.pack.gz>
[INFO] Installing /jobs/genie.webtools/webtools-common_R3_10/workspace/tests/org.eclipse.wst.internet.cache.tests/target/p2content.xml to <https://ci.eclipse.org/webtools/job/webtools-common_R3_10/ws/.repository/org/eclipse/webtools/common/org.eclipse.wst.internet.cache.tests/1.0.100-SNAPSHOT/org.eclipse.wst.internet.cache.tests-1.0.100-SNAPSHOT-p2metadata.xml>
[INFO] Installing /jobs/genie.webtools/webtools-common_R3_10/workspace/tests/org.eclipse.wst.internet.cache.tests/target/p2artifacts.xml to <https://ci.eclipse.org/webtools/job/webtools-common_R3_10/ws/.repository/org/eclipse/webtools/common/org.eclipse.wst.internet.cache.tests/1.0.100-SNAPSHOT/org.eclipse.wst.internet.cache.tests-1.0.100-SNAPSHOT-p2artifacts.xml>
[INFO]
[INFO] --- tycho-p2-plugin:1.1.0:update-local-index (default-update-local-index) @ org.eclipse.wst.internet.cache.tests ---
[INFO]
[INFO] ------------------------------------------------------------------------
[INFO] Building org.eclipse.wst.common_tests.feature 3.6.1-SNAPSHOT
[INFO] ------------------------------------------------------------------------
[INFO]
[INFO] --- maven-clean-plugin:2.5:clean (default-clean) @ org.eclipse.wst.common_tests.feature ---
[INFO]
[INFO] --- tycho-packaging-plugin:1.1.0:build-qualifier-aggregator (default-build-qualifier-aggregator) @ org.eclipse.wst.common_tests.feature ---
[INFO] The project's OSGi version is 3.6.1.v201711202234
[INFO]
[INFO] --- tycho-packaging-plugin:1.1.0:validate-id (default-validate-id) @ org.eclipse.wst.common_tests.feature ---
[INFO]
[INFO] --- tycho-packaging-plugin:1.1.0:validate-version (default-validate-version) @ org.eclipse.wst.common_tests.feature ---
[INFO]
[INFO] --- build-helper-maven-plugin:3.0.0:regex-property (regex-property) @ org.eclipse.wst.common_tests.feature ---
[INFO]
[INFO] --- tycho-source-plugin:1.1.0:plugin-source (plugin-source) @ org.eclipse.wst.common_tests.feature ---
[INFO]
[INFO] --- target-platform-configuration:1.1.0:target-platform (default-target-platform) @ org.eclipse.wst.common_tests.feature ---
[INFO]
[INFO] --- tycho-packaging-plugin:1.1.0:package-feature (default-package-feature) @ org.eclipse.wst.common_tests.feature ---
[INFO] Building jar: /jobs/genie.webtools/webtools-common_R3_10/workspace/features/org.eclipse.wst.common_tests.feature/target/org.eclipse.wst.common_tests.feature-3.6.1-SNAPSHOT.jar
[INFO]
[INFO] --- tycho-p2-plugin:1.1.0:p2-metadata-default (default-p2-metadata-default) @ org.eclipse.wst.common_tests.feature ---
[INFO]
[INFO] --- tycho-p2-plugin:1.1.0:feature-p2-metadata (default-feature-p2-metadata) @ org.eclipse.wst.common_tests.feature ---
[INFO]
[INFO] --- tycho-pack200a-plugin:1.1.0:normalize (pack200-normalize) @ org.eclipse.wst.common_tests.feature ---
[INFO]
[INFO] --- eclipse-jarsigner-plugin:1.1.4:sign (sign) @ org.eclipse.wst.common_tests.feature ---
[INFO] Signing jar: /jobs/genie.webtools/webtools-common_R3_10/workspace/features/org.eclipse.wst.common_tests.feature/target/org.eclipse.wst.common_tests.feature-3.6.1-SNAPSHOT.jar
[INFO]
[INFO] --- tycho-pack200b-plugin:1.1.0:pack (pack200-pack) @ org.eclipse.wst.common_tests.feature ---
[INFO]
[INFO] --- tycho-p2-plugin:1.1.0:p2-metadata (p2-metadata) @ org.eclipse.wst.common_tests.feature ---
[INFO] No baseline version MavenProject: org.eclipse.webtools.common:org.eclipse.wst.common_tests.feature:3.6.1-SNAPSHOT @ /jobs/genie.webtools/webtools-common_R3_10/workspace/features/org.eclipse.wst.common_tests.feature/pom.xml
[INFO]
[INFO] --- maven-install-plugin:2.3.1:install (default-install) @ org.eclipse.wst.common_tests.feature ---
[INFO] Installing /jobs/genie.webtools/webtools-common_R3_10/workspace/features/org.eclipse.wst.common_tests.feature/target/org.eclipse.wst.common_tests.feature-3.6.1-SNAPSHOT.jar to <https://ci.eclipse.org/webtools/job/webtools-common_R3_10/ws/.repository/org/eclipse/webtools/common/org.eclipse.wst.common_tests.feature/3.6.1-SNAPSHOT/org.eclipse.wst.common_tests.feature-3.6.1-SNAPSHOT.jar>
[INFO] Installing /jobs/genie.webtools/webtools-common_R3_10/workspace/features/org.eclipse.wst.common_tests.feature/pom.xml to <https://ci.eclipse.org/webtools/job/webtools-common_R3_10/ws/.repository/org/eclipse/webtools/common/org.eclipse.wst.common_tests.feature/3.6.1-SNAPSHOT/org.eclipse.wst.common_tests.feature-3.6.1-SNAPSHOT.pom>
[INFO] Installing /jobs/genie.webtools/webtools-common_R3_10/workspace/features/org.eclipse.wst.common_tests.feature/target/p2content.xml to <https://ci.eclipse.org/webtools/job/webtools-common_R3_10/ws/.repository/org/eclipse/webtools/common/org.eclipse.wst.common_tests.feature/3.6.1-SNAPSHOT/org.eclipse.wst.common_tests.feature-3.6.1-SNAPSHOT-p2metadata.xml>
[INFO] Installing /jobs/genie.webtools/webtools-common_R3_10/workspace/features/org.eclipse.wst.common_tests.feature/target/p2artifacts.xml to <https://ci.eclipse.org/webtools/job/webtools-common_R3_10/ws/.repository/org/eclipse/webtools/common/org.eclipse.wst.common_tests.feature/3.6.1-SNAPSHOT/org.eclipse.wst.common_tests.feature-3.6.1-SNAPSHOT-p2artifacts.xml>
[INFO]
[INFO] --- tycho-p2-plugin:1.1.0:update-local-index (default-update-local-index) @ org.eclipse.wst.common_tests.feature ---
[INFO]
[INFO] ------------------------------------------------------------------------
[INFO] Skipping org.eclipse.webtools.common.site
[INFO] This project has been banned from the build due to previous failures.
[INFO] ------------------------------------------------------------------------
[INFO] ------------------------------------------------------------------------
[INFO] Reactor Summary:
[INFO]
[INFO] org.eclipse.webtools.common ........................ SUCCESS [04:25 min]
[INFO] org.eclipse.webtools.common.docs ................... SUCCESS [  0.097 s]
[INFO] org.eclipse.wst.common.api.doc ..................... FAILURE [10:53 min]
[INFO] org.eclipse.wst.validation.doc.isv ................. SUCCESS [06:23 min]
[INFO] org.eclipse.wst.validation.infopop ................. SUCCESS [01:58 min]
[INFO] org.eclipse.webtools.common.features ............... SUCCESS [  0.605 s]
[INFO] org.eclipse.webtools.common.plugins ................ SUCCESS [  3.044 s]
[INFO] org.eclipse.wst.common.project.facet.core .......... SUCCESS [03:32 min]
[INFO] org.eclipse.jst.common.project.facet.core .......... SUCCESS [01:00 min]
[INFO] org.eclipse.wst.common.project.facet.ui ............ SUCCESS [ 31.128 s]
[INFO] org.eclipse.jst.common.project.facet.ui ............ SUCCESS [02:44 min]
[INFO] org.eclipse.jst.common.fproj.enablement.jdt ........ SUCCESS [ 13.898 s]
[INFO] org.eclipse.jst.common.fproj.enablement.jdt.sdk .... SUCCESS [ 53.606 s]
[INFO] org.eclipse.jst.common.fproj.enablement.jdt.sdk .... SUCCESS [  6.994 s]
[INFO] org.eclipse.wst.common.core ........................ SUCCESS [ 43.513 s]
[INFO] org.eclipse.jem.util ............................... SUCCESS [01:09 min]
[INFO] org.eclipse.wst.common.environment ................. SUCCESS [ 53.186 s]
[INFO] org.eclipse.wst.common.frameworks .................. SUCCESS [01:15 min]
[INFO] org.eclipse.wst.common.emf ......................... SUCCESS [01:39 min]
[INFO] org.eclipse.wst.validation ......................... SUCCESS [ 28.986 s]
[INFO] org.eclipse.wst.common.emfworkbench.integration .... SUCCESS [01:41 min]
[INFO] org.eclipse.wst.common.uriresolver ................. SUCCESS [ 44.593 s]
[INFO] org.eclipse.wst.common.modulecore .................. SUCCESS [01:55 min]
[INFO] org.eclipse.wst.common_core.feature ................ SUCCESS [ 24.889 s]
[INFO] org.eclipse.wst.common.fproj ....................... SUCCESS [  7.453 s]
[INFO] org.eclipse.wst.common.project.facet.doc.api ....... SUCCESS [ 37.330 s]
[INFO] org.eclipse.wst.common.fproj.sdk ................... SUCCESS [ 23.136 s]
[INFO] org.eclipse.wst.common.fproj.sdk ................... SUCCESS [ 19.517 s]
[INFO] org.eclipse.wst.common.frameworks.ui ............... SUCCESS [01:34 min]
[INFO] org.eclipse.wst.common.modulecore.ui ............... SUCCESS [01:05 min]
[INFO] org.eclipse.wst.common.snippets .................... SUCCESS [ 33.250 s]
[INFO] org.eclipse.wst.common.ui .......................... SUCCESS [02:08 min]
[INFO] org.eclipse.wst.common.infopop ..................... SUCCESS [  9.889 s]
[INFO] org.eclipse.wst.internet.cache ..................... SUCCESS [01:28 min]
[INFO] org.eclipse.wst.validation.ui ...................... SUCCESS [ 31.191 s]
[INFO] org.eclipse.wst.common_ui.feature .................. SUCCESS [ 14.664 s]
[INFO] org.eclipse.wst.common_sdk.feature ................. SKIPPED
[INFO] org.eclipse.webtools.common.tests .................. SUCCESS [  0.099 s]
[INFO] org.eclipse.wst.common.project.facet.core.tests .... SUCCESS [01:26 min]
[INFO] org.eclipse.wst.common.project.facet.ui.tests ...... SUCCESS [01:58 min]
[INFO] org.eclipse.wst.common.snippets.tests .............. SUCCESS [10:16 min]
[INFO] org.eclipse.wst.common.tests.collector ............. SUCCESS [ 20.489 s]
[INFO] org.eclipse.wst.common.uriresolver.tests ........... SUCCESS [ 34.080 s]
[INFO] org.eclipse.wst.common.tests ....................... SUCCESS [01:06 min]
[INFO] org.eclipse.wst.common.tests.ui .................... SUCCESS [ 10.574 s]
[INFO] org.eclipse.wst.common.tests.validation ............ SUCCESS [04:10 min]
[INFO] org.eclipse.wst.common.tests.validation.guard ...... SUCCESS [ 19.864 s]
[INFO] org.eclipse.wst.internet.cache.tests ............... SUCCESS [ 34.700 s]
[INFO] org.eclipse.wst.common_tests.feature ............... SUCCESS [  3.527 s]
[INFO] org.eclipse.webtools.common.site ................... SKIPPED
[INFO] ------------------------------------------------------------------------
[INFO] BUILD FAILURE
[INFO] ------------------------------------------------------------------------
[INFO] Total time: 01:29 h
[INFO] Finished at: 2018-02-06T13:18:47-05:00
[INFO] Final Memory: 132M/1803M
[INFO] ------------------------------------------------------------------------
[ERROR] Failed to execute goal org.eclipse.tycho.extras:tycho-pack200a-plugin:1.1.0:normalize (pack200-normalize) on project org.eclipse.wst.common.api.doc: Execution pack200-normalize of goal org.eclipse.tycho.extras:tycho-pack200a-plugin:1.1.0:normalize failed: Could not execute pack200, see log for details.: Error while executing external command, process killed. Process timeout out after 100 seconds -> [Help 1]
[ERROR]
[ERROR] To see the full stack trace of the errors, re-run Maven with the -e switch.
[ERROR] Re-run Maven using the -X switch to enable full debug logging.
[ERROR]
[ERROR] For more information about the errors and possible solutions, please read the following articles:
[ERROR] [Help 1] http://cwiki.apache.org/confluence/display/MAVEN/PluginExecutionException
[ERROR]
[ERROR] After correcting the problems, you can resume the build with the command
[ERROR]   mvn <goals> -rf :org.eclipse.wst.common.api.doc
Build step 'Invoke top-level Maven targets' marked build as failure
Taking screenshot.
[workspace] $ echo $XAUTHORITY
<https://ci.eclipse.org/webtools/job/webtools-common_R3_10/ws/.Xauthority-347051144990712457>
[workspace] $ ls -l $XAUTHORITY
-rw-rw-r-- 1 genie.webtools webtools 0 Feb  6 11:48 <https://ci.eclipse.org/webtools/job/webtools-common_R3_10/ws/.Xauthority-347051144990712457>
[workspace] $ import -window root -display :458 screenshot.jpg
Build timed out (after 90 minutes). Marking the build as aborted.
java.lang.InterruptedException
        at java.lang.Object.wait(Native Method)
        at java.lang.Object.wait(Object.java:502)
        at java.lang.UNIXProcess.waitFor(UNIXProcess.java:395)
        at hudson.Proc$LocalProc.join(Proc.java:324)
        at hudson.Launcher$ProcStarter.join(Launcher.java:475)
        at hudson.plugins.xvnc.Xvnc$DisposerImpl.tearDown(Xvnc.java:224)
        at jenkins.tasks.SimpleBuildWrapper$EnvironmentWrapper.tearDown(SimpleBuildWrapper.java:175)
        at hudson.model.Build$BuildExecution.doRun(Build.java:174)
        at hudson.model.AbstractBuild$AbstractBuildExecution.run(AbstractBuild.java:504)
        at hudson.model.Run.execute(Run.java:1724)
        at hudson.model.FreeStyleBuild.run(FreeStyleBuild.java:43)
        at hudson.model.ResourceController.execute(ResourceController.java:97)
        at hudson.model.Executor.run(Executor.java:421)
Terminating xvnc.
_______________________________________________
wtp-releng mailing list
[hidden email]
To change your delivery options, retrieve your password, or unsubscribe from this list, visit
https://dev.eclipse.org/mailman/listinfo/wtp-releng
Reply | Threaded
Open this post in threaded view
|

Jenkins build is back to normal : webtools-common_R3_10 #43

hudsonbuild
See <https://ci.eclipse.org/webtools/job/webtools-common_R3_10/43/display/redirect>

_______________________________________________
wtp-releng mailing list
[hidden email]
To change your delivery options, retrieve your password, or unsubscribe from this list, visit
https://dev.eclipse.org/mailman/listinfo/wtp-releng