[Hudson] Build failed in Hudson: WTP-R3_10_Integration #234

classic Classic list List threaded Threaded
11 messages Options
Reply | Threaded
Open this post in threaded view
|

[Hudson] Build failed in Hudson: WTP-R3_10_Integration #234

hudsonbuild
See <https://hudson.eclipse.org/webtools/job/WTP-R3_10_Integration/234/>

------------------------------------------
[...truncated 413792 lines...]
[INFO] org.eclipse.wst.webtools.doc.user .................. SUCCESS [  6.730 s]
[INFO] org.eclipse.wst.web_userdoc.feature ................ SUCCESS [  3.021 s]
[INFO] org.eclipse.wst.html.ui.infopop .................... SUCCESS [  5.454 s]
[INFO] org.eclipse.wst.web.ui.infopop ..................... SUCCESS [  3.746 s]
[INFO] org.eclipse.wst.web_ui.feature ..................... SUCCESS [  7.078 s]
[INFO] org.eclipse.wst.web_sdk.feature .................... SUCCESS [  4.952 s]
[INFO] sourceediting.xpath ................................ SUCCESS [  0.115 s]
[INFO] sourceediting.xpath.bundles ........................ SUCCESS [  0.104 s]
[INFO] PsychoPath XPath 2.0 Processor ..................... SUCCESS [ 26.885 s]
[INFO] org.eclipse.wst.xml.xpath.core ..................... SUCCESS [  8.762 s]
[INFO] PsychoPath XPath 2.0 Processor ..................... SUCCESS [  9.839 s]
[INFO] org.eclipse.wst.xml.xpath.ui ....................... SUCCESS [  5.344 s]
[INFO] sourceediting.xpath.docs ........................... SUCCESS [  0.086 s]
[INFO] PsychoPath XPath 2.0 Processor: User Documentation . SUCCESS [  5.719 s]
[INFO] PsychoPath XPath 2.0 Processor: Branding Plug-in ... SUCCESS [  6.561 s]
[INFO] sourceediting.xpath.features ....................... SUCCESS [  0.091 s]
[INFO] PsychoPath XPath 2.0 Processor Feature ............. SUCCESS [  5.072 s]
[INFO] sourceediting.xsl .................................. SUCCESS [  0.131 s]
[INFO] sourceediting.xsl.bundles .......................... SUCCESS [  0.108 s]
[INFO] XSLT Core Plugin ................................... SUCCESS [  6.968 s]
[INFO] XSLT Launching Plugin .............................. SUCCESS [  5.924 s]
[INFO] XSLT Debug UI Plugin ............................... SUCCESS [  6.127 s]
[INFO] sourceediting.xsl.docs ............................. SUCCESS [  0.090 s]
[INFO] org.eclipse.wst.xsl.doc ............................ SUCCESS [  5.057 s]
[INFO] XSLT EXSLT Core Plugin ............................. SUCCESS [  5.289 s]
[INFO] XSLT UI Plugin ..................................... SUCCESS [  8.538 s]
[INFO] XSLT EXSLT UI Plugin ............................... SUCCESS [  3.461 s]
[INFO] XSLT JAXP Debug Plugin ............................. SUCCESS [  3.556 s]
[INFO] XSLT Xalan Plugin .................................. SUCCESS [  4.611 s]
[INFO] XSLT Saxon Plugin .................................. SUCCESS [  3.999 s]
[INFO] XSL Tools Branding Plugin .......................... SUCCESS [  5.201 s]
[INFO] XSLT JAXP Launching UI Plugin ...................... SUCCESS [ 11.791 s]
[INFO] XSLT JAXP Debug UI Plugin .......................... SUCCESS [  5.467 s]
[INFO] sourceediting.xsl.features ......................... SUCCESS [  0.096 s]
[INFO] XSLT FeaturePlugin ................................. SUCCESS [  5.628 s]
[INFO] org.eclipse.wst.xsl.sdk.documentation .............. SUCCESS [  8.558 s]
[INFO] org.eclipse.wst.xsl_sdk.feature .................... SUCCESS [  2.569 s]
[INFO] org.eclipse.wst.server.http.core ................... SUCCESS [  4.248 s]
[INFO] org.eclipse.wst.server.http.ui ..................... SUCCESS [  4.692 s]
[INFO] org.eclipse.wst.server.preview ..................... SUCCESS [  3.398 s]
[INFO] org.eclipse.wst.server.preview.adapter ............. SUCCESS [  5.438 s]
[INFO] org.eclipse.wst.server_adapters.feature ............ SUCCESS [ 20.271 s]
[INFO] org.eclipse.wst.server_adapters.sdk.feature ........ SUCCESS [  1.473 s]
[INFO] org.eclipse.wst.sdk ................................ SUCCESS [  3.380 s]
[INFO] org.eclipse.wst.common.project.facet.core.tests .... SUCCESS [  3.936 s]
[INFO] org.eclipse.wst.common.project.facet.ui.tests ...... SUCCESS [  8.070 s]
[INFO] org.eclipse.wst.common.snippets.tests .............. SUCCESS [  4.131 s]
[INFO] org.eclipse.wst.common.tests.ui .................... SUCCESS [  4.331 s]
[INFO] org.eclipse.wst.common.tests.validation ............ SUCCESS [  4.239 s]
[INFO] org.eclipse.wst.common.tests.validation.guard ...... SUCCESS [  2.542 s]
[INFO] org.eclipse.wst.internet.cache.tests ............... SUCCESS [  4.651 s]
[INFO] org.eclipse.wst.common_tests.feature ............... SUCCESS [  1.274 s]
[INFO] org.eclipse.wst.css.core.tests ..................... SUCCESS [ 12.589 s]
[INFO] org.eclipse.wst.css.tests.encoding ................. SUCCESS [  3.771 s]
[INFO] org.eclipse.wst.css.ui.tests ....................... SUCCESS [  3.822 s]
[INFO] org.eclipse.wst.dtd.core.tests ..................... SUCCESS [  3.010 s]
[INFO] org.eclipse.wst.dtd.ui.tests ....................... SUCCESS [  3.161 s]
[INFO] org.eclipse.wst.html.core.tests .................... SUCCESS [  4.623 s]
[INFO] org.eclipse.wst.html.tests.encoding ................ SUCCESS [  7.091 s]
[INFO] org.eclipse.wst.html.ui.tests ...................... SUCCESS [  3.608 s]
[INFO] org.eclipse.wst.internet.monitor.core.tests ........ SUCCESS [  5.217 s]
[INFO] org.eclipse.wst.internet.monitor.ui.tests .......... SUCCESS [  3.186 s]
[INFO] tests .............................................. SUCCESS [  0.053 s]
[INFO] org.eclipse.wst.jsdt.core.tests.compiler ........... SUCCESS [  8.200 s]
[INFO] org.eclipse.wst.jsdt.core.tests.model .............. SUCCESS [ 35.855 s]
[INFO] org.eclipse.wst.jsdt.debug.core.tests .............. SUCCESS [  6.186 s]
[INFO] org.eclipse.wst.jsdt.debug.rhino.tests ............. SUCCESS [  4.020 s]
[INFO] org.eclipse.wst.jsdt.js.node.common.tests .......... SUCCESS [  3.034 s]
[INFO] org.eclipse.wst.jsdt.ui.tests ...................... SUCCESS [  5.877 s]
[INFO] org.eclipse.wst.jsdt.web.core.tests ................ SUCCESS [  3.343 s]
[INFO] org.eclipse.wst.jsdt.web.ui.tests .................. SUCCESS [  5.640 s]
[INFO] org.eclipse.wst.jsdt_tests.feature ................. SUCCESS [  1.073 s]
[INFO] org.eclipse.wst.server_tests.feature ............... SUCCESS [  1.029 s]
[INFO] sourceediting.core.tests ........................... SUCCESS [  0.040 s]
[INFO] org.eclipse.wst.sse.core.tests ..................... SUCCESS [  3.825 s]
[INFO] org.eclipse.wst.sse.ui.tests ....................... SUCCESS [  5.018 s]
[INFO] org.eclipse.wtp.releng.fixups ...................... SUCCESS [  3.318 s]
[INFO] org.eclipse.wtp.releng.fixups.feature .............. SUCCESS [  1.513 s]
[INFO] org.eclipse.wtp.releng.tests ....................... SUCCESS [  4.806 s]
[INFO] org.eclipse.wtp.releng.tools ....................... SUCCESS [  4.118 s]
[INFO] org.eclipse.wtp.releng.tools.feature ............... SUCCESS [  1.085 s]
[INFO] org.eclipse.wtp.releng.tests.feature ............... SUCCESS [  2.208 s]
[INFO] org.eclipse.wst.xml.catalog.tests .................. SUCCESS [  4.870 s]
[INFO] org.eclipse.wst.xml.core.tests ..................... SUCCESS [  7.020 s]
[INFO] org.eclipse.wst.xml.ui.tests ....................... SUCCESS [  4.604 s]
[INFO] org.eclipse.wst.xml.validation.tests ............... SUCCESS [  3.928 s]
[INFO] org.eclipse.wst.xsd.validation.tests ............... SUCCESS [  3.889 s]
[INFO] org.eclipse.wst.xsd.core.tests ..................... SUCCESS [  3.023 s]
[INFO] org.eclipse.wst.xsd.ui.tests ....................... SUCCESS [  5.929 s]
[INFO] org.eclipse.wst.xml_tests.feature .................. SUCCESS [  1.369 s]
[INFO] sourceediting.xpath.tests .......................... SUCCESS [  0.097 s]
[INFO] org.eclipse.wst.xml.xpath.core.tests ............... SUCCESS [  4.710 s]
[INFO] org.eclipse.wst.xml.xpath.ui.tests ................. SUCCESS [  8.984 s]
[INFO] PsychoPath XPath 2.0 Processor: XQuery Test Suite .. FAILURE [03:09 min]
[INFO] PsychoPath XPath 2.0 Processor: Tests .............. SKIPPED
[INFO] sourceediting.xsl.tests ............................ SKIPPED
[INFO] XSLT Core Tests .................................... SKIPPED
[INFO] EXSLT Core Tests ................................... SKIPPED
[INFO] XSLT UI Tests ...................................... SKIPPED
[INFO] EXSLT UI Tests ..................................... SKIPPED
[INFO] JAXP Debug Tests ................................... SKIPPED
[INFO] XSL Launching Tests ................................ SKIPPED
[INFO] org.eclipse.wst.xsl.tests .......................... SKIPPED
[INFO] org.eclipse.wst.xsl_tests.feature .................. SKIPPED
[INFO] org.eclipse.wst.web_tests.feature .................. SKIPPED
[INFO] org.eclipse.wst.tests.feature ...................... SKIPPED
[INFO] org.eclipse.wtp.requiredpreques .................... SKIPPED
[INFO] org.eclipse.wtp.xml.dev ............................ SKIPPED
[INFO] org.eclipse.wtp.xml.dev.assembly.feature ........... SKIPPED
[INFO] org.uddi4j.feature ................................. SKIPPED
[INFO] org.eclipse.jst .................................... SKIPPED
[INFO] org.eclipse.wst .................................... SKIPPED
[INFO] org.eclipse.wst.doc.isv.feature .................... SKIPPED
[INFO] org.eclipse.wst.doc.user.feature ................... SKIPPED
[INFO] org.eclipse.wtp.epp.package.jee.intro .............. SKIPPED
[INFO] org.eclipse.wtp.epp.package.capabilities ........... SKIPPED
[INFO] org.eclipse.wtp.javascript.capabilities ............ SKIPPED
[INFO] org.eclipse.wtp.jee.capabilities ................... SKIPPED
[INFO] org.eclipse.wtp.web.capabilities ................... SKIPPED
[INFO] org.eclipse.wtp.xml.capabilities ................... SKIPPED
[INFO] org.eclipse.wtp.capabilities.feature ............... SKIPPED
[INFO] org.eclipse.wtp.capabilities ....................... SKIPPED
[INFO] org.eclipse.wtp.feature.branding.template .......... SKIPPED
[INFO] org.eclipse.wtp.jee ................................ SKIPPED
[INFO] repositories ....................................... SKIPPED
[INFO] org.eclipse.webtools.dali .......................... SKIPPED
[INFO] org.eclipse.jpt.common.utility ..................... SKIPPED
[INFO] org.eclipse.jpt.common.core ........................ SKIPPED
[INFO] org.eclipse.jpt.common.eclipselink.core ............ SKIPPED
[INFO] org.eclipse.jpt.common.ui .......................... SKIPPED
[INFO] org.eclipse.jpt.common.branding .................... SKIPPED
[INFO] org.eclipse.jpt.common.feature ..................... SKIPPED
[INFO] org.eclipse.jpt.common.eclipselink.branding ........ SKIPPED
[INFO] org.eclipse.jpt.common.eclipselink.feature ......... SKIPPED
[INFO] org.eclipse.jpt.common.eclipselink_sdk.feature ..... SKIPPED
[INFO] org.eclipse.jpt.common_sdk.feature ................. SKIPPED
[INFO] org.eclipse.jpt.dbws.eclipselink.core.gen .......... SKIPPED
[INFO] org.eclipse.jpt.dbws.eclipselink.ui ................ SKIPPED
[INFO] org.eclipse.jpt.dbws.eclipselink.branding .......... SKIPPED
[INFO] org.eclipse.jpt.dbws.eclipselink.feature ........... SKIPPED
[INFO] org.eclipse.jpt.dbws.eclipselink_sdk.feature ....... SKIPPED
[INFO] org.eclipse.jpt.jaxb.core .......................... SKIPPED
[INFO] org.eclipse.jpt.jaxb.core.schemagen ................ SKIPPED
[INFO] org.eclipse.jpt.jaxb.eclipselink.core .............. SKIPPED
[INFO] org.eclipse.jpt.jaxb.eclipselink.core.schemagen .... SKIPPED
[INFO] org.eclipse.jpt.jaxb.ui ............................ SKIPPED
[INFO] org.eclipse.jpt.jaxb.branding ...................... SKIPPED
[INFO] org.eclipse.jpt.jaxb.feature ....................... SKIPPED
[INFO] org.eclipse.jpt.jaxb.eclipselink.ui ................ SKIPPED
[INFO] org.eclipse.jpt.jaxb.eclipselink.branding .......... SKIPPED
[INFO] org.eclipse.jpt.jaxb.eclipselink.feature ........... SKIPPED
[INFO] org.eclipse.jpt.jaxb.eclipselink_sdk.feature ....... SKIPPED
[INFO] org.eclipse.jpt.jaxb_sdk.feature ................... SKIPPED
[INFO] org.eclipse.jpt.jpa.db ............................. SKIPPED
[INFO] org.eclipse.jpt.jpa.core ........................... SKIPPED
[INFO] org.eclipse.jpt.jpa.annotate ....................... SKIPPED
[INFO] org.eclipse.jpt.jpa.db.ui .......................... SKIPPED
[INFO] org.eclipse.jpt.jpa.eclipselink.core ............... SKIPPED
[INFO] org.eclipse.jpt.jpa.eclipselink.core.ddlgen ........ SKIPPED
[INFO] org.eclipse.jpt.jpa.gen ............................ SKIPPED
[INFO] org.eclipse.jpt.jpa.ui ............................. SKIPPED
[INFO] org.eclipse.jpt.doc.user ........................... SKIPPED
[INFO] org.eclipse.jpt.jpa.branding ....................... SKIPPED
[INFO] org.eclipse.jpt.jpa.feature ........................ SKIPPED
[INFO] org.eclipse.jpt.jpa.eclipselink.ui ................. SKIPPED
[INFO] org.eclipse.jpt.jpa.eclipselink.branding ........... SKIPPED
[INFO] org.eclipse.jpt.jpa.eclipselink.feature ............ SKIPPED
[INFO] org.eclipse.jpt.jpa.eclipselink_sdk.feature ........ SKIPPED
[INFO] org.eclipse.jpt.doc.isv ............................ SKIPPED
[INFO] org.eclipse.jpt.jpa_sdk.feature .................... SKIPPED
[INFO] JPA Diagram Editor Branding Plug-in ................ SKIPPED
[INFO] JPA Diagram Editor Plug-in ......................... SKIPPED
[INFO] JPA Diagram Editor Branding Plug-in ................ SKIPPED
[INFO] JPA Diagram Editor Feature ......................... SKIPPED
[INFO] org.eclipse.jpt.jpadiagrameditor_sdk.feature ....... SKIPPED
[INFO] dali4x-sdk ......................................... SKIPPED
[INFO] org.eclipse.jpt.common.utility.tests ............... SKIPPED
[INFO] org.eclipse.jpt.common.core.tests .................. SKIPPED
[INFO] org.eclipse.jpt.common.tests.feature ............... SKIPPED
[INFO] org.eclipse.jpt.jpa.core.tests.extension.resource .. SKIPPED
[INFO] org.eclipse.jpt.jpa.tests.feature .................. SKIPPED
[INFO] org.eclipse.jpt.jaxb.eclipselink.tests.feature ..... SKIPPED
[INFO] org.eclipse.jpt.jaxb.tests.feature ................. SKIPPED
[INFO] JPA Diagram Editor Test Plug-in .................... SKIPPED
[INFO] org.eclipse.jpt.jpadiagrameditor.tests.feature ..... SKIPPED
[INFO] dali4x.tests ....................................... SKIPPED
[INFO] jst4x-sdk .......................................... SKIPPED
[INFO] jst4x.tests ........................................ SKIPPED
[INFO] org.eclipse.wst.jsdt.chromium_sdk.feature .......... SKIPPED
[INFO] wst4x-sdk .......................................... SKIPPED
[INFO] org.eclipse.wst.jsdt.chromium.debug.core.tests ..... SKIPPED
[INFO] org.eclipse.wst.jsdt.chromium.tests ................ SKIPPED
[INFO] org.eclipse.wst.jsdt.chromium_tests.feature ........ SKIPPED
[INFO] sourceediting.json.tests ........................... SKIPPED
[INFO] org.eclipse.wst.json.core.tests .................... SKIPPED
[INFO] org.eclipse.wst.json_tests.feature ................. SKIPPED
[INFO] wst4x.tests ........................................ SKIPPED
[INFO] repository ......................................... SKIPPED
[INFO] repositoryunittests ................................ SKIPPED
[INFO] org.eclipse.webtools.common.site ................... SKIPPED
[INFO] org.eclipse.servertools.doc.isv .................... SKIPPED
[INFO] org.eclipse.wst.server.http.core.tests ............. SKIPPED
[INFO] org.eclipse.wst.server.util.tests .................. SKIPPED
[INFO] org.eclipse.webtools.servertools.site .............. SKIPPED
[INFO] org.eclipse.wst.server_sdk.feature ................. SKIPPED
[INFO] org.eclipse.wst.jsdt.js.common.tests ............... SKIPPED
[INFO] org.eclipse.wst.jsdt.integration.tests ............. SKIPPED
[INFO] org.eclipse.webtools.jsdt.site ..................... SKIPPED
[INFO] PsychoPath XPath 2.0 Processor: SDK Documentation .. SKIPPED
[INFO] PsychoPath XPath 2.0 Processor: SDK Feature ........ SKIPPED
[INFO] PsychoPath XPath 2.0 Processor: Tests for WTP type support SKIPPED
[INFO] org.eclipse.webtools.sourceediting.site ............ SKIPPED
[INFO] org.eclipse.jst.doc.user.feature ................... SKIPPED
[INFO] org.eclipse.webtools.javaee.site ................... SKIPPED
[INFO] org.eclipse.jpt.assembly.feature ................... SKIPPED
[INFO] org.eclipse.jpt_sdk.assembly.feature ............... SKIPPED
[INFO] org.eclipse.jpt.tests.assembly.feature ............. SKIPPED
[INFO] JPA Editor Update Site ............................. SKIPPED
[INFO] org.eclipse.webtools.dali.site ..................... SKIPPED
[INFO] org.eclipse.jsf.assembly.feature ................... SKIPPED
[INFO] org.eclipse.jst.jsf.doc.feature .................... SKIPPED
[INFO] org.eclipse.webtools.jsf.site ...................... SKIPPED
[INFO] org.eclipse.webtools.webservices.site .............. SKIPPED
[INFO] org.eclipse.jst.ws.jaxws.assembly.feature .......... SKIPPED
[INFO] wtp-aggregator ..................................... SKIPPED
[INFO] ------------------------------------------------------------------------
[INFO] BUILD FAILURE
[INFO] ------------------------------------------------------------------------
[INFO] Total time: 02:24 h
[INFO] Finished at: 2018-01-26T03:03:27-05:00
[INFO] Final Memory: 1358M/7268M
[INFO] ------------------------------------------------------------------------
[INFO] o.h.m.e.h.MavenExecutionResultHandler - Build failed with exception(s)
[INFO] o.h.m.e.h.MavenExecutionResultHandler - [1] org.apache.maven.lifecycle.LifecycleExecutionException: Failed to execute goal org.eclipse.tycho.extras:tycho-pack200a-plugin:1.0.0:normalize (pack200-normalize) on project org.w3c.xqts.testsuite: Execution pack200-normalize of goal org.eclipse.tycho.extras:tycho-pack200a-plugin:1.0.0:normalize failed: Could not execute pack200, see log for details.
[DEBUG] Closing connection to remote
[ERROR] Failed to execute goal org.eclipse.tycho.extras:tycho-pack200a-plugin:1.0.0:normalize (pack200-normalize) on project org.w3c.xqts.testsuite: Execution pack200-normalize of goal org.eclipse.tycho.extras:tycho-pack200a-plugin:1.0.0:normalize failed: Could not execute pack200, see log for details. Error while executing external command, process killed. Process timeout out after 100 seconds -> [Help 1]
[ERROR]
[ERROR] To see the full stack trace of the errors, re-run Maven with the -e switch.
[ERROR] Re-run Maven using the -X switch to enable full debug logging.
[ERROR]
[ERROR] For more information about the errors and possible solutions, please read the following articles:
[ERROR] [Help 1] http://cwiki.apache.org/confluence/display/MAVEN/PluginExecutionException
[ERROR]
[ERROR] After correcting the problems, you can resume the build with the command
[ERROR]   mvn <goals> -rf :org.w3c.xqts.testsuite
[DEBUG] Waiting for process to finish
[DEBUG] Result: 1
Terminating xvnc.
Archiving artifacts

--
This message is automatically generated by Hudson.
For more information on Hudson, see: http://hudson-ci.org/
_______________________________________________
wtp-releng mailing list
[hidden email]
To change your delivery options, retrieve your password, or unsubscribe from this list, visit
https://dev.eclipse.org/mailman/listinfo/wtp-releng
Reply | Threaded
Open this post in threaded view
|

[Hudson] Build failed in Hudson: WTP-R3_10_Integration #235

hudsonbuild
See <https://hudson.eclipse.org/webtools/job/WTP-R3_10_Integration/235/>

------------------------------------------
Started by user [hidden email]
Cleaning the workspace because project is configured to clean the workspace before each build.
Checkout:workspace / <https://hudson.eclipse.org/webtools/job/WTP-R3_10_Integration/ws/> - hudson.remoting.LocalChannel@70d62f5f
Using strategy: Default
Git Exe: git
Last Built Revision: Revision cde1bcae388dea3ae70d678605e2eba2ea97f214 (origin/master)
Checkout:workspace / <https://hudson.eclipse.org/webtools/job/WTP-R3_10_Integration/ws/> - hudson.remoting.LocalChannel@70d62f5f
Wiping out workspace first.
Cloning the remote Git repository
Cloning repository origin
Fetching upstream changes from git://git.eclipse.org/gitroot/webtools/webtools.releng.aggregator.git
Commencing build of Revision 0bc38dfa906da8b385e24123ef8f6d368bf5a797 (origin/master)
Checking out Revision 0bc38dfa906da8b385e24123ef8f6d368bf5a797 (origin/master)
The origin is non-bare.
Trying to fetch webtools.common into <https://hudson.eclipse.org/webtools/job/WTP-R3_10_Integration/ws/webtools.common>
Fetching upstream changes from git://git.eclipse.org/gitroot/webtools-common/webtools.common
Trying to fetch webtools.dali into <https://hudson.eclipse.org/webtools/job/WTP-R3_10_Integration/ws/webtools.dali>
Fetching upstream changes from git://git.eclipse.org/gitroot/dali/webtools.dali
Trying to fetch webtools.javaee into <https://hudson.eclipse.org/webtools/job/WTP-R3_10_Integration/ws/webtools.javaee>
Fetching upstream changes from git://git.eclipse.org/gitroot/jeetools/webtools.javaee
Trying to fetch webtools.jsdt into <https://hudson.eclipse.org/webtools/job/WTP-R3_10_Integration/ws/webtools.jsdt>
Fetching upstream changes from git://git.eclipse.org/gitroot/jsdt/webtools.jsdt
Trying to fetch webtools.jsf into <https://hudson.eclipse.org/webtools/job/WTP-R3_10_Integration/ws/webtools.jsf>
Fetching upstream changes from git://git.eclipse.org/gitroot/jsf/webtools.jsf
Trying to fetch webtools.releng into <https://hudson.eclipse.org/webtools/job/WTP-R3_10_Integration/ws/webtools.releng>
Fetching upstream changes from git://git.eclipse.org/gitroot/webtools/webtools.releng
Trying to fetch webtools.servertools into <https://hudson.eclipse.org/webtools/job/WTP-R3_10_Integration/ws/webtools.servertools>
Fetching upstream changes from git://git.eclipse.org/gitroot/servertools/webtools.servertools
Trying to fetch webtools.sourceediting into <https://hudson.eclipse.org/webtools/job/WTP-R3_10_Integration/ws/webtools.sourceediting>
Fetching upstream changes from git://git.eclipse.org/gitroot/sourceediting/webtools.sourceediting
Trying to fetch webtools.webservices into <https://hudson.eclipse.org/webtools/job/WTP-R3_10_Integration/ws/webtools.webservices>
Fetching upstream changes from git://git.eclipse.org/gitroot/webservices/webtools.webservices
Trying to fetch webtools.webservices.axis2 into <https://hudson.eclipse.org/webtools/job/WTP-R3_10_Integration/ws/webtools.webservices.axis2>
Fetching upstream changes from git://git.eclipse.org/gitroot/webservices/webtools.webservices.axis2
Trying to fetch webtools.webservices.jaxws into <https://hudson.eclipse.org/webtools/job/WTP-R3_10_Integration/ws/webtools.webservices.jaxws>
Fetching upstream changes from git://git.eclipse.org/gitroot/webservices/webtools.webservices.jaxws
The origin is non-bare.
FATAL: Error performing command: git submodule update
null
hudson.plugins.git.GitException: Error performing command: git submodule update
null
        at hudson.plugins.git.GitAPI.launchCommandIn(GitAPI.java:831)
        at hudson.plugins.git.GitAPI.launchCommand(GitAPI.java:793)
        at hudson.plugins.git.GitAPI.submoduleUpdate(GitAPI.java:450)
        at hudson.plugins.git.GitSCM$1.invoke(GitSCM.java:896)
        at hudson.plugins.git.GitSCM$1.invoke(GitSCM.java:856)
        at hudson.FilePath.act(FilePath.java:793)
        at hudson.FilePath.act(FilePath.java:775)
        at hudson.plugins.git.GitSCM.getBuildConfig(GitSCM.java:856)
        at hudson.plugins.git.GitSCM.checkout(GitSCM.java:817)
        at hudson.model.AbstractProject.checkout(AbstractProject.java:1550)
        at hudson.model.AbstractBuild$AbstractRunner.checkout(AbstractBuild.java:607)
        at hudson.model.AbstractBuild$AbstractRunner.run(AbstractBuild.java:518)
        at hudson.model.Run.run(Run.java:1493)
        at hudson.model.FreeStyleBuild.run(FreeStyleBuild.java:44)
        at hudson.model.ResourceController.execute(ResourceController.java:82)
        at hudson.model.Executor.run(Executor.java:137)
Caused by: java.lang.InterruptedException
        at java.lang.Object.wait(Native Method)
        at java.lang.Object.wait(Object.java:503)
        at java.lang.UNIXProcess.waitFor(UNIXProcess.java:264)
        at hudson.Proc$LocalProc.join(Proc.java:222)
        at hudson.Launcher$ProcStarter.join(Launcher.java:273)
        at hudson.plugins.git.GitAPI.launchCommandIn(GitAPI.java:818)
        ... 15 more

--
This message is automatically generated by Hudson.
For more information on Hudson, see: http://hudson-ci.org/
_______________________________________________
wtp-releng mailing list
[hidden email]
To change your delivery options, retrieve your password, or unsubscribe from this list, visit
https://dev.eclipse.org/mailman/listinfo/wtp-releng
Reply | Threaded
Open this post in threaded view
|

[Hudson] Build failed in Hudson: WTP-R3_10_Integration #236

hudsonbuild
See <https://hudson.eclipse.org/webtools/job/WTP-R3_10_Integration/236/>

------------------------------------------
Started by user [hidden email]
Cleaning the workspace because project is configured to clean the workspace before each build.
Checkout:workspace / <https://hudson.eclipse.org/webtools/job/WTP-R3_10_Integration/ws/> - hudson.remoting.LocalChannel@70d62f5f
Using strategy: Default
Git Exe: git
Last Built Revision: Revision cde1bcae388dea3ae70d678605e2eba2ea97f214 (origin/master)
Checkout:workspace / <https://hudson.eclipse.org/webtools/job/WTP-R3_10_Integration/ws/> - hudson.remoting.LocalChannel@70d62f5f
Wiping out workspace first.
Cloning the remote Git repository
Cloning repository origin
Fetching upstream changes from git://git.eclipse.org/gitroot/webtools/webtools.releng.aggregator.git
Commencing build of Revision 4da71a1736f749c62b19f278e462a07fce3401cb (origin/master)
Checking out Revision 4da71a1736f749c62b19f278e462a07fce3401cb (origin/master)
The origin is non-bare.
Trying to fetch webtools.common into <https://hudson.eclipse.org/webtools/job/WTP-R3_10_Integration/ws/webtools.common>
Fetching upstream changes from git://git.eclipse.org/gitroot/webtools-common/webtools.common
Trying to fetch webtools.dali into <https://hudson.eclipse.org/webtools/job/WTP-R3_10_Integration/ws/webtools.dali>
Fetching upstream changes from git://git.eclipse.org/gitroot/dali/webtools.dali
Trying to fetch webtools.javaee into <https://hudson.eclipse.org/webtools/job/WTP-R3_10_Integration/ws/webtools.javaee>
Fetching upstream changes from git://git.eclipse.org/gitroot/jeetools/webtools.javaee
Trying to fetch webtools.jsdt into <https://hudson.eclipse.org/webtools/job/WTP-R3_10_Integration/ws/webtools.jsdt>
Fetching upstream changes from git://git.eclipse.org/gitroot/jsdt/webtools.jsdt
Trying to fetch webtools.jsf into <https://hudson.eclipse.org/webtools/job/WTP-R3_10_Integration/ws/webtools.jsf>
Fetching upstream changes from git://git.eclipse.org/gitroot/jsf/webtools.jsf
Trying to fetch webtools.releng into <https://hudson.eclipse.org/webtools/job/WTP-R3_10_Integration/ws/webtools.releng>
Fetching upstream changes from git://git.eclipse.org/gitroot/webtools/webtools.releng
Trying to fetch webtools.servertools into <https://hudson.eclipse.org/webtools/job/WTP-R3_10_Integration/ws/webtools.servertools>
Fetching upstream changes from git://git.eclipse.org/gitroot/servertools/webtools.servertools
Trying to fetch webtools.sourceediting into <https://hudson.eclipse.org/webtools/job/WTP-R3_10_Integration/ws/webtools.sourceediting>
Fetching upstream changes from git://git.eclipse.org/gitroot/sourceediting/webtools.sourceediting
Trying to fetch webtools.webservices into <https://hudson.eclipse.org/webtools/job/WTP-R3_10_Integration/ws/webtools.webservices>
Fetching upstream changes from git://git.eclipse.org/gitroot/webservices/webtools.webservices
Trying to fetch webtools.webservices.axis2 into <https://hudson.eclipse.org/webtools/job/WTP-R3_10_Integration/ws/webtools.webservices.axis2>
Fetching upstream changes from git://git.eclipse.org/gitroot/webservices/webtools.webservices.axis2
Trying to fetch webtools.webservices.jaxws into <https://hudson.eclipse.org/webtools/job/WTP-R3_10_Integration/ws/webtools.webservices.jaxws>
Fetching upstream changes from git://git.eclipse.org/gitroot/webservices/webtools.webservices.jaxws
The origin is non-bare.
FATAL: Error performing command: git submodule update
Command "git submodule update" returned status code 1: Cloning into 'webtools.common'...
Submodule path 'webtools.common': checked out 'b185b741e71451a93638c57e47615da3693b5696'
Cloning into 'webtools.dali'...
Submodule path 'webtools.dali': checked out '51fe2e9e217c5dbc19a51d8d0f2168e87e731462'
Cloning into 'webtools.javaee'...
Submodule path 'webtools.javaee': checked out '4e7cbc9358c4a9900b41a5f96d191c6478cb3c4d'
Cloning into 'webtools.jsdt'...
Submodule path 'webtools.jsdt': checked out 'd905e75a64925461bbbd2a41d2e8e53ff2f88916'
Cloning into 'webtools.jsf'...
Submodule path 'webtools.jsf': checked out '490184c2fccf601aed83446ef34ba5f1776e8874'
Cloning into 'webtools.releng'...
Submodule path 'webtools.releng': checked out '4982c8a2654013d7d27abec659e8d77c033c0a89'
Cloning into 'webtools.servertools'...
Submodule path 'webtools.servertools': checked out '112f125d6d0b3f1926ea3760d74c2ef882cd8d51'
Cloning into 'webtools.sourceediting'...
fatal: reference is not a tree: a6b967229d72e337a16e85d20ee26b2ba712fe34
Cloning into 'webtools.webservices'...
Submodule path 'webtools.webservices': checked out '7a3a099fd4f1bfa9e4b8f2476ddacf0e50f773a7'
Cloning into 'webtools.webservices.axis2'...
Submodule path 'webtools.webservices.axis2': checked out '9441c981df797e5b6884ae9e0c087d9ee80c4dac'
Cloning into 'webtools.webservices.jaxws'...
Submodule path 'webtools.webservices.jaxws': checked out 'a042180d9ac8b2a73160bd47d817329b07b777e2'
Unable to checkout 'a6b967229d72e337a16e85d20ee26b2ba712fe34' in submodule path 'webtools.sourceediting'

hudson.plugins.git.GitException: Error performing command: git submodule update
Command "git submodule update" returned status code 1: Cloning into 'webtools.common'...
Submodule path 'webtools.common': checked out 'b185b741e71451a93638c57e47615da3693b5696'
Cloning into 'webtools.dali'...
Submodule path 'webtools.dali': checked out '51fe2e9e217c5dbc19a51d8d0f2168e87e731462'
Cloning into 'webtools.javaee'...
Submodule path 'webtools.javaee': checked out '4e7cbc9358c4a9900b41a5f96d191c6478cb3c4d'
Cloning into 'webtools.jsdt'...
Submodule path 'webtools.jsdt': checked out 'd905e75a64925461bbbd2a41d2e8e53ff2f88916'
Cloning into 'webtools.jsf'...
Submodule path 'webtools.jsf': checked out '490184c2fccf601aed83446ef34ba5f1776e8874'
Cloning into 'webtools.releng'...
Submodule path 'webtools.releng': checked out '4982c8a2654013d7d27abec659e8d77c033c0a89'
Cloning into 'webtools.servertools'...
Submodule path 'webtools.servertools': checked out '112f125d6d0b3f1926ea3760d74c2ef882cd8d51'
Cloning into 'webtools.sourceediting'...
fatal: reference is not a tree: a6b967229d72e337a16e85d20ee26b2ba712fe34
Cloning into 'webtools.webservices'...
Submodule path 'webtools.webservices': checked out '7a3a099fd4f1bfa9e4b8f2476ddacf0e50f773a7'
Cloning into 'webtools.webservices.axis2'...
Submodule path 'webtools.webservices.axis2': checked out '9441c981df797e5b6884ae9e0c087d9ee80c4dac'
Cloning into 'webtools.webservices.jaxws'...
Submodule path 'webtools.webservices.jaxws': checked out 'a042180d9ac8b2a73160bd47d817329b07b777e2'
Unable to checkout 'a6b967229d72e337a16e85d20ee26b2ba712fe34' in submodule path 'webtools.sourceediting'

        at hudson.plugins.git.GitAPI.launchCommandIn(GitAPI.java:831)
        at hudson.plugins.git.GitAPI.launchCommand(GitAPI.java:793)
        at hudson.plugins.git.GitAPI.submoduleUpdate(GitAPI.java:450)
        at hudson.plugins.git.GitSCM$1.invoke(GitSCM.java:896)
        at hudson.plugins.git.GitSCM$1.invoke(GitSCM.java:856)
        at hudson.FilePath.act(FilePath.java:793)
        at hudson.FilePath.act(FilePath.java:775)
        at hudson.plugins.git.GitSCM.getBuildConfig(GitSCM.java:856)
        at hudson.plugins.git.GitSCM.checkout(GitSCM.java:817)
        at hudson.model.AbstractProject.checkout(AbstractProject.java:1550)
        at hudson.model.AbstractBuild$AbstractRunner.checkout(AbstractBuild.java:607)
        at hudson.model.AbstractBuild$AbstractRunner.run(AbstractBuild.java:518)
        at hudson.model.Run.run(Run.java:1493)
        at hudson.model.FreeStyleBuild.run(FreeStyleBuild.java:44)
        at hudson.model.ResourceController.execute(ResourceController.java:82)
        at hudson.model.Executor.run(Executor.java:137)
Caused by: hudson.plugins.git.GitException: Command "git submodule update" returned status code 1: Cloning into 'webtools.common'...
Submodule path 'webtools.common': checked out 'b185b741e71451a93638c57e47615da3693b5696'
Cloning into 'webtools.dali'...
Submodule path 'webtools.dali': checked out '51fe2e9e217c5dbc19a51d8d0f2168e87e731462'
Cloning into 'webtools.javaee'...
Submodule path 'webtools.javaee': checked out '4e7cbc9358c4a9900b41a5f96d191c6478cb3c4d'
Cloning into 'webtools.jsdt'...
Submodule path 'webtools.jsdt': checked out 'd905e75a64925461bbbd2a41d2e8e53ff2f88916'
Cloning into 'webtools.jsf'...
Submodule path 'webtools.jsf': checked out '490184c2fccf601aed83446ef34ba5f1776e8874'
Cloning into 'webtools.releng'...
Submodule path 'webtools.releng': checked out '4982c8a2654013d7d27abec659e8d77c033c0a89'
Cloning into 'webtools.servertools'...
Submodule path 'webtools.servertools': checked out '112f125d6d0b3f1926ea3760d74c2ef882cd8d51'
Cloning into 'webtools.sourceediting'...
fatal: reference is not a tree: a6b967229d72e337a16e85d20ee26b2ba712fe34
Cloning into 'webtools.webservices'...
Submodule path 'webtools.webservices': checked out '7a3a099fd4f1bfa9e4b8f2476ddacf0e50f773a7'
Cloning into 'webtools.webservices.axis2'...
Submodule path 'webtools.webservices.axis2': checked out '9441c981df797e5b6884ae9e0c087d9ee80c4dac'
Cloning into 'webtools.webservices.jaxws'...
Submodule path 'webtools.webservices.jaxws': checked out 'a042180d9ac8b2a73160bd47d817329b07b777e2'
Unable to checkout 'a6b967229d72e337a16e85d20ee26b2ba712fe34' in submodule path 'webtools.sourceediting'

        at hudson.plugins.git.GitAPI.launchCommandIn(GitAPI.java:824)
        ... 15 more

--
This message is automatically generated by Hudson.
For more information on Hudson, see: http://hudson-ci.org/
_______________________________________________
wtp-releng mailing list
[hidden email]
To change your delivery options, retrieve your password, or unsubscribe from this list, visit
https://dev.eclipse.org/mailman/listinfo/wtp-releng
Reply | Threaded
Open this post in threaded view
|

[Hudson] Build failed in Hudson: WTP-R3_10_Integration #237

hudsonbuild
See <https://hudson.eclipse.org/webtools/job/WTP-R3_10_Integration/237/changes>

Changes:

[nickboldt] pull latest from  webtools.javaee webtools.jsdt webtools.jsf webtools.sourceediting

[nickboldt] remove refs to prereq_eclipse and prereq_eclipseplatform; update links to e4x.build.id / build.dir to point to M5 build

[nickboldt] are the eclipsebuilder.* properties deprecated?

[nickboldt] revert to b83ce57d1430ca587435075eccea1d0acb1047cd because a6b967229d72e337a16e85d20ee26b2ba712fe34 is not merged yet

------------------------------------------
[...truncated 366630 lines...]
[INFO] PsychoPath XPath 2.0 Processor ..................... SUCCESS [  2.721 s]
[INFO] org.eclipse.wst.xml.xpath.ui ....................... SUCCESS [  5.255 s]
[INFO] sourceediting.xpath.docs ........................... SUCCESS [  0.094 s]
[INFO] PsychoPath XPath 2.0 Processor: User Documentation . SUCCESS [  3.181 s]
[INFO] PsychoPath XPath 2.0 Processor: Branding Plug-in ... SUCCESS [  2.505 s]
[INFO] sourceediting.xpath.features ....................... SUCCESS [  0.097 s]
[INFO] PsychoPath XPath 2.0 Processor Feature ............. SUCCESS [  2.147 s]
[INFO] sourceediting.xsl .................................. SUCCESS [  0.089 s]
[INFO] sourceediting.xsl.bundles .......................... SUCCESS [  0.089 s]
[INFO] XSLT Core Plugin ................................... SUCCESS [  4.791 s]
[INFO] XSLT Launching Plugin .............................. SUCCESS [  3.367 s]
[INFO] XSLT Debug UI Plugin ............................... SUCCESS [  4.419 s]
[INFO] sourceediting.xsl.docs ............................. SUCCESS [  0.116 s]
[INFO] org.eclipse.wst.xsl.doc ............................ SUCCESS [  7.819 s]
[INFO] XSLT EXSLT Core Plugin ............................. SUCCESS [  3.021 s]
[INFO] XSLT UI Plugin ..................................... SUCCESS [  5.972 s]
[INFO] XSLT EXSLT UI Plugin ............................... SUCCESS [  3.285 s]
[INFO] XSLT JAXP Debug Plugin ............................. SUCCESS [  3.490 s]
[INFO] XSLT Xalan Plugin .................................. FAILURE [  0.457 s]
[INFO] XSLT Saxon Plugin .................................. SKIPPED
[INFO] XSL Tools Branding Plugin .......................... SKIPPED
[INFO] XSLT JAXP Launching UI Plugin ...................... SKIPPED
[INFO] XSLT JAXP Debug UI Plugin .......................... SKIPPED
[INFO] sourceediting.xsl.features ......................... SKIPPED
[INFO] XSLT FeaturePlugin ................................. SKIPPED
[INFO] org.eclipse.wst.xsl.sdk.documentation .............. SKIPPED
[INFO] org.eclipse.wst.xsl_sdk.feature .................... SKIPPED
[INFO] org.eclipse.wst.server.http.core ................... SKIPPED
[INFO] org.eclipse.wst.server.http.ui ..................... SKIPPED
[INFO] org.eclipse.wst.server.preview ..................... SKIPPED
[INFO] org.eclipse.wst.server.preview.adapter ............. SKIPPED
[INFO] org.eclipse.wst.server_adapters.feature ............ SKIPPED
[INFO] org.eclipse.wst.server_adapters.sdk.feature ........ SKIPPED
[INFO] org.eclipse.wst.sdk ................................ SKIPPED
[INFO] org.eclipse.wst.common.project.facet.core.tests .... SKIPPED
[INFO] org.eclipse.wst.common.project.facet.ui.tests ...... SKIPPED
[INFO] org.eclipse.wst.common.snippets.tests .............. SKIPPED
[INFO] org.eclipse.wst.common.tests.ui .................... SKIPPED
[INFO] org.eclipse.wst.common.tests.validation ............ SKIPPED
[INFO] org.eclipse.wst.common.tests.validation.guard ...... SKIPPED
[INFO] org.eclipse.wst.internet.cache.tests ............... SKIPPED
[INFO] org.eclipse.wst.common_tests.feature ............... SKIPPED
[INFO] org.eclipse.wst.css.core.tests ..................... SKIPPED
[INFO] org.eclipse.wst.css.tests.encoding ................. SKIPPED
[INFO] org.eclipse.wst.css.ui.tests ....................... SKIPPED
[INFO] org.eclipse.wst.dtd.core.tests ..................... SKIPPED
[INFO] org.eclipse.wst.dtd.ui.tests ....................... SKIPPED
[INFO] org.eclipse.wst.html.core.tests .................... SKIPPED
[INFO] org.eclipse.wst.html.tests.encoding ................ SKIPPED
[INFO] org.eclipse.wst.html.ui.tests ...................... SKIPPED
[INFO] org.eclipse.wst.internet.monitor.core.tests ........ SKIPPED
[INFO] org.eclipse.wst.internet.monitor.ui.tests .......... SKIPPED
[INFO] tests .............................................. SKIPPED
[INFO] org.eclipse.wst.jsdt.core.tests.compiler ........... SKIPPED
[INFO] org.eclipse.wst.jsdt.core.tests.model .............. SKIPPED
[INFO] org.eclipse.wst.jsdt.debug.core.tests .............. SKIPPED
[INFO] org.eclipse.wst.jsdt.debug.rhino.tests ............. SKIPPED
[INFO] org.eclipse.wst.jsdt.js.node.common.tests .......... SKIPPED
[INFO] org.eclipse.wst.jsdt.ui.tests ...................... SKIPPED
[INFO] org.eclipse.wst.jsdt.web.core.tests ................ SKIPPED
[INFO] org.eclipse.wst.jsdt.web.ui.tests .................. SKIPPED
[INFO] org.eclipse.wst.jsdt_tests.feature ................. SKIPPED
[INFO] org.eclipse.wst.server_tests.feature ............... SKIPPED
[INFO] sourceediting.core.tests ........................... SKIPPED
[INFO] org.eclipse.wst.sse.core.tests ..................... SKIPPED
[INFO] org.eclipse.wst.sse.ui.tests ....................... SKIPPED
[INFO] org.eclipse.wtp.releng.fixups ...................... SKIPPED
[INFO] org.eclipse.wtp.releng.fixups.feature .............. SKIPPED
[INFO] org.eclipse.wtp.releng.tests ....................... SKIPPED
[INFO] org.eclipse.wtp.releng.tools ....................... SKIPPED
[INFO] org.eclipse.wtp.releng.tools.feature ............... SKIPPED
[INFO] org.eclipse.wtp.releng.tests.feature ............... SKIPPED
[INFO] org.eclipse.wst.xml.catalog.tests .................. SKIPPED
[INFO] org.eclipse.wst.xml.core.tests ..................... SKIPPED
[INFO] org.eclipse.wst.xml.ui.tests ....................... SKIPPED
[INFO] org.eclipse.wst.xml.validation.tests ............... SKIPPED
[INFO] org.eclipse.wst.xsd.validation.tests ............... SKIPPED
[INFO] org.eclipse.wst.xsd.core.tests ..................... SKIPPED
[INFO] org.eclipse.wst.xsd.ui.tests ....................... SKIPPED
[INFO] org.eclipse.wst.xml_tests.feature .................. SKIPPED
[INFO] sourceediting.xpath.tests .......................... SKIPPED
[INFO] org.eclipse.wst.xml.xpath.core.tests ............... SKIPPED
[INFO] org.eclipse.wst.xml.xpath.ui.tests ................. SKIPPED
[INFO] PsychoPath XPath 2.0 Processor: XQuery Test Suite .. SKIPPED
[INFO] PsychoPath XPath 2.0 Processor: Tests .............. SKIPPED
[INFO] sourceediting.xsl.tests ............................ SKIPPED
[INFO] XSLT Core Tests .................................... SKIPPED
[INFO] EXSLT Core Tests ................................... SKIPPED
[INFO] XSLT UI Tests ...................................... SKIPPED
[INFO] EXSLT UI Tests ..................................... SKIPPED
[INFO] JAXP Debug Tests ................................... SKIPPED
[INFO] XSL Launching Tests ................................ SKIPPED
[INFO] org.eclipse.wst.xsl.tests .......................... SKIPPED
[INFO] org.eclipse.wst.xsl_tests.feature .................. SKIPPED
[INFO] org.eclipse.wst.web_tests.feature .................. SKIPPED
[INFO] org.eclipse.wst.tests.feature ...................... SKIPPED
[INFO] org.eclipse.wtp.requiredpreques .................... SKIPPED
[INFO] org.eclipse.wtp.xml.dev ............................ SKIPPED
[INFO] org.eclipse.wtp.xml.dev.assembly.feature ........... SKIPPED
[INFO] org.uddi4j.feature ................................. SKIPPED
[INFO] org.eclipse.jst .................................... SKIPPED
[INFO] org.eclipse.wst .................................... SKIPPED
[INFO] org.eclipse.wst.doc.isv.feature .................... SKIPPED
[INFO] org.eclipse.wst.doc.user.feature ................... SKIPPED
[INFO] org.eclipse.wtp.epp.package.jee.intro .............. SKIPPED
[INFO] org.eclipse.wtp.epp.package.capabilities ........... SKIPPED
[INFO] org.eclipse.wtp.javascript.capabilities ............ SKIPPED
[INFO] org.eclipse.wtp.jee.capabilities ................... SKIPPED
[INFO] org.eclipse.wtp.web.capabilities ................... SKIPPED
[INFO] org.eclipse.wtp.xml.capabilities ................... SKIPPED
[INFO] org.eclipse.wtp.capabilities.feature ............... SKIPPED
[INFO] org.eclipse.wtp.capabilities ....................... SKIPPED
[INFO] org.eclipse.wtp.feature.branding.template .......... SKIPPED
[INFO] org.eclipse.wtp.jee ................................ SKIPPED
[INFO] repositories ....................................... SKIPPED
[INFO] org.eclipse.webtools.dali .......................... SKIPPED
[INFO] org.eclipse.jpt.common.utility ..................... SKIPPED
[INFO] org.eclipse.jpt.common.core ........................ SKIPPED
[INFO] org.eclipse.jpt.common.eclipselink.core ............ SKIPPED
[INFO] org.eclipse.jpt.common.ui .......................... SKIPPED
[INFO] org.eclipse.jpt.common.branding .................... SKIPPED
[INFO] org.eclipse.jpt.common.feature ..................... SKIPPED
[INFO] org.eclipse.jpt.common.eclipselink.branding ........ SKIPPED
[INFO] org.eclipse.jpt.common.eclipselink.feature ......... SKIPPED
[INFO] org.eclipse.jpt.common.eclipselink_sdk.feature ..... SKIPPED
[INFO] org.eclipse.jpt.common_sdk.feature ................. SKIPPED
[INFO] org.eclipse.jpt.dbws.eclipselink.core.gen .......... SKIPPED
[INFO] org.eclipse.jpt.dbws.eclipselink.ui ................ SKIPPED
[INFO] org.eclipse.jpt.dbws.eclipselink.branding .......... SKIPPED
[INFO] org.eclipse.jpt.dbws.eclipselink.feature ........... SKIPPED
[INFO] org.eclipse.jpt.dbws.eclipselink_sdk.feature ....... SKIPPED
[INFO] org.eclipse.jpt.jaxb.core .......................... SKIPPED
[INFO] org.eclipse.jpt.jaxb.core.schemagen ................ SKIPPED
[INFO] org.eclipse.jpt.jaxb.eclipselink.core .............. SKIPPED
[INFO] org.eclipse.jpt.jaxb.eclipselink.core.schemagen .... SKIPPED
[INFO] org.eclipse.jpt.jaxb.ui ............................ SKIPPED
[INFO] org.eclipse.jpt.jaxb.branding ...................... SKIPPED
[INFO] org.eclipse.jpt.jaxb.feature ....................... SKIPPED
[INFO] org.eclipse.jpt.jaxb.eclipselink.ui ................ SKIPPED
[INFO] org.eclipse.jpt.jaxb.eclipselink.branding .......... SKIPPED
[INFO] org.eclipse.jpt.jaxb.eclipselink.feature ........... SKIPPED
[INFO] org.eclipse.jpt.jaxb.eclipselink_sdk.feature ....... SKIPPED
[INFO] org.eclipse.jpt.jaxb_sdk.feature ................... SKIPPED
[INFO] org.eclipse.jpt.jpa.db ............................. SKIPPED
[INFO] org.eclipse.jpt.jpa.core ........................... SKIPPED
[INFO] org.eclipse.jpt.jpa.annotate ....................... SKIPPED
[INFO] org.eclipse.jpt.jpa.db.ui .......................... SKIPPED
[INFO] org.eclipse.jpt.jpa.eclipselink.core ............... SKIPPED
[INFO] org.eclipse.jpt.jpa.eclipselink.core.ddlgen ........ SKIPPED
[INFO] org.eclipse.jpt.jpa.gen ............................ SKIPPED
[INFO] org.eclipse.jpt.jpa.ui ............................. SKIPPED
[INFO] org.eclipse.jpt.doc.user ........................... SKIPPED
[INFO] org.eclipse.jpt.jpa.branding ....................... SKIPPED
[INFO] org.eclipse.jpt.jpa.feature ........................ SKIPPED
[INFO] org.eclipse.jpt.jpa.eclipselink.ui ................. SKIPPED
[INFO] org.eclipse.jpt.jpa.eclipselink.branding ........... SKIPPED
[INFO] org.eclipse.jpt.jpa.eclipselink.feature ............ SKIPPED
[INFO] org.eclipse.jpt.jpa.eclipselink_sdk.feature ........ SKIPPED
[INFO] org.eclipse.jpt.doc.isv ............................ SKIPPED
[INFO] org.eclipse.jpt.jpa_sdk.feature .................... SKIPPED
[INFO] JPA Diagram Editor Branding Plug-in ................ SKIPPED
[INFO] JPA Diagram Editor Plug-in ......................... SKIPPED
[INFO] JPA Diagram Editor Branding Plug-in ................ SKIPPED
[INFO] JPA Diagram Editor Feature ......................... SKIPPED
[INFO] org.eclipse.jpt.jpadiagrameditor_sdk.feature ....... SKIPPED
[INFO] dali4x-sdk ......................................... SKIPPED
[INFO] org.eclipse.jpt.common.utility.tests ............... SKIPPED
[INFO] org.eclipse.jpt.common.core.tests .................. SKIPPED
[INFO] org.eclipse.jpt.common.tests.feature ............... SKIPPED
[INFO] org.eclipse.jpt.jpa.core.tests.extension.resource .. SKIPPED
[INFO] org.eclipse.jpt.jpa.tests.feature .................. SKIPPED
[INFO] org.eclipse.jpt.jaxb.eclipselink.tests.feature ..... SKIPPED
[INFO] org.eclipse.jpt.jaxb.tests.feature ................. SKIPPED
[INFO] JPA Diagram Editor Test Plug-in .................... SKIPPED
[INFO] org.eclipse.jpt.jpadiagrameditor.tests.feature ..... SKIPPED
[INFO] dali4x.tests ....................................... SKIPPED
[INFO] jst4x-sdk .......................................... SKIPPED
[INFO] jst4x.tests ........................................ SKIPPED
[INFO] org.eclipse.wst.jsdt.chromium_sdk.feature .......... SKIPPED
[INFO] wst4x-sdk .......................................... SKIPPED
[INFO] org.eclipse.wst.jsdt.chromium.debug.core.tests ..... SKIPPED
[INFO] org.eclipse.wst.jsdt.chromium.tests ................ SKIPPED
[INFO] org.eclipse.wst.jsdt.chromium_tests.feature ........ SKIPPED
[INFO] sourceediting.json.tests ........................... SKIPPED
[INFO] org.eclipse.wst.json.core.tests .................... SKIPPED
[INFO] org.eclipse.wst.json_tests.feature ................. SKIPPED
[INFO] wst4x.tests ........................................ SKIPPED
[INFO] repository ......................................... SKIPPED
[INFO] repositoryunittests ................................ SKIPPED
[INFO] org.eclipse.webtools.common.site ................... SKIPPED
[INFO] org.eclipse.servertools.doc.isv .................... SKIPPED
[INFO] org.eclipse.wst.server.http.core.tests ............. SKIPPED
[INFO] org.eclipse.wst.server.util.tests .................. SKIPPED
[INFO] org.eclipse.webtools.servertools.site .............. SKIPPED
[INFO] org.eclipse.wst.server_sdk.feature ................. SKIPPED
[INFO] org.eclipse.wst.jsdt.js.common.tests ............... SKIPPED
[INFO] org.eclipse.wst.jsdt.integration.tests ............. SKIPPED
[INFO] org.eclipse.webtools.jsdt.site ..................... SKIPPED
[INFO] PsychoPath XPath 2.0 Processor: SDK Documentation .. SKIPPED
[INFO] PsychoPath XPath 2.0 Processor: SDK Feature ........ SKIPPED
[INFO] PsychoPath XPath 2.0 Processor: Tests for WTP type support SKIPPED
[INFO] org.eclipse.webtools.sourceediting.site ............ SKIPPED
[INFO] org.eclipse.jst.doc.user.feature ................... SKIPPED
[INFO] org.eclipse.webtools.javaee.site ................... SKIPPED
[INFO] org.eclipse.jpt.assembly.feature ................... SKIPPED
[INFO] org.eclipse.jpt_sdk.assembly.feature ............... SKIPPED
[INFO] org.eclipse.jpt.tests.assembly.feature ............. SKIPPED
[INFO] JPA Editor Update Site ............................. SKIPPED
[INFO] org.eclipse.webtools.dali.site ..................... SKIPPED
[INFO] org.eclipse.jsf.assembly.feature ................... SKIPPED
[INFO] org.eclipse.jst.jsf.doc.feature .................... SKIPPED
[INFO] org.eclipse.webtools.jsf.site ...................... SKIPPED
[INFO] org.eclipse.webtools.webservices.site .............. SKIPPED
[INFO] org.eclipse.jst.ws.jaxws.assembly.feature .......... SKIPPED
[INFO] wtp-aggregator ..................................... SKIPPED
[INFO] ------------------------------------------------------------------------
[INFO] BUILD FAILURE
[INFO] ------------------------------------------------------------------------
[INFO] Total time: 01:42 h
[INFO] Finished at: 2018-01-26T16:37:29-05:00
[INFO] Final Memory: 1107M/13183M
[INFO] ------------------------------------------------------------------------
[INFO] o.h.m.e.h.MavenExecutionResultHandler - Build failed with exception(s)
[INFO] o.h.m.e.h.MavenExecutionResultHandler - [1] org.apache.maven.lifecycle.LifecycleExecutionException: Failed to execute goal org.eclipse.tycho:tycho-compiler-plugin:1.1.0-SNAPSHOT:compile (default-compile) on project org.eclipse.wst.xsl.xalan: Compilation failure
[DEBUG] Closing connection to remote
[ERROR] Failed to execute goal org.eclipse.tycho:tycho-compiler-plugin:1.1.0-SNAPSHOT:compile (default-compile) on project org.eclipse.wst.xsl.xalan: Compilation failure: Compilation failure:
[ERROR] /jobs/genie.webtools/WTP-R3_10_Integration/workspace/webtools.sourceediting/xsl/bundles/org.eclipse.wst.xsl.xalan/src-debugger/org/eclipse/wst/xsl/xalan/debugger/XalanDebugger.java:[46]
[ERROR] lastTransformerInChain.getSerializationHandler().flushPending();
[ERROR]                       ^^^^^^^^^^^^^^^^^^^^^^^
[ERROR] The method getSerializationHandler() is undefined for the type TransformerImpl
[ERROR] /jobs/genie.webtools/WTP-R3_10_Integration/workspace/webtools.sourceediting/xsl/bundles/org.eclipse.wst.xsl.xalan/src-debugger/org/eclipse/wst/xsl/xalan/debugger/XalanStyleFrame.java:[131]
[ERROR] currentLine = e.m_styleNode.getEndLineNumber();
[ERROR]                            ^^^^^^^^^^^^^^^^
[ERROR] The method getEndLineNumber() is undefined for the type ElemTemplateElement
[ERROR] 2 problems (2 errors)
[ERROR] -> [Help 1]
[ERROR]
[ERROR] To see the full stack trace of the errors, re-run Maven with the -e switch.
[ERROR] Re-run Maven using the -X switch to enable full debug logging.
[ERROR]
[ERROR] For more information about the errors and possible solutions, please read the following articles:
[ERROR] [Help 1] http://cwiki.apache.org/confluence/display/MAVEN/MojoFailureException
[ERROR]
[ERROR] After correcting the problems, you can resume the build with the command
[ERROR]   mvn <goals> -rf :org.eclipse.wst.xsl.xalan
[DEBUG] Waiting for process to finish
[DEBUG] Result: 1
Terminating xvnc.
Archiving artifacts

--
This message is automatically generated by Hudson.
For more information on Hudson, see: http://hudson-ci.org/
_______________________________________________
wtp-releng mailing list
[hidden email]
To change your delivery options, retrieve your password, or unsubscribe from this list, visit
https://dev.eclipse.org/mailman/listinfo/wtp-releng
Reply | Threaded
Open this post in threaded view
|

[Hudson] Build failed in Hudson: WTP-R3_10_Integration #238

hudsonbuild
See <https://hudson.eclipse.org/webtools/job/WTP-R3_10_Integration/238/>

------------------------------------------
[...truncated 548021 lines...]
[INFO] org.eclipse.wtp.releng.tools.feature ............... SUCCESS [  1.258 s]
[INFO] org.eclipse.wtp.releng.tests.feature ............... SUCCESS [  1.656 s]
[INFO] org.eclipse.wst.xml.catalog.tests .................. SUCCESS [  4.614 s]
[INFO] org.eclipse.wst.xml.core.tests ..................... SUCCESS [  7.837 s]
[INFO] org.eclipse.wst.xml.ui.tests ....................... SUCCESS [  3.504 s]
[INFO] org.eclipse.wst.xml.validation.tests ............... SUCCESS [  3.259 s]
[INFO] org.eclipse.wst.xsd.validation.tests ............... SUCCESS [  3.586 s]
[INFO] org.eclipse.wst.xsd.core.tests ..................... SUCCESS [  3.330 s]
[INFO] org.eclipse.wst.xsd.ui.tests ....................... SUCCESS [  3.491 s]
[INFO] org.eclipse.wst.xml_tests.feature .................. SUCCESS [  1.166 s]
[INFO] sourceediting.xpath.tests .......................... SUCCESS [  0.039 s]
[INFO] org.eclipse.wst.xml.xpath.core.tests ............... SUCCESS [  2.608 s]
[INFO] org.eclipse.wst.xml.xpath.ui.tests ................. SUCCESS [  3.134 s]
[INFO] PsychoPath XPath 2.0 Processor: XQuery Test Suite .. SUCCESS [02:26 min]
[INFO] PsychoPath XPath 2.0 Processor: Tests .............. SUCCESS [ 16.171 s]
[INFO] sourceediting.xsl.tests ............................ SUCCESS [  0.074 s]
[INFO] XSLT Core Tests .................................... SUCCESS [  3.168 s]
[INFO] EXSLT Core Tests ................................... SUCCESS [  3.209 s]
[INFO] XSLT UI Tests ...................................... SUCCESS [  4.228 s]
[INFO] EXSLT UI Tests ..................................... SUCCESS [  3.400 s]
[INFO] JAXP Debug Tests ................................... SUCCESS [  2.999 s]
[INFO] XSL Launching Tests ................................ SUCCESS [  4.021 s]
[INFO] org.eclipse.wst.xsl.tests .......................... SUCCESS [  3.641 s]
[INFO] org.eclipse.wst.xsl_tests.feature .................. SUCCESS [  1.373 s]
[INFO] org.eclipse.wst.web_tests.feature .................. SUCCESS [  1.509 s]
[INFO] org.eclipse.wst.tests.feature ...................... SUCCESS [  1.404 s]
[INFO] org.eclipse.wtp.requiredpreques .................... SUCCESS [  1.317 s]
[INFO] org.eclipse.wtp.xml.dev ............................ SUCCESS [  1.997 s]
[INFO] org.eclipse.wtp.xml.dev.assembly.feature ........... SUCCESS [  1.235 s]
[INFO] org.uddi4j.feature ................................. SUCCESS [  1.295 s]
[INFO] org.eclipse.jst .................................... SUCCESS [  2.652 s]
[INFO] org.eclipse.wst .................................... SUCCESS [  1.939 s]
[INFO] org.eclipse.wst.doc.isv.feature .................... SUCCESS [  3.745 s]
[INFO] org.eclipse.wst.doc.user.feature ................... SUCCESS [  1.281 s]
[INFO] org.eclipse.wtp.epp.package.jee.intro .............. SUCCESS [  3.795 s]
[INFO] org.eclipse.wtp.epp.package.capabilities ........... SUCCESS [  1.796 s]
[INFO] org.eclipse.wtp.javascript.capabilities ............ SUCCESS [  1.778 s]
[INFO] org.eclipse.wtp.jee.capabilities ................... SUCCESS [  1.713 s]
[INFO] org.eclipse.wtp.web.capabilities ................... SUCCESS [  1.533 s]
[INFO] org.eclipse.wtp.xml.capabilities ................... SUCCESS [  1.379 s]
[INFO] org.eclipse.wtp.capabilities.feature ............... SUCCESS [  1.529 s]
[INFO] org.eclipse.wtp.capabilities ....................... SUCCESS [  1.404 s]
[INFO] org.eclipse.wtp.feature.branding.template .......... SUCCESS [  2.139 s]
[INFO] org.eclipse.wtp.jee ................................ SUCCESS [  2.345 s]
[INFO] repositories ....................................... SUCCESS [  0.096 s]
[INFO] org.eclipse.webtools.dali .......................... SUCCESS [  0.061 s]
[INFO] org.eclipse.jpt.common.utility ..................... SUCCESS [ 14.170 s]
[INFO] org.eclipse.jpt.common.core ........................ SUCCESS [  7.647 s]
[INFO] org.eclipse.jpt.common.eclipselink.core ............ SUCCESS [  4.956 s]
[INFO] org.eclipse.jpt.common.ui .......................... SUCCESS [  7.689 s]
[INFO] org.eclipse.jpt.common.branding .................... SUCCESS [  5.811 s]
[INFO] org.eclipse.jpt.common.feature ..................... SUCCESS [  4.461 s]
[INFO] org.eclipse.jpt.common.eclipselink.branding ........ SUCCESS [  2.126 s]
[INFO] org.eclipse.jpt.common.eclipselink.feature ......... SUCCESS [  2.688 s]
[INFO] org.eclipse.jpt.common.eclipselink_sdk.feature ..... SUCCESS [  1.339 s]
[INFO] org.eclipse.jpt.common_sdk.feature ................. SUCCESS [  1.132 s]
[INFO] org.eclipse.jpt.dbws.eclipselink.core.gen .......... SUCCESS [  3.362 s]
[INFO] org.eclipse.jpt.dbws.eclipselink.ui ................ SUCCESS [  3.987 s]
[INFO] org.eclipse.jpt.dbws.eclipselink.branding .......... SUCCESS [  2.595 s]
[INFO] org.eclipse.jpt.dbws.eclipselink.feature ........... SUCCESS [  3.203 s]
[INFO] org.eclipse.jpt.dbws.eclipselink_sdk.feature ....... SUCCESS [  1.338 s]
[INFO] org.eclipse.jpt.jaxb.core .......................... SUCCESS [  9.657 s]
[INFO] org.eclipse.jpt.jaxb.core.schemagen ................ SUCCESS [  4.055 s]
[INFO] org.eclipse.jpt.jaxb.eclipselink.core .............. SUCCESS [  6.905 s]
[INFO] org.eclipse.jpt.jaxb.eclipselink.core.schemagen .... SUCCESS [  3.754 s]
[INFO] org.eclipse.jpt.jaxb.ui ............................ SUCCESS [  5.515 s]
[INFO] org.eclipse.jpt.jaxb.branding ...................... SUCCESS [  2.041 s]
[INFO] org.eclipse.jpt.jaxb.feature ....................... SUCCESS [  3.494 s]
[INFO] org.eclipse.jpt.jaxb.eclipselink.ui ................ SUCCESS [  4.336 s]
[INFO] org.eclipse.jpt.jaxb.eclipselink.branding .......... SUCCESS [  2.036 s]
[INFO] org.eclipse.jpt.jaxb.eclipselink.feature ........... SUCCESS [  3.540 s]
[INFO] org.eclipse.jpt.jaxb.eclipselink_sdk.feature ....... SUCCESS [  1.493 s]
[INFO] org.eclipse.jpt.jaxb_sdk.feature ................... SUCCESS [  1.477 s]
[INFO] org.eclipse.jpt.jpa.db ............................. SUCCESS [  4.407 s]
[INFO] org.eclipse.jpt.jpa.core ........................... SUCCESS [ 21.043 s]
[INFO] org.eclipse.jpt.jpa.annotate ....................... SUCCESS [  4.457 s]
[INFO] org.eclipse.jpt.jpa.db.ui .......................... SUCCESS [  4.073 s]
[INFO] org.eclipse.jpt.jpa.eclipselink.core ............... SUCCESS [ 19.327 s]
[INFO] org.eclipse.jpt.jpa.eclipselink.core.ddlgen ........ SUCCESS [  4.280 s]
[INFO] org.eclipse.jpt.jpa.gen ............................ SUCCESS [  4.587 s]
[INFO] org.eclipse.jpt.jpa.ui ............................. SUCCESS [ 14.596 s]
[INFO] org.eclipse.jpt.doc.user ........................... SUCCESS [  6.100 s]
[INFO] org.eclipse.jpt.jpa.branding ....................... SUCCESS [  2.453 s]
[INFO] org.eclipse.jpt.jpa.feature ........................ SUCCESS [  3.195 s]
[INFO] org.eclipse.jpt.jpa.eclipselink.ui ................. SUCCESS [ 10.246 s]
[INFO] org.eclipse.jpt.jpa.eclipselink.branding ........... SUCCESS [  2.480 s]
[INFO] org.eclipse.jpt.jpa.eclipselink.feature ............ SUCCESS [  6.370 s]
[INFO] org.eclipse.jpt.jpa.eclipselink_sdk.feature ........ SUCCESS [  1.794 s]
[INFO] org.eclipse.jpt.doc.isv ............................ SUCCESS [  2.308 s]
[INFO] org.eclipse.jpt.jpa_sdk.feature .................... SUCCESS [  1.545 s]
[INFO] JPA Diagram Editor Branding Plug-in ................ SUCCESS [  3.371 s]
[INFO] JPA Diagram Editor Plug-in ......................... SUCCESS [  7.825 s]
[INFO] JPA Diagram Editor Branding Plug-in ................ SUCCESS [  2.139 s]
[INFO] JPA Diagram Editor Feature ......................... SUCCESS [  3.280 s]
[INFO] org.eclipse.jpt.jpadiagrameditor_sdk.feature ....... SUCCESS [  1.643 s]
[INFO] dali4x-sdk ......................................... SUCCESS [ 22.369 s]
[INFO] org.eclipse.jpt.common.utility.tests ............... SUCCESS [ 14.436 s]
[INFO] org.eclipse.jpt.common.core.tests .................. SUCCESS [  6.399 s]
[INFO] org.eclipse.jpt.common.tests.feature ............... SUCCESS [  1.429 s]
[INFO] org.eclipse.jpt.jpa.core.tests.extension.resource .. SUCCESS [  4.224 s]
[INFO] org.eclipse.jpt.jpa.tests.feature .................. SUCCESS [  1.653 s]
[INFO] org.eclipse.jpt.jaxb.eclipselink.tests.feature ..... SUCCESS [  1.513 s]
[INFO] org.eclipse.jpt.jaxb.tests.feature ................. SUCCESS [  1.582 s]
[INFO] JPA Diagram Editor Test Plug-in .................... SUCCESS [ 17.631 s]
[INFO] org.eclipse.jpt.jpadiagrameditor.tests.feature ..... SUCCESS [  1.535 s]
[INFO] dali4x.tests ....................................... SUCCESS [ 24.844 s]
[INFO] jst4x-sdk .......................................... SUCCESS [01:54 min]
[INFO] jst4x.tests ........................................ SUCCESS [ 18.935 s]
[INFO] org.eclipse.wst.jsdt.chromium_sdk.feature .......... SUCCESS [  1.106 s]
[INFO] wst4x-sdk .......................................... SUCCESS [01:16 min]
[INFO] org.eclipse.wst.jsdt.chromium.debug.core.tests ..... SUCCESS [  3.028 s]
[INFO] org.eclipse.wst.jsdt.chromium.tests ................ SUCCESS [  4.363 s]
[INFO] org.eclipse.wst.jsdt.chromium_tests.feature ........ SUCCESS [  1.158 s]
[INFO] sourceediting.json.tests ........................... SUCCESS [  0.103 s]
[INFO] org.eclipse.wst.json.core.tests .................... SUCCESS [  3.543 s]
[INFO] org.eclipse.wst.json_tests.feature ................. SUCCESS [  2.854 s]
[INFO] wst4x.tests ........................................ SUCCESS [ 20.880 s]
[INFO] repository ......................................... SUCCESS [01:42 min]
[INFO] repositoryunittests ................................ SUCCESS [ 12.069 s]
[INFO] org.eclipse.webtools.common.site ................... SUCCESS [ 12.392 s]
[INFO] org.eclipse.servertools.doc.isv .................... SUCCESS [  5.297 s]
[INFO] org.eclipse.wst.server.http.core.tests ............. SUCCESS [  4.552 s]
[INFO] org.eclipse.wst.server.util.tests .................. SUCCESS [  3.076 s]
[INFO] org.eclipse.webtools.servertools.site .............. SUCCESS [ 10.019 s]
[INFO] org.eclipse.wst.server_sdk.feature ................. SUCCESS [  1.070 s]
[INFO] org.eclipse.wst.jsdt.js.common.tests ............... SUCCESS [  3.167 s]
[INFO] org.eclipse.wst.jsdt.integration.tests ............. SUCCESS [  6.906 s]
[INFO] org.eclipse.webtools.jsdt.site ..................... SUCCESS [ 25.540 s]
[INFO] PsychoPath XPath 2.0 Processor: SDK Documentation .. SUCCESS [  4.967 s]
[INFO] PsychoPath XPath 2.0 Processor: SDK Feature ........ SUCCESS [  1.290 s]
[INFO] PsychoPath XPath 2.0 Processor: Tests for WTP type support SUCCESS [  5.548 s]
[INFO] org.eclipse.webtools.sourceediting.site ............ SUCCESS [ 39.604 s]
[INFO] org.eclipse.jst.doc.user.feature ................... SUCCESS [  1.153 s]
[INFO] org.eclipse.webtools.javaee.site ................... SUCCESS [ 13.493 s]
[INFO] org.eclipse.jpt.assembly.feature ................... SUCCESS [  2.330 s]
[INFO] org.eclipse.jpt_sdk.assembly.feature ............... SUCCESS [  1.803 s]
[INFO] org.eclipse.jpt.tests.assembly.feature ............. SUCCESS [  1.628 s]
[INFO] JPA Editor Update Site ............................. SUCCESS [  3.697 s]
[INFO] org.eclipse.webtools.dali.site ..................... SUCCESS [ 28.427 s]
[INFO] org.eclipse.jsf.assembly.feature ................... SUCCESS [  1.233 s]
[INFO] org.eclipse.jst.jsf.doc.feature .................... SUCCESS [  1.156 s]
[INFO] org.eclipse.webtools.jsf.site ...................... SUCCESS [ 18.407 s]
[INFO] org.eclipse.webtools.webservices.site .............. SUCCESS [ 36.098 s]
[INFO] org.eclipse.jst.ws.jaxws.assembly.feature .......... SUCCESS [  1.308 s]
[INFO] wtp-aggregator ..................................... SUCCESS [  0.805 s]
[INFO] ------------------------------------------------------------------------
[INFO] BUILD SUCCESS
[INFO] ------------------------------------------------------------------------
[INFO] Total time: 01:10 h
[INFO] Finished at: 2018-01-26T18:06:22-05:00
[INFO] Final Memory: 1216M/5674M
[INFO] ------------------------------------------------------------------------
[DEBUG] Closing connection to remote
[DEBUG] Waiting for process to finish
[DEBUG] Result: 0
[wtp-parent] $ /shared/common/apache-ant-1.8.4/bin/ant -file postBuild.xml -DplatformRepoUrl=http://download.eclipse.org/eclipse/updates/4.8milestones/S-4.8M5-201801242000/ -DtychoVersion=1.0.0 -Dwtp.version=3.10.0 -Dpublish=true -Dbuild.type=I -lib ./libs/
Buildfile: /jobs/genie.webtools/WTP-R3_10_Integration/workspace/wtp-parent/postBuild.xml

main:
     [echo] Starting the publishing...

init:
     [echo]
     [echo] :::Source directories:::
     [echo] Log Directory....................[/jobs/genie.webtools/WTP-R3_10_Integration/builds/238]
     [echo] Templates Directory..............[./templateFiles]
     [echo] Repository Directory.............[webtools.repositories/repository/target/repository/]
     [echo] Repository Test Unit Directory...[webtools.repositories/repositoryunittests/target/repository/]
     [echo]
     [echo] :::Destiny directories:::
     [echo] download.eclipse.org Directory...[/opt/public/webtools/committers]
     [echo] WTP Destination Path.............[/opt/public/webtools/committers/wtp-R3.10.0-I/20180126164512/I-3.10.0-20180126164512]
     [echo] Test Result Directory ...........[/opt/public/webtools/committers/wtp-R3.10.0-I/20180126164512/I-3.10.0-20180126164512/testResults]
     [echo] Logs Directory ..................[/opt/public/webtools/committers/wtp-R3.10.0-I/20180126164512/I-3.10.0-20180126164512/logs]
     [echo] Full log path........ ...........[/opt/public/webtools/committers/wtp-R3.10.0-I/20180126164512/I-3.10.0-20180126164512/fullLog.zip]
     [echo]
     [echo] :::Build Details:::
     [echo] Build ID.........................[20180126164512]
     [echo] Build ...........................[I-3.10.0-20180126164512]
     [echo] Build Distribution...............[wtp]
     [echo] Build branch.....................[R3.10.0]
     [echo] Build type.......................[I] (Integration)
     [echo] Build date.......................[26 January, 2018]
     [echo]
     [echo] :::Additional Information:::
     [echo] Files Count path.................[/opt/public/webtools/committers/wtp-R3.10.0-I/20180126164512/I-3.10.0-20180126164512/files.count]

prepare-page-files:
     [copy] Copying 7 files to /opt/public/webtools/committers/wtp-R3.10.0-I/20180126164512/I-3.10.0-20180126164512
     [copy] Copying 13 files to /opt/public/webtools/committers/wtp-R3.10.0-I/20180126164512/I-3.10.0-20180126164512
     [copy] Copying 1 file to /opt/public/webtools/committers/wtp-R3.10.0-I/20180126164512/I-3.10.0-20180126164512
     [copy] Copying 1 file to /opt/public/webtools/committers/wtp-R3.10.0-I/20180126164512/I-3.10.0-20180126164512

BUILD FAILED
/jobs/genie.webtools/WTP-R3_10_Integration/workspace/wtp-parent/postBuild.xml:492: The following error occurred while executing this line:
/jobs/genie.webtools/WTP-R3_10_Integration/workspace/wtp-parent/postBuild.xml:470: java.lang.IllegalArgumentException: named capturing group is missing trailing '}'
        at java.util.regex.Matcher.appendReplacement(Matcher.java:841)
        at org.eclipse.wtp.releng.tools.WritePropertiesAsPHP.expandVariableValues(WritePropertiesAsPHP.java:123)
        at org.eclipse.wtp.releng.tools.WritePropertiesAsPHP.convertPropertiesToVariables(WritePropertiesAsPHP.java:85)
        at org.eclipse.wtp.releng.tools.WritePropertiesAsPHP.execute(WritePropertiesAsPHP.java:57)
        at org.apache.tools.ant.UnknownElement.execute(UnknownElement.java:291)
        at sun.reflect.GeneratedMethodAccessor4.invoke(Unknown Source)
        at sun.reflect.DelegatingMethodAccessorImpl.invoke(DelegatingMethodAccessorImpl.java:43)
        at java.lang.reflect.Method.invoke(Method.java:498)
        at org.apache.tools.ant.dispatch.DispatchUtils.execute(DispatchUtils.java:106)
        at org.apache.tools.ant.Task.perform(Task.java:348)
        at org.apache.tools.ant.Target.execute(Target.java:392)
        at org.apache.tools.ant.Target.performTasks(Target.java:413)
        at org.apache.tools.ant.Project.executeSortedTargets(Project.java:1399)
        at org.apache.tools.ant.helper.SingleCheckExecutor.executeTargets(SingleCheckExecutor.java:38)
        at org.apache.tools.ant.Project.executeTargets(Project.java:1251)
        at org.apache.tools.ant.taskdefs.Ant.execute(Ant.java:442)
        at org.apache.tools.ant.taskdefs.CallTarget.execute(CallTarget.java:105)
        at org.apache.tools.ant.UnknownElement.execute(UnknownElement.java:291)
        at sun.reflect.NativeMethodAccessorImpl.invoke0(Native Method)
        at sun.reflect.NativeMethodAccessorImpl.invoke(NativeMethodAccessorImpl.java:62)
        at sun.reflect.DelegatingMethodAccessorImpl.invoke(DelegatingMethodAccessorImpl.java:43)
        at java.lang.reflect.Method.invoke(Method.java:498)
        at org.apache.tools.ant.dispatch.DispatchUtils.execute(DispatchUtils.java:106)
        at org.apache.tools.ant.Task.perform(Task.java:348)
        at org.apache.tools.ant.taskdefs.Sequential.execute(Sequential.java:68)
        at net.sf.antcontrib.logic.IfTask.execute(IfTask.java:197)
        at sun.reflect.NativeMethodAccessorImpl.invoke0(Native Method)
        at sun.reflect.NativeMethodAccessorImpl.invoke(NativeMethodAccessorImpl.java:62)
        at sun.reflect.DelegatingMethodAccessorImpl.invoke(DelegatingMethodAccessorImpl.java:43)
        at java.lang.reflect.Method.invoke(Method.java:498)
        at org.apache.tools.ant.dispatch.DispatchUtils.execute(DispatchUtils.java:106)
        at org.apache.tools.ant.TaskAdapter.execute(TaskAdapter.java:154)
        at org.apache.tools.ant.UnknownElement.execute(UnknownElement.java:291)
        at sun.reflect.NativeMethodAccessorImpl.invoke0(Native Method)
        at sun.reflect.NativeMethodAccessorImpl.invoke(NativeMethodAccessorImpl.java:62)
        at sun.reflect.DelegatingMethodAccessorImpl.invoke(DelegatingMethodAccessorImpl.java:43)
        at java.lang.reflect.Method.invoke(Method.java:498)
        at org.apache.tools.ant.dispatch.DispatchUtils.execute(DispatchUtils.java:106)
        at org.apache.tools.ant.Task.perform(Task.java:348)
        at org.apache.tools.ant.Target.execute(Target.java:392)
        at org.apache.tools.ant.Target.performTasks(Target.java:413)
        at org.apache.tools.ant.Project.executeSortedTargets(Project.java:1399)
        at org.apache.tools.ant.Project.executeTarget(Project.java:1368)
        at org.apache.tools.ant.helper.DefaultExecutor.executeTargets(DefaultExecutor.java:41)
        at org.apache.tools.ant.Project.executeTargets(Project.java:1251)
        at org.apache.tools.ant.Main.runBuild(Main.java:811)
        at org.apache.tools.ant.Main.startAnt(Main.java:217)
        at org.apache.tools.ant.launch.Launcher.run(Launcher.java:280)
        at org.apache.tools.ant.launch.Launcher.main(Launcher.java:109)

Total time: 0 seconds
Terminating xvnc.
Archiving artifacts

--
This message is automatically generated by Hudson.
For more information on Hudson, see: http://hudson-ci.org/
_______________________________________________
wtp-releng mailing list
[hidden email]
To change your delivery options, retrieve your password, or unsubscribe from this list, visit
https://dev.eclipse.org/mailman/listinfo/wtp-releng
Reply | Threaded
Open this post in threaded view
|

[Hudson] Build failed in Hudson: WTP-R3_10_Integration #239

hudsonbuild
See <https://hudson.eclipse.org/webtools/job/WTP-R3_10_Integration/239/>

------------------------------------------
[...truncated 9088 lines...]
[INFO] org.eclipse.wst.webtools.doc.user .................. SKIPPED
[INFO] org.eclipse.wst.web_userdoc.feature ................ SKIPPED
[INFO] org.eclipse.wst.html.ui.infopop .................... SKIPPED
[INFO] org.eclipse.wst.web.ui.infopop ..................... SKIPPED
[INFO] org.eclipse.wst.web_ui.feature ..................... SKIPPED
[INFO] org.eclipse.wst.web_sdk.feature .................... SKIPPED
[INFO] sourceediting.xpath ................................ SKIPPED
[INFO] sourceediting.xpath.bundles ........................ SKIPPED
[INFO] PsychoPath XPath 2.0 Processor ..................... SKIPPED
[INFO] org.eclipse.wst.xml.xpath.core ..................... SKIPPED
[INFO] PsychoPath XPath 2.0 Processor ..................... SKIPPED
[INFO] org.eclipse.wst.xml.xpath.ui ....................... SKIPPED
[INFO] sourceediting.xpath.docs ........................... SKIPPED
[INFO] PsychoPath XPath 2.0 Processor: User Documentation . SKIPPED
[INFO] PsychoPath XPath 2.0 Processor: Branding Plug-in ... SKIPPED
[INFO] sourceediting.xpath.features ....................... SKIPPED
[INFO] PsychoPath XPath 2.0 Processor Feature ............. SKIPPED
[INFO] sourceediting.xsl .................................. SKIPPED
[INFO] sourceediting.xsl.bundles .......................... SKIPPED
[INFO] XSLT Core Plugin ................................... SKIPPED
[INFO] XSLT Launching Plugin .............................. SKIPPED
[INFO] XSLT Debug UI Plugin ............................... SKIPPED
[INFO] sourceediting.xsl.docs ............................. SKIPPED
[INFO] org.eclipse.wst.xsl.doc ............................ SKIPPED
[INFO] XSLT EXSLT Core Plugin ............................. SKIPPED
[INFO] XSLT UI Plugin ..................................... SKIPPED
[INFO] XSLT EXSLT UI Plugin ............................... SKIPPED
[INFO] XSLT JAXP Debug Plugin ............................. SKIPPED
[INFO] XSLT Xalan Plugin .................................. SKIPPED
[INFO] XSLT Saxon Plugin .................................. SKIPPED
[INFO] XSL Tools Branding Plugin .......................... SKIPPED
[INFO] XSLT JAXP Launching UI Plugin ...................... SKIPPED
[INFO] XSLT JAXP Debug UI Plugin .......................... SKIPPED
[INFO] sourceediting.xsl.features ......................... SKIPPED
[INFO] XSLT FeaturePlugin ................................. SKIPPED
[INFO] org.eclipse.wst.xsl.sdk.documentation .............. SKIPPED
[INFO] org.eclipse.wst.xsl_sdk.feature .................... SKIPPED
[INFO] org.eclipse.wst.server.http.core ................... SKIPPED
[INFO] org.eclipse.wst.server.http.ui ..................... SKIPPED
[INFO] org.eclipse.wst.server.preview ..................... SKIPPED
[INFO] org.eclipse.wst.server.preview.adapter ............. SKIPPED
[INFO] org.eclipse.wst.server_adapters.feature ............ SKIPPED
[INFO] org.eclipse.wst.server_adapters.sdk.feature ........ SKIPPED
[INFO] org.eclipse.wst.sdk ................................ SKIPPED
[INFO] org.eclipse.wst.common.project.facet.core.tests .... SKIPPED
[INFO] org.eclipse.wst.common.project.facet.ui.tests ...... SKIPPED
[INFO] org.eclipse.wst.common.snippets.tests .............. SKIPPED
[INFO] org.eclipse.wst.common.tests.ui .................... SKIPPED
[INFO] org.eclipse.wst.common.tests.validation ............ SKIPPED
[INFO] org.eclipse.wst.common.tests.validation.guard ...... SKIPPED
[INFO] org.eclipse.wst.internet.cache.tests ............... SKIPPED
[INFO] org.eclipse.wst.common_tests.feature ............... SKIPPED
[INFO] org.eclipse.wst.css.core.tests ..................... SKIPPED
[INFO] org.eclipse.wst.css.tests.encoding ................. SKIPPED
[INFO] org.eclipse.wst.css.ui.tests ....................... SKIPPED
[INFO] org.eclipse.wst.dtd.core.tests ..................... SKIPPED
[INFO] org.eclipse.wst.dtd.ui.tests ....................... SKIPPED
[INFO] org.eclipse.wst.html.core.tests .................... SKIPPED
[INFO] org.eclipse.wst.html.tests.encoding ................ SKIPPED
[INFO] org.eclipse.wst.html.ui.tests ...................... SKIPPED
[INFO] org.eclipse.wst.internet.monitor.core.tests ........ SKIPPED
[INFO] org.eclipse.wst.internet.monitor.ui.tests .......... SKIPPED
[INFO] tests .............................................. SKIPPED
[INFO] org.eclipse.wst.jsdt.core.tests.compiler ........... SKIPPED
[INFO] org.eclipse.wst.jsdt.core.tests.model .............. SKIPPED
[INFO] org.eclipse.wst.jsdt.debug.core.tests .............. SKIPPED
[INFO] org.eclipse.wst.jsdt.debug.rhino.tests ............. SKIPPED
[INFO] org.eclipse.wst.jsdt.js.node.common.tests .......... SKIPPED
[INFO] org.eclipse.wst.jsdt.ui.tests ...................... SKIPPED
[INFO] org.eclipse.wst.jsdt.web.core.tests ................ SKIPPED
[INFO] org.eclipse.wst.jsdt.web.ui.tests .................. SKIPPED
[INFO] org.eclipse.wst.jsdt_tests.feature ................. SKIPPED
[INFO] org.eclipse.wst.server_tests.feature ............... SKIPPED
[INFO] sourceediting.core.tests ........................... SKIPPED
[INFO] org.eclipse.wst.sse.core.tests ..................... SKIPPED
[INFO] org.eclipse.wst.sse.ui.tests ....................... SKIPPED
[INFO] org.eclipse.wtp.releng.fixups ...................... SKIPPED
[INFO] org.eclipse.wtp.releng.fixups.feature .............. SKIPPED
[INFO] org.eclipse.wtp.releng.tests ....................... SKIPPED
[INFO] org.eclipse.wtp.releng.tools ....................... SKIPPED
[INFO] org.eclipse.wtp.releng.tools.feature ............... SKIPPED
[INFO] org.eclipse.wtp.releng.tests.feature ............... SKIPPED
[INFO] org.eclipse.wst.xml.catalog.tests .................. SKIPPED
[INFO] org.eclipse.wst.xml.core.tests ..................... SKIPPED
[INFO] org.eclipse.wst.xml.ui.tests ....................... SKIPPED
[INFO] org.eclipse.wst.xml.validation.tests ............... SKIPPED
[INFO] org.eclipse.wst.xsd.validation.tests ............... SKIPPED
[INFO] org.eclipse.wst.xsd.core.tests ..................... SKIPPED
[INFO] org.eclipse.wst.xsd.ui.tests ....................... SKIPPED
[INFO] org.eclipse.wst.xml_tests.feature .................. SKIPPED
[INFO] sourceediting.xpath.tests .......................... SKIPPED
[INFO] org.eclipse.wst.xml.xpath.core.tests ............... SKIPPED
[INFO] org.eclipse.wst.xml.xpath.ui.tests ................. SKIPPED
[INFO] PsychoPath XPath 2.0 Processor: XQuery Test Suite .. SKIPPED
[INFO] PsychoPath XPath 2.0 Processor: Tests .............. SKIPPED
[INFO] sourceediting.xsl.tests ............................ SKIPPED
[INFO] XSLT Core Tests .................................... SKIPPED
[INFO] EXSLT Core Tests ................................... SKIPPED
[INFO] XSLT UI Tests ...................................... SKIPPED
[INFO] EXSLT UI Tests ..................................... SKIPPED
[INFO] JAXP Debug Tests ................................... SKIPPED
[INFO] XSL Launching Tests ................................ SKIPPED
[INFO] org.eclipse.wst.xsl.tests .......................... SKIPPED
[INFO] org.eclipse.wst.xsl_tests.feature .................. SKIPPED
[INFO] org.eclipse.wst.web_tests.feature .................. SKIPPED
[INFO] org.eclipse.wst.tests.feature ...................... SKIPPED
[INFO] org.eclipse.wtp.requiredpreques .................... SKIPPED
[INFO] org.eclipse.wtp.xml.dev ............................ SKIPPED
[INFO] org.eclipse.wtp.xml.dev.assembly.feature ........... SKIPPED
[INFO] org.uddi4j.feature ................................. SKIPPED
[INFO] org.eclipse.jst .................................... SKIPPED
[INFO] org.eclipse.wst .................................... SKIPPED
[INFO] org.eclipse.wst.doc.isv.feature .................... SKIPPED
[INFO] org.eclipse.wst.doc.user.feature ................... SKIPPED
[INFO] org.eclipse.wtp.epp.package.jee.intro .............. SKIPPED
[INFO] org.eclipse.wtp.epp.package.capabilities ........... SKIPPED
[INFO] org.eclipse.wtp.javascript.capabilities ............ SKIPPED
[INFO] org.eclipse.wtp.jee.capabilities ................... SKIPPED
[INFO] org.eclipse.wtp.web.capabilities ................... SKIPPED
[INFO] org.eclipse.wtp.xml.capabilities ................... SKIPPED
[INFO] org.eclipse.wtp.capabilities.feature ............... SKIPPED
[INFO] org.eclipse.wtp.capabilities ....................... SKIPPED
[INFO] org.eclipse.wtp.feature.branding.template .......... SKIPPED
[INFO] org.eclipse.wtp.jee ................................ SKIPPED
[INFO] repositories ....................................... SKIPPED
[INFO] org.eclipse.webtools.dali .......................... SKIPPED
[INFO] org.eclipse.jpt.common.utility ..................... SKIPPED
[INFO] org.eclipse.jpt.common.core ........................ SKIPPED
[INFO] org.eclipse.jpt.common.eclipselink.core ............ SKIPPED
[INFO] org.eclipse.jpt.common.ui .......................... SKIPPED
[INFO] org.eclipse.jpt.common.branding .................... SKIPPED
[INFO] org.eclipse.jpt.common.feature ..................... SKIPPED
[INFO] org.eclipse.jpt.common.eclipselink.branding ........ SKIPPED
[INFO] org.eclipse.jpt.common.eclipselink.feature ......... SKIPPED
[INFO] org.eclipse.jpt.common.eclipselink_sdk.feature ..... SKIPPED
[INFO] org.eclipse.jpt.common_sdk.feature ................. SKIPPED
[INFO] org.eclipse.jpt.dbws.eclipselink.core.gen .......... SKIPPED
[INFO] org.eclipse.jpt.dbws.eclipselink.ui ................ SKIPPED
[INFO] org.eclipse.jpt.dbws.eclipselink.branding .......... SKIPPED
[INFO] org.eclipse.jpt.dbws.eclipselink.feature ........... SKIPPED
[INFO] org.eclipse.jpt.dbws.eclipselink_sdk.feature ....... SKIPPED
[INFO] org.eclipse.jpt.jaxb.core .......................... SKIPPED
[INFO] org.eclipse.jpt.jaxb.core.schemagen ................ SKIPPED
[INFO] org.eclipse.jpt.jaxb.eclipselink.core .............. SKIPPED
[INFO] org.eclipse.jpt.jaxb.eclipselink.core.schemagen .... SKIPPED
[INFO] org.eclipse.jpt.jaxb.ui ............................ SKIPPED
[INFO] org.eclipse.jpt.jaxb.branding ...................... SKIPPED
[INFO] org.eclipse.jpt.jaxb.feature ....................... SKIPPED
[INFO] org.eclipse.jpt.jaxb.eclipselink.ui ................ SKIPPED
[INFO] org.eclipse.jpt.jaxb.eclipselink.branding .......... SKIPPED
[INFO] org.eclipse.jpt.jaxb.eclipselink.feature ........... SKIPPED
[INFO] org.eclipse.jpt.jaxb.eclipselink_sdk.feature ....... SKIPPED
[INFO] org.eclipse.jpt.jaxb_sdk.feature ................... SKIPPED
[INFO] org.eclipse.jpt.jpa.db ............................. SKIPPED
[INFO] org.eclipse.jpt.jpa.core ........................... SKIPPED
[INFO] org.eclipse.jpt.jpa.annotate ....................... SKIPPED
[INFO] org.eclipse.jpt.jpa.db.ui .......................... SKIPPED
[INFO] org.eclipse.jpt.jpa.eclipselink.core ............... SKIPPED
[INFO] org.eclipse.jpt.jpa.eclipselink.core.ddlgen ........ SKIPPED
[INFO] org.eclipse.jpt.jpa.gen ............................ SKIPPED
[INFO] org.eclipse.jpt.jpa.ui ............................. SKIPPED
[INFO] org.eclipse.jpt.doc.user ........................... SKIPPED
[INFO] org.eclipse.jpt.jpa.branding ....................... SKIPPED
[INFO] org.eclipse.jpt.jpa.feature ........................ SKIPPED
[INFO] org.eclipse.jpt.jpa.eclipselink.ui ................. SKIPPED
[INFO] org.eclipse.jpt.jpa.eclipselink.branding ........... SKIPPED
[INFO] org.eclipse.jpt.jpa.eclipselink.feature ............ SKIPPED
[INFO] org.eclipse.jpt.jpa.eclipselink_sdk.feature ........ SKIPPED
[INFO] org.eclipse.jpt.doc.isv ............................ SKIPPED
[INFO] org.eclipse.jpt.jpa_sdk.feature .................... SKIPPED
[INFO] JPA Diagram Editor Branding Plug-in ................ SKIPPED
[INFO] JPA Diagram Editor Plug-in ......................... SKIPPED
[INFO] JPA Diagram Editor Branding Plug-in ................ SKIPPED
[INFO] JPA Diagram Editor Feature ......................... SKIPPED
[INFO] org.eclipse.jpt.jpadiagrameditor_sdk.feature ....... SKIPPED
[INFO] dali4x-sdk ......................................... SKIPPED
[INFO] org.eclipse.jpt.common.utility.tests ............... SKIPPED
[INFO] org.eclipse.jpt.common.core.tests .................. SKIPPED
[INFO] org.eclipse.jpt.common.tests.feature ............... SKIPPED
[INFO] org.eclipse.jpt.jpa.core.tests.extension.resource .. SKIPPED
[INFO] org.eclipse.jpt.jpa.tests.feature .................. SKIPPED
[INFO] org.eclipse.jpt.jaxb.eclipselink.tests.feature ..... SKIPPED
[INFO] org.eclipse.jpt.jaxb.tests.feature ................. SKIPPED
[INFO] JPA Diagram Editor Test Plug-in .................... SKIPPED
[INFO] org.eclipse.jpt.jpadiagrameditor.tests.feature ..... SKIPPED
[INFO] dali4x.tests ....................................... SKIPPED
[INFO] jst4x-sdk .......................................... SKIPPED
[INFO] jst4x.tests ........................................ SKIPPED
[INFO] org.eclipse.wst.jsdt.chromium_sdk.feature .......... SKIPPED
[INFO] wst4x-sdk .......................................... SKIPPED
[INFO] org.eclipse.wst.jsdt.chromium.debug.core.tests ..... SKIPPED
[INFO] org.eclipse.wst.jsdt.chromium.tests ................ SKIPPED
[INFO] org.eclipse.wst.jsdt.chromium_tests.feature ........ SKIPPED
[INFO] sourceediting.json.tests ........................... SKIPPED
[INFO] org.eclipse.wst.json.core.tests .................... SKIPPED
[INFO] org.eclipse.wst.json_tests.feature ................. SKIPPED
[INFO] wst4x.tests ........................................ SKIPPED
[INFO] repository ......................................... SKIPPED
[INFO] repositoryunittests ................................ SKIPPED
[INFO] org.eclipse.webtools.common.site ................... SKIPPED
[INFO] org.eclipse.servertools.doc.isv .................... SKIPPED
[INFO] org.eclipse.wst.server.http.core.tests ............. SKIPPED
[INFO] org.eclipse.wst.server.util.tests .................. SKIPPED
[INFO] org.eclipse.webtools.servertools.site .............. SKIPPED
[INFO] org.eclipse.wst.server_sdk.feature ................. SKIPPED
[INFO] org.eclipse.wst.jsdt.js.common.tests ............... SKIPPED
[INFO] org.eclipse.wst.jsdt.integration.tests ............. SKIPPED
[INFO] org.eclipse.webtools.jsdt.site ..................... SKIPPED
[INFO] PsychoPath XPath 2.0 Processor: SDK Documentation .. SKIPPED
[INFO] PsychoPath XPath 2.0 Processor: SDK Feature ........ SKIPPED
[INFO] PsychoPath XPath 2.0 Processor: Tests for WTP type support SKIPPED
[INFO] org.eclipse.webtools.sourceediting.site ............ SKIPPED
[INFO] org.eclipse.jst.doc.user.feature ................... SKIPPED
[INFO] org.eclipse.webtools.javaee.site ................... SKIPPED
[INFO] org.eclipse.jpt.assembly.feature ................... SKIPPED
[INFO] org.eclipse.jpt_sdk.assembly.feature ............... SKIPPED
[INFO] org.eclipse.jpt.tests.assembly.feature ............. SKIPPED
[INFO] JPA Editor Update Site ............................. SKIPPED
[INFO] org.eclipse.webtools.dali.site ..................... SKIPPED
[INFO] org.eclipse.jsf.assembly.feature ................... SKIPPED
[INFO] org.eclipse.jst.jsf.doc.feature .................... SKIPPED
[INFO] org.eclipse.webtools.jsf.site ...................... SKIPPED
[INFO] org.eclipse.webtools.webservices.site .............. SKIPPED
[INFO] org.eclipse.jst.ws.jaxws.assembly.feature .......... SKIPPED
[INFO] wtp-aggregator ..................................... SKIPPED
[INFO] ------------------------------------------------------------------------
[INFO] BUILD FAILURE
[INFO] ------------------------------------------------------------------------
[INFO] Total time: 32:42 min
[INFO] Finished at: 2018-01-27T01:02:45-05:00
[INFO] Final Memory: 917M/13107M
[INFO] ------------------------------------------------------------------------
[INFO] o.h.m.e.h.MavenExecutionResultHandler - Build failed with exception(s)
[INFO] o.h.m.e.h.MavenExecutionResultHandler - [1] org.apache.maven.lifecycle.LifecycleExecutionException: Failed to execute goal org.eclipse.tycho.extras:tycho-pack200b-plugin:1.1.0-SNAPSHOT:pack (pack200-pack) on project org.eclipse.jem.beaninfo: Execution pack200-pack of goal org.eclipse.tycho.extras:tycho-pack200b-plugin:1.1.0-SNAPSHOT:pack failed: Could not execute pack200, see log for details.
[DEBUG] Closing connection to remote
[ERROR] Failed to execute goal org.eclipse.tycho.extras:tycho-pack200b-plugin:1.1.0-SNAPSHOT:pack (pack200-pack) on project org.eclipse.jem.beaninfo: Execution pack200-pack of goal org.eclipse.tycho.extras:tycho-pack200b-plugin:1.1.0-SNAPSHOT:pack failed: Could not execute pack200, see log for details. Error while executing external command, process killed. Process timeout out after 100 seconds -> [Help 1]
[ERROR]
[ERROR] To see the full stack trace of the errors, re-run Maven with the -e switch.
[ERROR] Re-run Maven using the -X switch to enable full debug logging.
[ERROR]
[ERROR] For more information about the errors and possible solutions, please read the following articles:
[ERROR] [Help 1] http://cwiki.apache.org/confluence/display/MAVEN/PluginExecutionException
[ERROR]
[ERROR] After correcting the problems, you can resume the build with the command
[ERROR]   mvn <goals> -rf :org.eclipse.jem.beaninfo
[DEBUG] Waiting for process to finish
[DEBUG] Result: 1
Terminating xvnc.
Archiving artifacts

--
This message is automatically generated by Hudson.
For more information on Hudson, see: http://hudson-ci.org/
_______________________________________________
wtp-releng mailing list
[hidden email]
To change your delivery options, retrieve your password, or unsubscribe from this list, visit
https://dev.eclipse.org/mailman/listinfo/wtp-releng
Reply | Threaded
Open this post in threaded view
|

[Hudson] Build failed in Hudson: WTP-R3_10_Integration #240

hudsonbuild
See <https://hudson.eclipse.org/webtools/job/WTP-R3_10_Integration/240/>

------------------------------------------
[...truncated 315998 lines...]
[INFO] org.eclipse.wst.webtools.doc.user .................. SKIPPED
[INFO] org.eclipse.wst.web_userdoc.feature ................ SKIPPED
[INFO] org.eclipse.wst.html.ui.infopop .................... SKIPPED
[INFO] org.eclipse.wst.web.ui.infopop ..................... SKIPPED
[INFO] org.eclipse.wst.web_ui.feature ..................... SKIPPED
[INFO] org.eclipse.wst.web_sdk.feature .................... SKIPPED
[INFO] sourceediting.xpath ................................ SKIPPED
[INFO] sourceediting.xpath.bundles ........................ SKIPPED
[INFO] PsychoPath XPath 2.0 Processor ..................... SKIPPED
[INFO] org.eclipse.wst.xml.xpath.core ..................... SKIPPED
[INFO] PsychoPath XPath 2.0 Processor ..................... SKIPPED
[INFO] org.eclipse.wst.xml.xpath.ui ....................... SKIPPED
[INFO] sourceediting.xpath.docs ........................... SKIPPED
[INFO] PsychoPath XPath 2.0 Processor: User Documentation . SKIPPED
[INFO] PsychoPath XPath 2.0 Processor: Branding Plug-in ... SKIPPED
[INFO] sourceediting.xpath.features ....................... SKIPPED
[INFO] PsychoPath XPath 2.0 Processor Feature ............. SKIPPED
[INFO] sourceediting.xsl .................................. SKIPPED
[INFO] sourceediting.xsl.bundles .......................... SKIPPED
[INFO] XSLT Core Plugin ................................... SKIPPED
[INFO] XSLT Launching Plugin .............................. SKIPPED
[INFO] XSLT Debug UI Plugin ............................... SKIPPED
[INFO] sourceediting.xsl.docs ............................. SKIPPED
[INFO] org.eclipse.wst.xsl.doc ............................ SKIPPED
[INFO] XSLT EXSLT Core Plugin ............................. SKIPPED
[INFO] XSLT UI Plugin ..................................... SKIPPED
[INFO] XSLT EXSLT UI Plugin ............................... SKIPPED
[INFO] XSLT JAXP Debug Plugin ............................. SKIPPED
[INFO] XSLT Xalan Plugin .................................. SKIPPED
[INFO] XSLT Saxon Plugin .................................. SKIPPED
[INFO] XSL Tools Branding Plugin .......................... SKIPPED
[INFO] XSLT JAXP Launching UI Plugin ...................... SKIPPED
[INFO] XSLT JAXP Debug UI Plugin .......................... SKIPPED
[INFO] sourceediting.xsl.features ......................... SKIPPED
[INFO] XSLT FeaturePlugin ................................. SKIPPED
[INFO] org.eclipse.wst.xsl.sdk.documentation .............. SKIPPED
[INFO] org.eclipse.wst.xsl_sdk.feature .................... SKIPPED
[INFO] org.eclipse.wst.server.http.core ................... SKIPPED
[INFO] org.eclipse.wst.server.http.ui ..................... SKIPPED
[INFO] org.eclipse.wst.server.preview ..................... SKIPPED
[INFO] org.eclipse.wst.server.preview.adapter ............. SKIPPED
[INFO] org.eclipse.wst.server_adapters.feature ............ SKIPPED
[INFO] org.eclipse.wst.server_adapters.sdk.feature ........ SKIPPED
[INFO] org.eclipse.wst.sdk ................................ SKIPPED
[INFO] org.eclipse.wst.common.project.facet.core.tests .... SKIPPED
[INFO] org.eclipse.wst.common.project.facet.ui.tests ...... SKIPPED
[INFO] org.eclipse.wst.common.snippets.tests .............. SKIPPED
[INFO] org.eclipse.wst.common.tests.ui .................... SKIPPED
[INFO] org.eclipse.wst.common.tests.validation ............ SKIPPED
[INFO] org.eclipse.wst.common.tests.validation.guard ...... SKIPPED
[INFO] org.eclipse.wst.internet.cache.tests ............... SKIPPED
[INFO] org.eclipse.wst.common_tests.feature ............... SKIPPED
[INFO] org.eclipse.wst.css.core.tests ..................... SKIPPED
[INFO] org.eclipse.wst.css.tests.encoding ................. SKIPPED
[INFO] org.eclipse.wst.css.ui.tests ....................... SKIPPED
[INFO] org.eclipse.wst.dtd.core.tests ..................... SKIPPED
[INFO] org.eclipse.wst.dtd.ui.tests ....................... SKIPPED
[INFO] org.eclipse.wst.html.core.tests .................... SKIPPED
[INFO] org.eclipse.wst.html.tests.encoding ................ SKIPPED
[INFO] org.eclipse.wst.html.ui.tests ...................... SKIPPED
[INFO] org.eclipse.wst.internet.monitor.core.tests ........ SKIPPED
[INFO] org.eclipse.wst.internet.monitor.ui.tests .......... SKIPPED
[INFO] tests .............................................. SKIPPED
[INFO] org.eclipse.wst.jsdt.core.tests.compiler ........... SKIPPED
[INFO] org.eclipse.wst.jsdt.core.tests.model .............. SKIPPED
[INFO] org.eclipse.wst.jsdt.debug.core.tests .............. SKIPPED
[INFO] org.eclipse.wst.jsdt.debug.rhino.tests ............. SKIPPED
[INFO] org.eclipse.wst.jsdt.js.node.common.tests .......... SKIPPED
[INFO] org.eclipse.wst.jsdt.ui.tests ...................... SKIPPED
[INFO] org.eclipse.wst.jsdt.web.core.tests ................ SKIPPED
[INFO] org.eclipse.wst.jsdt.web.ui.tests .................. SKIPPED
[INFO] org.eclipse.wst.jsdt_tests.feature ................. SKIPPED
[INFO] org.eclipse.wst.server_tests.feature ............... SKIPPED
[INFO] sourceediting.core.tests ........................... SKIPPED
[INFO] org.eclipse.wst.sse.core.tests ..................... SKIPPED
[INFO] org.eclipse.wst.sse.ui.tests ....................... SKIPPED
[INFO] org.eclipse.wtp.releng.fixups ...................... SKIPPED
[INFO] org.eclipse.wtp.releng.fixups.feature .............. SKIPPED
[INFO] org.eclipse.wtp.releng.tests ....................... SKIPPED
[INFO] org.eclipse.wtp.releng.tools ....................... SKIPPED
[INFO] org.eclipse.wtp.releng.tools.feature ............... SKIPPED
[INFO] org.eclipse.wtp.releng.tests.feature ............... SKIPPED
[INFO] org.eclipse.wst.xml.catalog.tests .................. SKIPPED
[INFO] org.eclipse.wst.xml.core.tests ..................... SKIPPED
[INFO] org.eclipse.wst.xml.ui.tests ....................... SKIPPED
[INFO] org.eclipse.wst.xml.validation.tests ............... SKIPPED
[INFO] org.eclipse.wst.xsd.validation.tests ............... SKIPPED
[INFO] org.eclipse.wst.xsd.core.tests ..................... SKIPPED
[INFO] org.eclipse.wst.xsd.ui.tests ....................... SKIPPED
[INFO] org.eclipse.wst.xml_tests.feature .................. SKIPPED
[INFO] sourceediting.xpath.tests .......................... SKIPPED
[INFO] org.eclipse.wst.xml.xpath.core.tests ............... SKIPPED
[INFO] org.eclipse.wst.xml.xpath.ui.tests ................. SKIPPED
[INFO] PsychoPath XPath 2.0 Processor: XQuery Test Suite .. SKIPPED
[INFO] PsychoPath XPath 2.0 Processor: Tests .............. SKIPPED
[INFO] sourceediting.xsl.tests ............................ SKIPPED
[INFO] XSLT Core Tests .................................... SKIPPED
[INFO] EXSLT Core Tests ................................... SKIPPED
[INFO] XSLT UI Tests ...................................... SKIPPED
[INFO] EXSLT UI Tests ..................................... SKIPPED
[INFO] JAXP Debug Tests ................................... SKIPPED
[INFO] XSL Launching Tests ................................ SKIPPED
[INFO] org.eclipse.wst.xsl.tests .......................... SKIPPED
[INFO] org.eclipse.wst.xsl_tests.feature .................. SKIPPED
[INFO] org.eclipse.wst.web_tests.feature .................. SKIPPED
[INFO] org.eclipse.wst.tests.feature ...................... SKIPPED
[INFO] org.eclipse.wtp.requiredpreques .................... SKIPPED
[INFO] org.eclipse.wtp.xml.dev ............................ SKIPPED
[INFO] org.eclipse.wtp.xml.dev.assembly.feature ........... SKIPPED
[INFO] org.uddi4j.feature ................................. SKIPPED
[INFO] org.eclipse.jst .................................... SKIPPED
[INFO] org.eclipse.wst .................................... SKIPPED
[INFO] org.eclipse.wst.doc.isv.feature .................... SKIPPED
[INFO] org.eclipse.wst.doc.user.feature ................... SKIPPED
[INFO] org.eclipse.wtp.epp.package.jee.intro .............. SKIPPED
[INFO] org.eclipse.wtp.epp.package.capabilities ........... SKIPPED
[INFO] org.eclipse.wtp.javascript.capabilities ............ SKIPPED
[INFO] org.eclipse.wtp.jee.capabilities ................... SKIPPED
[INFO] org.eclipse.wtp.web.capabilities ................... SKIPPED
[INFO] org.eclipse.wtp.xml.capabilities ................... SKIPPED
[INFO] org.eclipse.wtp.capabilities.feature ............... SKIPPED
[INFO] org.eclipse.wtp.capabilities ....................... SKIPPED
[INFO] org.eclipse.wtp.feature.branding.template .......... SKIPPED
[INFO] org.eclipse.wtp.jee ................................ SKIPPED
[INFO] repositories ....................................... SKIPPED
[INFO] org.eclipse.webtools.dali .......................... SKIPPED
[INFO] org.eclipse.jpt.common.utility ..................... SKIPPED
[INFO] org.eclipse.jpt.common.core ........................ SKIPPED
[INFO] org.eclipse.jpt.common.eclipselink.core ............ SKIPPED
[INFO] org.eclipse.jpt.common.ui .......................... SKIPPED
[INFO] org.eclipse.jpt.common.branding .................... SKIPPED
[INFO] org.eclipse.jpt.common.feature ..................... SKIPPED
[INFO] org.eclipse.jpt.common.eclipselink.branding ........ SKIPPED
[INFO] org.eclipse.jpt.common.eclipselink.feature ......... SKIPPED
[INFO] org.eclipse.jpt.common.eclipselink_sdk.feature ..... SKIPPED
[INFO] org.eclipse.jpt.common_sdk.feature ................. SKIPPED
[INFO] org.eclipse.jpt.dbws.eclipselink.core.gen .......... SKIPPED
[INFO] org.eclipse.jpt.dbws.eclipselink.ui ................ SKIPPED
[INFO] org.eclipse.jpt.dbws.eclipselink.branding .......... SKIPPED
[INFO] org.eclipse.jpt.dbws.eclipselink.feature ........... SKIPPED
[INFO] org.eclipse.jpt.dbws.eclipselink_sdk.feature ....... SKIPPED
[INFO] org.eclipse.jpt.jaxb.core .......................... SKIPPED
[INFO] org.eclipse.jpt.jaxb.core.schemagen ................ SKIPPED
[INFO] org.eclipse.jpt.jaxb.eclipselink.core .............. SKIPPED
[INFO] org.eclipse.jpt.jaxb.eclipselink.core.schemagen .... SKIPPED
[INFO] org.eclipse.jpt.jaxb.ui ............................ SKIPPED
[INFO] org.eclipse.jpt.jaxb.branding ...................... SKIPPED
[INFO] org.eclipse.jpt.jaxb.feature ....................... SKIPPED
[INFO] org.eclipse.jpt.jaxb.eclipselink.ui ................ SKIPPED
[INFO] org.eclipse.jpt.jaxb.eclipselink.branding .......... SKIPPED
[INFO] org.eclipse.jpt.jaxb.eclipselink.feature ........... SKIPPED
[INFO] org.eclipse.jpt.jaxb.eclipselink_sdk.feature ....... SKIPPED
[INFO] org.eclipse.jpt.jaxb_sdk.feature ................... SKIPPED
[INFO] org.eclipse.jpt.jpa.db ............................. SKIPPED
[INFO] org.eclipse.jpt.jpa.core ........................... SKIPPED
[INFO] org.eclipse.jpt.jpa.annotate ....................... SKIPPED
[INFO] org.eclipse.jpt.jpa.db.ui .......................... SKIPPED
[INFO] org.eclipse.jpt.jpa.eclipselink.core ............... SKIPPED
[INFO] org.eclipse.jpt.jpa.eclipselink.core.ddlgen ........ SKIPPED
[INFO] org.eclipse.jpt.jpa.gen ............................ SKIPPED
[INFO] org.eclipse.jpt.jpa.ui ............................. SKIPPED
[INFO] org.eclipse.jpt.doc.user ........................... SKIPPED
[INFO] org.eclipse.jpt.jpa.branding ....................... SKIPPED
[INFO] org.eclipse.jpt.jpa.feature ........................ SKIPPED
[INFO] org.eclipse.jpt.jpa.eclipselink.ui ................. SKIPPED
[INFO] org.eclipse.jpt.jpa.eclipselink.branding ........... SKIPPED
[INFO] org.eclipse.jpt.jpa.eclipselink.feature ............ SKIPPED
[INFO] org.eclipse.jpt.jpa.eclipselink_sdk.feature ........ SKIPPED
[INFO] org.eclipse.jpt.doc.isv ............................ SKIPPED
[INFO] org.eclipse.jpt.jpa_sdk.feature .................... SKIPPED
[INFO] JPA Diagram Editor Branding Plug-in ................ SKIPPED
[INFO] JPA Diagram Editor Plug-in ......................... SKIPPED
[INFO] JPA Diagram Editor Branding Plug-in ................ SKIPPED
[INFO] JPA Diagram Editor Feature ......................... SKIPPED
[INFO] org.eclipse.jpt.jpadiagrameditor_sdk.feature ....... SKIPPED
[INFO] dali4x-sdk ......................................... SKIPPED
[INFO] org.eclipse.jpt.common.utility.tests ............... SKIPPED
[INFO] org.eclipse.jpt.common.core.tests .................. SKIPPED
[INFO] org.eclipse.jpt.common.tests.feature ............... SKIPPED
[INFO] org.eclipse.jpt.jpa.core.tests.extension.resource .. SKIPPED
[INFO] org.eclipse.jpt.jpa.tests.feature .................. SKIPPED
[INFO] org.eclipse.jpt.jaxb.eclipselink.tests.feature ..... SKIPPED
[INFO] org.eclipse.jpt.jaxb.tests.feature ................. SKIPPED
[INFO] JPA Diagram Editor Test Plug-in .................... SKIPPED
[INFO] org.eclipse.jpt.jpadiagrameditor.tests.feature ..... SKIPPED
[INFO] dali4x.tests ....................................... SKIPPED
[INFO] jst4x-sdk .......................................... SKIPPED
[INFO] jst4x.tests ........................................ SKIPPED
[INFO] org.eclipse.wst.jsdt.chromium_sdk.feature .......... SKIPPED
[INFO] wst4x-sdk .......................................... SKIPPED
[INFO] org.eclipse.wst.jsdt.chromium.debug.core.tests ..... SKIPPED
[INFO] org.eclipse.wst.jsdt.chromium.tests ................ SKIPPED
[INFO] org.eclipse.wst.jsdt.chromium_tests.feature ........ SKIPPED
[INFO] sourceediting.json.tests ........................... SKIPPED
[INFO] org.eclipse.wst.json.core.tests .................... SKIPPED
[INFO] org.eclipse.wst.json_tests.feature ................. SKIPPED
[INFO] wst4x.tests ........................................ SKIPPED
[INFO] repository ......................................... SKIPPED
[INFO] repositoryunittests ................................ SKIPPED
[INFO] org.eclipse.webtools.common.site ................... SKIPPED
[INFO] org.eclipse.servertools.doc.isv .................... SKIPPED
[INFO] org.eclipse.wst.server.http.core.tests ............. SKIPPED
[INFO] org.eclipse.wst.server.util.tests .................. SKIPPED
[INFO] org.eclipse.webtools.servertools.site .............. SKIPPED
[INFO] org.eclipse.wst.server_sdk.feature ................. SKIPPED
[INFO] org.eclipse.wst.jsdt.js.common.tests ............... SKIPPED
[INFO] org.eclipse.wst.jsdt.integration.tests ............. SKIPPED
[INFO] org.eclipse.webtools.jsdt.site ..................... SKIPPED
[INFO] PsychoPath XPath 2.0 Processor: SDK Documentation .. SKIPPED
[INFO] PsychoPath XPath 2.0 Processor: SDK Feature ........ SKIPPED
[INFO] PsychoPath XPath 2.0 Processor: Tests for WTP type support SKIPPED
[INFO] org.eclipse.webtools.sourceediting.site ............ SKIPPED
[INFO] org.eclipse.jst.doc.user.feature ................... SKIPPED
[INFO] org.eclipse.webtools.javaee.site ................... SKIPPED
[INFO] org.eclipse.jpt.assembly.feature ................... SKIPPED
[INFO] org.eclipse.jpt_sdk.assembly.feature ............... SKIPPED
[INFO] org.eclipse.jpt.tests.assembly.feature ............. SKIPPED
[INFO] JPA Editor Update Site ............................. SKIPPED
[INFO] org.eclipse.webtools.dali.site ..................... SKIPPED
[INFO] org.eclipse.jsf.assembly.feature ................... SKIPPED
[INFO] org.eclipse.jst.jsf.doc.feature .................... SKIPPED
[INFO] org.eclipse.webtools.jsf.site ...................... SKIPPED
[INFO] org.eclipse.webtools.webservices.site .............. SKIPPED
[INFO] org.eclipse.jst.ws.jaxws.assembly.feature .......... SKIPPED
[INFO] wtp-aggregator ..................................... SKIPPED
[INFO] ------------------------------------------------------------------------
[INFO] BUILD FAILURE
[INFO] ------------------------------------------------------------------------
[INFO] Total time: 01:20 h
[INFO] Finished at: 2018-01-28T00:08:58-05:00
[INFO] Final Memory: 1009M/6345M
[INFO] ------------------------------------------------------------------------
[INFO] o.h.m.e.h.MavenExecutionResultHandler - Build failed with exception(s)
[INFO] o.h.m.e.h.MavenExecutionResultHandler - [1] org.apache.maven.lifecycle.LifecycleExecutionException: Failed to execute goal org.eclipse.tycho.extras:tycho-pack200a-plugin:1.1.0-SNAPSHOT:normalize (pack200-normalize) on project org.eclipse.jst.jsf.facesconfig.ui.test: Execution pack200-normalize of goal org.eclipse.tycho.extras:tycho-pack200a-plugin:1.1.0-SNAPSHOT:normalize failed: Could not execute pack200, see log for details.
[DEBUG] Closing connection to remote
[ERROR] Failed to execute goal org.eclipse.tycho.extras:tycho-pack200a-plugin:1.1.0-SNAPSHOT:normalize (pack200-normalize) on project org.eclipse.jst.jsf.facesconfig.ui.test: Execution pack200-normalize of goal org.eclipse.tycho.extras:tycho-pack200a-plugin:1.1.0-SNAPSHOT:normalize failed: Could not execute pack200, see log for details. Error while executing external command, process killed. Process timeout out after 100 seconds -> [Help 1]
[ERROR]
[ERROR] To see the full stack trace of the errors, re-run Maven with the -e switch.
[ERROR] Re-run Maven using the -X switch to enable full debug logging.
[ERROR]
[ERROR] For more information about the errors and possible solutions, please read the following articles:
[ERROR] [Help 1] http://cwiki.apache.org/confluence/display/MAVEN/PluginExecutionException
[ERROR]
[ERROR] After correcting the problems, you can resume the build with the command
[ERROR]   mvn <goals> -rf :org.eclipse.jst.jsf.facesconfig.ui.test
[DEBUG] Waiting for process to finish
[DEBUG] Result: 1
Terminating xvnc.
Archiving artifacts

--
This message is automatically generated by Hudson.
For more information on Hudson, see: http://hudson-ci.org/
_______________________________________________
wtp-releng mailing list
[hidden email]
To change your delivery options, retrieve your password, or unsubscribe from this list, visit
https://dev.eclipse.org/mailman/listinfo/wtp-releng
Reply | Threaded
Open this post in threaded view
|

[Hudson] Build failed in Hudson: WTP-R3_10_Integration #241

hudsonbuild
See <https://hudson.eclipse.org/webtools/job/WTP-R3_10_Integration/241/>

------------------------------------------
[...truncated 366631 lines...]
[INFO] PsychoPath XPath 2.0 Processor ..................... SUCCESS [ 10.934 s]
[INFO] org.eclipse.wst.xml.xpath.ui ....................... SUCCESS [ 11.816 s]
[INFO] sourceediting.xpath.docs ........................... SUCCESS [  0.097 s]
[INFO] PsychoPath XPath 2.0 Processor: User Documentation . SUCCESS [  6.154 s]
[INFO] PsychoPath XPath 2.0 Processor: Branding Plug-in ... SUCCESS [ 11.737 s]
[INFO] sourceediting.xpath.features ....................... SUCCESS [  0.104 s]
[INFO] PsychoPath XPath 2.0 Processor Feature ............. SUCCESS [  5.982 s]
[INFO] sourceediting.xsl .................................. SUCCESS [  1.126 s]
[INFO] sourceediting.xsl.bundles .......................... SUCCESS [  0.257 s]
[INFO] XSLT Core Plugin ................................... SUCCESS [ 22.145 s]
[INFO] XSLT Launching Plugin .............................. SUCCESS [ 13.787 s]
[INFO] XSLT Debug UI Plugin ............................... SUCCESS [ 46.046 s]
[INFO] sourceediting.xsl.docs ............................. SUCCESS [  0.117 s]
[INFO] org.eclipse.wst.xsl.doc ............................ SUCCESS [01:11 min]
[INFO] XSLT EXSLT Core Plugin ............................. SUCCESS [01:05 min]
[INFO] XSLT UI Plugin ..................................... SUCCESS [ 49.029 s]
[INFO] XSLT EXSLT UI Plugin ............................... SUCCESS [  2.677 s]
[INFO] XSLT JAXP Debug Plugin ............................. SUCCESS [  2.806 s]
[INFO] XSLT Xalan Plugin .................................. FAILURE [  0.464 s]
[INFO] XSLT Saxon Plugin .................................. SKIPPED
[INFO] XSL Tools Branding Plugin .......................... SKIPPED
[INFO] XSLT JAXP Launching UI Plugin ...................... SKIPPED
[INFO] XSLT JAXP Debug UI Plugin .......................... SKIPPED
[INFO] sourceediting.xsl.features ......................... SKIPPED
[INFO] XSLT FeaturePlugin ................................. SKIPPED
[INFO] org.eclipse.wst.xsl.sdk.documentation .............. SKIPPED
[INFO] org.eclipse.wst.xsl_sdk.feature .................... SKIPPED
[INFO] org.eclipse.wst.server.http.core ................... SKIPPED
[INFO] org.eclipse.wst.server.http.ui ..................... SKIPPED
[INFO] org.eclipse.wst.server.preview ..................... SKIPPED
[INFO] org.eclipse.wst.server.preview.adapter ............. SKIPPED
[INFO] org.eclipse.wst.server_adapters.feature ............ SKIPPED
[INFO] org.eclipse.wst.server_adapters.sdk.feature ........ SKIPPED
[INFO] org.eclipse.wst.sdk ................................ SKIPPED
[INFO] org.eclipse.wst.common.project.facet.core.tests .... SKIPPED
[INFO] org.eclipse.wst.common.project.facet.ui.tests ...... SKIPPED
[INFO] org.eclipse.wst.common.snippets.tests .............. SKIPPED
[INFO] org.eclipse.wst.common.tests.ui .................... SKIPPED
[INFO] org.eclipse.wst.common.tests.validation ............ SKIPPED
[INFO] org.eclipse.wst.common.tests.validation.guard ...... SKIPPED
[INFO] org.eclipse.wst.internet.cache.tests ............... SKIPPED
[INFO] org.eclipse.wst.common_tests.feature ............... SKIPPED
[INFO] org.eclipse.wst.css.core.tests ..................... SKIPPED
[INFO] org.eclipse.wst.css.tests.encoding ................. SKIPPED
[INFO] org.eclipse.wst.css.ui.tests ....................... SKIPPED
[INFO] org.eclipse.wst.dtd.core.tests ..................... SKIPPED
[INFO] org.eclipse.wst.dtd.ui.tests ....................... SKIPPED
[INFO] org.eclipse.wst.html.core.tests .................... SKIPPED
[INFO] org.eclipse.wst.html.tests.encoding ................ SKIPPED
[INFO] org.eclipse.wst.html.ui.tests ...................... SKIPPED
[INFO] org.eclipse.wst.internet.monitor.core.tests ........ SKIPPED
[INFO] org.eclipse.wst.internet.monitor.ui.tests .......... SKIPPED
[INFO] tests .............................................. SKIPPED
[INFO] org.eclipse.wst.jsdt.core.tests.compiler ........... SKIPPED
[INFO] org.eclipse.wst.jsdt.core.tests.model .............. SKIPPED
[INFO] org.eclipse.wst.jsdt.debug.core.tests .............. SKIPPED
[INFO] org.eclipse.wst.jsdt.debug.rhino.tests ............. SKIPPED
[INFO] org.eclipse.wst.jsdt.js.node.common.tests .......... SKIPPED
[INFO] org.eclipse.wst.jsdt.ui.tests ...................... SKIPPED
[INFO] org.eclipse.wst.jsdt.web.core.tests ................ SKIPPED
[INFO] org.eclipse.wst.jsdt.web.ui.tests .................. SKIPPED
[INFO] org.eclipse.wst.jsdt_tests.feature ................. SKIPPED
[INFO] org.eclipse.wst.server_tests.feature ............... SKIPPED
[INFO] sourceediting.core.tests ........................... SKIPPED
[INFO] org.eclipse.wst.sse.core.tests ..................... SKIPPED
[INFO] org.eclipse.wst.sse.ui.tests ....................... SKIPPED
[INFO] org.eclipse.wtp.releng.fixups ...................... SKIPPED
[INFO] org.eclipse.wtp.releng.fixups.feature .............. SKIPPED
[INFO] org.eclipse.wtp.releng.tests ....................... SKIPPED
[INFO] org.eclipse.wtp.releng.tools ....................... SKIPPED
[INFO] org.eclipse.wtp.releng.tools.feature ............... SKIPPED
[INFO] org.eclipse.wtp.releng.tests.feature ............... SKIPPED
[INFO] org.eclipse.wst.xml.catalog.tests .................. SKIPPED
[INFO] org.eclipse.wst.xml.core.tests ..................... SKIPPED
[INFO] org.eclipse.wst.xml.ui.tests ....................... SKIPPED
[INFO] org.eclipse.wst.xml.validation.tests ............... SKIPPED
[INFO] org.eclipse.wst.xsd.validation.tests ............... SKIPPED
[INFO] org.eclipse.wst.xsd.core.tests ..................... SKIPPED
[INFO] org.eclipse.wst.xsd.ui.tests ....................... SKIPPED
[INFO] org.eclipse.wst.xml_tests.feature .................. SKIPPED
[INFO] sourceediting.xpath.tests .......................... SKIPPED
[INFO] org.eclipse.wst.xml.xpath.core.tests ............... SKIPPED
[INFO] org.eclipse.wst.xml.xpath.ui.tests ................. SKIPPED
[INFO] PsychoPath XPath 2.0 Processor: XQuery Test Suite .. SKIPPED
[INFO] PsychoPath XPath 2.0 Processor: Tests .............. SKIPPED
[INFO] sourceediting.xsl.tests ............................ SKIPPED
[INFO] XSLT Core Tests .................................... SKIPPED
[INFO] EXSLT Core Tests ................................... SKIPPED
[INFO] XSLT UI Tests ...................................... SKIPPED
[INFO] EXSLT UI Tests ..................................... SKIPPED
[INFO] JAXP Debug Tests ................................... SKIPPED
[INFO] XSL Launching Tests ................................ SKIPPED
[INFO] org.eclipse.wst.xsl.tests .......................... SKIPPED
[INFO] org.eclipse.wst.xsl_tests.feature .................. SKIPPED
[INFO] org.eclipse.wst.web_tests.feature .................. SKIPPED
[INFO] org.eclipse.wst.tests.feature ...................... SKIPPED
[INFO] org.eclipse.wtp.requiredpreques .................... SKIPPED
[INFO] org.eclipse.wtp.xml.dev ............................ SKIPPED
[INFO] org.eclipse.wtp.xml.dev.assembly.feature ........... SKIPPED
[INFO] org.uddi4j.feature ................................. SKIPPED
[INFO] org.eclipse.jst .................................... SKIPPED
[INFO] org.eclipse.wst .................................... SKIPPED
[INFO] org.eclipse.wst.doc.isv.feature .................... SKIPPED
[INFO] org.eclipse.wst.doc.user.feature ................... SKIPPED
[INFO] org.eclipse.wtp.epp.package.jee.intro .............. SKIPPED
[INFO] org.eclipse.wtp.epp.package.capabilities ........... SKIPPED
[INFO] org.eclipse.wtp.javascript.capabilities ............ SKIPPED
[INFO] org.eclipse.wtp.jee.capabilities ................... SKIPPED
[INFO] org.eclipse.wtp.web.capabilities ................... SKIPPED
[INFO] org.eclipse.wtp.xml.capabilities ................... SKIPPED
[INFO] org.eclipse.wtp.capabilities.feature ............... SKIPPED
[INFO] org.eclipse.wtp.capabilities ....................... SKIPPED
[INFO] org.eclipse.wtp.feature.branding.template .......... SKIPPED
[INFO] org.eclipse.wtp.jee ................................ SKIPPED
[INFO] repositories ....................................... SKIPPED
[INFO] org.eclipse.webtools.dali .......................... SKIPPED
[INFO] org.eclipse.jpt.common.utility ..................... SKIPPED
[INFO] org.eclipse.jpt.common.core ........................ SKIPPED
[INFO] org.eclipse.jpt.common.eclipselink.core ............ SKIPPED
[INFO] org.eclipse.jpt.common.ui .......................... SKIPPED
[INFO] org.eclipse.jpt.common.branding .................... SKIPPED
[INFO] org.eclipse.jpt.common.feature ..................... SKIPPED
[INFO] org.eclipse.jpt.common.eclipselink.branding ........ SKIPPED
[INFO] org.eclipse.jpt.common.eclipselink.feature ......... SKIPPED
[INFO] org.eclipse.jpt.common.eclipselink_sdk.feature ..... SKIPPED
[INFO] org.eclipse.jpt.common_sdk.feature ................. SKIPPED
[INFO] org.eclipse.jpt.dbws.eclipselink.core.gen .......... SKIPPED
[INFO] org.eclipse.jpt.dbws.eclipselink.ui ................ SKIPPED
[INFO] org.eclipse.jpt.dbws.eclipselink.branding .......... SKIPPED
[INFO] org.eclipse.jpt.dbws.eclipselink.feature ........... SKIPPED
[INFO] org.eclipse.jpt.dbws.eclipselink_sdk.feature ....... SKIPPED
[INFO] org.eclipse.jpt.jaxb.core .......................... SKIPPED
[INFO] org.eclipse.jpt.jaxb.core.schemagen ................ SKIPPED
[INFO] org.eclipse.jpt.jaxb.eclipselink.core .............. SKIPPED
[INFO] org.eclipse.jpt.jaxb.eclipselink.core.schemagen .... SKIPPED
[INFO] org.eclipse.jpt.jaxb.ui ............................ SKIPPED
[INFO] org.eclipse.jpt.jaxb.branding ...................... SKIPPED
[INFO] org.eclipse.jpt.jaxb.feature ....................... SKIPPED
[INFO] org.eclipse.jpt.jaxb.eclipselink.ui ................ SKIPPED
[INFO] org.eclipse.jpt.jaxb.eclipselink.branding .......... SKIPPED
[INFO] org.eclipse.jpt.jaxb.eclipselink.feature ........... SKIPPED
[INFO] org.eclipse.jpt.jaxb.eclipselink_sdk.feature ....... SKIPPED
[INFO] org.eclipse.jpt.jaxb_sdk.feature ................... SKIPPED
[INFO] org.eclipse.jpt.jpa.db ............................. SKIPPED
[INFO] org.eclipse.jpt.jpa.core ........................... SKIPPED
[INFO] org.eclipse.jpt.jpa.annotate ....................... SKIPPED
[INFO] org.eclipse.jpt.jpa.db.ui .......................... SKIPPED
[INFO] org.eclipse.jpt.jpa.eclipselink.core ............... SKIPPED
[INFO] org.eclipse.jpt.jpa.eclipselink.core.ddlgen ........ SKIPPED
[INFO] org.eclipse.jpt.jpa.gen ............................ SKIPPED
[INFO] org.eclipse.jpt.jpa.ui ............................. SKIPPED
[INFO] org.eclipse.jpt.doc.user ........................... SKIPPED
[INFO] org.eclipse.jpt.jpa.branding ....................... SKIPPED
[INFO] org.eclipse.jpt.jpa.feature ........................ SKIPPED
[INFO] org.eclipse.jpt.jpa.eclipselink.ui ................. SKIPPED
[INFO] org.eclipse.jpt.jpa.eclipselink.branding ........... SKIPPED
[INFO] org.eclipse.jpt.jpa.eclipselink.feature ............ SKIPPED
[INFO] org.eclipse.jpt.jpa.eclipselink_sdk.feature ........ SKIPPED
[INFO] org.eclipse.jpt.doc.isv ............................ SKIPPED
[INFO] org.eclipse.jpt.jpa_sdk.feature .................... SKIPPED
[INFO] JPA Diagram Editor Branding Plug-in ................ SKIPPED
[INFO] JPA Diagram Editor Plug-in ......................... SKIPPED
[INFO] JPA Diagram Editor Branding Plug-in ................ SKIPPED
[INFO] JPA Diagram Editor Feature ......................... SKIPPED
[INFO] org.eclipse.jpt.jpadiagrameditor_sdk.feature ....... SKIPPED
[INFO] dali4x-sdk ......................................... SKIPPED
[INFO] org.eclipse.jpt.common.utility.tests ............... SKIPPED
[INFO] org.eclipse.jpt.common.core.tests .................. SKIPPED
[INFO] org.eclipse.jpt.common.tests.feature ............... SKIPPED
[INFO] org.eclipse.jpt.jpa.core.tests.extension.resource .. SKIPPED
[INFO] org.eclipse.jpt.jpa.tests.feature .................. SKIPPED
[INFO] org.eclipse.jpt.jaxb.eclipselink.tests.feature ..... SKIPPED
[INFO] org.eclipse.jpt.jaxb.tests.feature ................. SKIPPED
[INFO] JPA Diagram Editor Test Plug-in .................... SKIPPED
[INFO] org.eclipse.jpt.jpadiagrameditor.tests.feature ..... SKIPPED
[INFO] dali4x.tests ....................................... SKIPPED
[INFO] jst4x-sdk .......................................... SKIPPED
[INFO] jst4x.tests ........................................ SKIPPED
[INFO] org.eclipse.wst.jsdt.chromium_sdk.feature .......... SKIPPED
[INFO] wst4x-sdk .......................................... SKIPPED
[INFO] org.eclipse.wst.jsdt.chromium.debug.core.tests ..... SKIPPED
[INFO] org.eclipse.wst.jsdt.chromium.tests ................ SKIPPED
[INFO] org.eclipse.wst.jsdt.chromium_tests.feature ........ SKIPPED
[INFO] sourceediting.json.tests ........................... SKIPPED
[INFO] org.eclipse.wst.json.core.tests .................... SKIPPED
[INFO] org.eclipse.wst.json_tests.feature ................. SKIPPED
[INFO] wst4x.tests ........................................ SKIPPED
[INFO] repository ......................................... SKIPPED
[INFO] repositoryunittests ................................ SKIPPED
[INFO] org.eclipse.webtools.common.site ................... SKIPPED
[INFO] org.eclipse.servertools.doc.isv .................... SKIPPED
[INFO] org.eclipse.wst.server.http.core.tests ............. SKIPPED
[INFO] org.eclipse.wst.server.util.tests .................. SKIPPED
[INFO] org.eclipse.webtools.servertools.site .............. SKIPPED
[INFO] org.eclipse.wst.server_sdk.feature ................. SKIPPED
[INFO] org.eclipse.wst.jsdt.js.common.tests ............... SKIPPED
[INFO] org.eclipse.wst.jsdt.integration.tests ............. SKIPPED
[INFO] org.eclipse.webtools.jsdt.site ..................... SKIPPED
[INFO] PsychoPath XPath 2.0 Processor: SDK Documentation .. SKIPPED
[INFO] PsychoPath XPath 2.0 Processor: SDK Feature ........ SKIPPED
[INFO] PsychoPath XPath 2.0 Processor: Tests for WTP type support SKIPPED
[INFO] org.eclipse.webtools.sourceediting.site ............ SKIPPED
[INFO] org.eclipse.jst.doc.user.feature ................... SKIPPED
[INFO] org.eclipse.webtools.javaee.site ................... SKIPPED
[INFO] org.eclipse.jpt.assembly.feature ................... SKIPPED
[INFO] org.eclipse.jpt_sdk.assembly.feature ............... SKIPPED
[INFO] org.eclipse.jpt.tests.assembly.feature ............. SKIPPED
[INFO] JPA Editor Update Site ............................. SKIPPED
[INFO] org.eclipse.webtools.dali.site ..................... SKIPPED
[INFO] org.eclipse.jsf.assembly.feature ................... SKIPPED
[INFO] org.eclipse.jst.jsf.doc.feature .................... SKIPPED
[INFO] org.eclipse.webtools.jsf.site ...................... SKIPPED
[INFO] org.eclipse.webtools.webservices.site .............. SKIPPED
[INFO] org.eclipse.jst.ws.jaxws.assembly.feature .......... SKIPPED
[INFO] wtp-aggregator ..................................... SKIPPED
[INFO] ------------------------------------------------------------------------
[INFO] BUILD FAILURE
[INFO] ------------------------------------------------------------------------
[INFO] Total time: 03:33 h
[INFO] Finished at: 2018-01-28T04:41:26-05:00
[INFO] Final Memory: 1093M/9378M
[INFO] ------------------------------------------------------------------------
[INFO] o.h.m.e.h.MavenExecutionResultHandler - Build failed with exception(s)
[INFO] o.h.m.e.h.MavenExecutionResultHandler - [1] org.apache.maven.lifecycle.LifecycleExecutionException: Failed to execute goal org.eclipse.tycho:tycho-compiler-plugin:1.1.0-SNAPSHOT:compile (default-compile) on project org.eclipse.wst.xsl.xalan: Compilation failure
[DEBUG] Closing connection to remote
[ERROR] Failed to execute goal org.eclipse.tycho:tycho-compiler-plugin:1.1.0-SNAPSHOT:compile (default-compile) on project org.eclipse.wst.xsl.xalan: Compilation failure: Compilation failure:
[ERROR] /jobs/genie.webtools/WTP-R3_10_Integration/workspace/webtools.sourceediting/xsl/bundles/org.eclipse.wst.xsl.xalan/src-debugger/org/eclipse/wst/xsl/xalan/debugger/XalanDebugger.java:[46]
[ERROR] lastTransformerInChain.getSerializationHandler().flushPending();
[ERROR]                       ^^^^^^^^^^^^^^^^^^^^^^^
[ERROR] The method getSerializationHandler() is undefined for the type TransformerImpl
[ERROR] /jobs/genie.webtools/WTP-R3_10_Integration/workspace/webtools.sourceediting/xsl/bundles/org.eclipse.wst.xsl.xalan/src-debugger/org/eclipse/wst/xsl/xalan/debugger/XalanStyleFrame.java:[131]
[ERROR] currentLine = e.m_styleNode.getEndLineNumber();
[ERROR]                            ^^^^^^^^^^^^^^^^
[ERROR] The method getEndLineNumber() is undefined for the type ElemTemplateElement
[ERROR] 2 problems (2 errors)
[ERROR] -> [Help 1]
[ERROR]
[ERROR] To see the full stack trace of the errors, re-run Maven with the -e switch.
[ERROR] Re-run Maven using the -X switch to enable full debug logging.
[ERROR]
[ERROR] For more information about the errors and possible solutions, please read the following articles:
[ERROR] [Help 1] http://cwiki.apache.org/confluence/display/MAVEN/MojoFailureException
[ERROR]
[ERROR] After correcting the problems, you can resume the build with the command
[ERROR]   mvn <goals> -rf :org.eclipse.wst.xsl.xalan
[DEBUG] Waiting for process to finish
[DEBUG] Result: 1
Terminating xvnc.
Archiving artifacts

--
This message is automatically generated by Hudson.
For more information on Hudson, see: http://hudson-ci.org/
_______________________________________________
wtp-releng mailing list
[hidden email]
To change your delivery options, retrieve your password, or unsubscribe from this list, visit
https://dev.eclipse.org/mailman/listinfo/wtp-releng
Reply | Threaded
Open this post in threaded view
|

[Hudson] Build failed in Hudson: WTP-R3_10_Integration #242

hudsonbuild
See <https://hudson.eclipse.org/webtools/job/WTP-R3_10_Integration/242/changes>

Changes:

[nickboldt] uncomment eclipse.* variables

[nickboldt] fix typo

------------------------------------------
[...truncated 366635 lines...]
[INFO] PsychoPath XPath 2.0 Processor ..................... SUCCESS [ 12.660 s]
[INFO] org.eclipse.wst.xml.xpath.ui ....................... SUCCESS [ 17.746 s]
[INFO] sourceediting.xpath.docs ........................... SUCCESS [  0.068 s]
[INFO] PsychoPath XPath 2.0 Processor: User Documentation . SUCCESS [ 10.920 s]
[INFO] PsychoPath XPath 2.0 Processor: Branding Plug-in ... SUCCESS [  5.756 s]
[INFO] sourceediting.xpath.features ....................... SUCCESS [  0.089 s]
[INFO] PsychoPath XPath 2.0 Processor Feature ............. SUCCESS [  8.887 s]
[INFO] sourceediting.xsl .................................. SUCCESS [  0.785 s]
[INFO] sourceediting.xsl.bundles .......................... SUCCESS [  0.330 s]
[INFO] XSLT Core Plugin ................................... SUCCESS [ 10.286 s]
[INFO] XSLT Launching Plugin .............................. SUCCESS [ 10.111 s]
[INFO] XSLT Debug UI Plugin ............................... SUCCESS [ 11.218 s]
[INFO] sourceediting.xsl.docs ............................. SUCCESS [  0.077 s]
[INFO] org.eclipse.wst.xsl.doc ............................ SUCCESS [ 20.872 s]
[INFO] XSLT EXSLT Core Plugin ............................. SUCCESS [  4.341 s]
[INFO] XSLT UI Plugin ..................................... SUCCESS [ 52.037 s]
[INFO] XSLT EXSLT UI Plugin ............................... SUCCESS [  5.506 s]
[INFO] XSLT JAXP Debug Plugin ............................. SUCCESS [  5.786 s]
[INFO] XSLT Xalan Plugin .................................. FAILURE [  0.491 s]
[INFO] XSLT Saxon Plugin .................................. SKIPPED
[INFO] XSL Tools Branding Plugin .......................... SKIPPED
[INFO] XSLT JAXP Launching UI Plugin ...................... SKIPPED
[INFO] XSLT JAXP Debug UI Plugin .......................... SKIPPED
[INFO] sourceediting.xsl.features ......................... SKIPPED
[INFO] XSLT FeaturePlugin ................................. SKIPPED
[INFO] org.eclipse.wst.xsl.sdk.documentation .............. SKIPPED
[INFO] org.eclipse.wst.xsl_sdk.feature .................... SKIPPED
[INFO] org.eclipse.wst.server.http.core ................... SKIPPED
[INFO] org.eclipse.wst.server.http.ui ..................... SKIPPED
[INFO] org.eclipse.wst.server.preview ..................... SKIPPED
[INFO] org.eclipse.wst.server.preview.adapter ............. SKIPPED
[INFO] org.eclipse.wst.server_adapters.feature ............ SKIPPED
[INFO] org.eclipse.wst.server_adapters.sdk.feature ........ SKIPPED
[INFO] org.eclipse.wst.sdk ................................ SKIPPED
[INFO] org.eclipse.wst.common.project.facet.core.tests .... SKIPPED
[INFO] org.eclipse.wst.common.project.facet.ui.tests ...... SKIPPED
[INFO] org.eclipse.wst.common.snippets.tests .............. SKIPPED
[INFO] org.eclipse.wst.common.tests.ui .................... SKIPPED
[INFO] org.eclipse.wst.common.tests.validation ............ SKIPPED
[INFO] org.eclipse.wst.common.tests.validation.guard ...... SKIPPED
[INFO] org.eclipse.wst.internet.cache.tests ............... SKIPPED
[INFO] org.eclipse.wst.common_tests.feature ............... SKIPPED
[INFO] org.eclipse.wst.css.core.tests ..................... SKIPPED
[INFO] org.eclipse.wst.css.tests.encoding ................. SKIPPED
[INFO] org.eclipse.wst.css.ui.tests ....................... SKIPPED
[INFO] org.eclipse.wst.dtd.core.tests ..................... SKIPPED
[INFO] org.eclipse.wst.dtd.ui.tests ....................... SKIPPED
[INFO] org.eclipse.wst.html.core.tests .................... SKIPPED
[INFO] org.eclipse.wst.html.tests.encoding ................ SKIPPED
[INFO] org.eclipse.wst.html.ui.tests ...................... SKIPPED
[INFO] org.eclipse.wst.internet.monitor.core.tests ........ SKIPPED
[INFO] org.eclipse.wst.internet.monitor.ui.tests .......... SKIPPED
[INFO] tests .............................................. SKIPPED
[INFO] org.eclipse.wst.jsdt.core.tests.compiler ........... SKIPPED
[INFO] org.eclipse.wst.jsdt.core.tests.model .............. SKIPPED
[INFO] org.eclipse.wst.jsdt.debug.core.tests .............. SKIPPED
[INFO] org.eclipse.wst.jsdt.debug.rhino.tests ............. SKIPPED
[INFO] org.eclipse.wst.jsdt.js.node.common.tests .......... SKIPPED
[INFO] org.eclipse.wst.jsdt.ui.tests ...................... SKIPPED
[INFO] org.eclipse.wst.jsdt.web.core.tests ................ SKIPPED
[INFO] org.eclipse.wst.jsdt.web.ui.tests .................. SKIPPED
[INFO] org.eclipse.wst.jsdt_tests.feature ................. SKIPPED
[INFO] org.eclipse.wst.server_tests.feature ............... SKIPPED
[INFO] sourceediting.core.tests ........................... SKIPPED
[INFO] org.eclipse.wst.sse.core.tests ..................... SKIPPED
[INFO] org.eclipse.wst.sse.ui.tests ....................... SKIPPED
[INFO] org.eclipse.wtp.releng.fixups ...................... SKIPPED
[INFO] org.eclipse.wtp.releng.fixups.feature .............. SKIPPED
[INFO] org.eclipse.wtp.releng.tests ....................... SKIPPED
[INFO] org.eclipse.wtp.releng.tools ....................... SKIPPED
[INFO] org.eclipse.wtp.releng.tools.feature ............... SKIPPED
[INFO] org.eclipse.wtp.releng.tests.feature ............... SKIPPED
[INFO] org.eclipse.wst.xml.catalog.tests .................. SKIPPED
[INFO] org.eclipse.wst.xml.core.tests ..................... SKIPPED
[INFO] org.eclipse.wst.xml.ui.tests ....................... SKIPPED
[INFO] org.eclipse.wst.xml.validation.tests ............... SKIPPED
[INFO] org.eclipse.wst.xsd.validation.tests ............... SKIPPED
[INFO] org.eclipse.wst.xsd.core.tests ..................... SKIPPED
[INFO] org.eclipse.wst.xsd.ui.tests ....................... SKIPPED
[INFO] org.eclipse.wst.xml_tests.feature .................. SKIPPED
[INFO] sourceediting.xpath.tests .......................... SKIPPED
[INFO] org.eclipse.wst.xml.xpath.core.tests ............... SKIPPED
[INFO] org.eclipse.wst.xml.xpath.ui.tests ................. SKIPPED
[INFO] PsychoPath XPath 2.0 Processor: XQuery Test Suite .. SKIPPED
[INFO] PsychoPath XPath 2.0 Processor: Tests .............. SKIPPED
[INFO] sourceediting.xsl.tests ............................ SKIPPED
[INFO] XSLT Core Tests .................................... SKIPPED
[INFO] EXSLT Core Tests ................................... SKIPPED
[INFO] XSLT UI Tests ...................................... SKIPPED
[INFO] EXSLT UI Tests ..................................... SKIPPED
[INFO] JAXP Debug Tests ................................... SKIPPED
[INFO] XSL Launching Tests ................................ SKIPPED
[INFO] org.eclipse.wst.xsl.tests .......................... SKIPPED
[INFO] org.eclipse.wst.xsl_tests.feature .................. SKIPPED
[INFO] org.eclipse.wst.web_tests.feature .................. SKIPPED
[INFO] org.eclipse.wst.tests.feature ...................... SKIPPED
[INFO] org.eclipse.wtp.requiredpreques .................... SKIPPED
[INFO] org.eclipse.wtp.xml.dev ............................ SKIPPED
[INFO] org.eclipse.wtp.xml.dev.assembly.feature ........... SKIPPED
[INFO] org.uddi4j.feature ................................. SKIPPED
[INFO] org.eclipse.jst .................................... SKIPPED
[INFO] org.eclipse.wst .................................... SKIPPED
[INFO] org.eclipse.wst.doc.isv.feature .................... SKIPPED
[INFO] org.eclipse.wst.doc.user.feature ................... SKIPPED
[INFO] org.eclipse.wtp.epp.package.jee.intro .............. SKIPPED
[INFO] org.eclipse.wtp.epp.package.capabilities ........... SKIPPED
[INFO] org.eclipse.wtp.javascript.capabilities ............ SKIPPED
[INFO] org.eclipse.wtp.jee.capabilities ................... SKIPPED
[INFO] org.eclipse.wtp.web.capabilities ................... SKIPPED
[INFO] org.eclipse.wtp.xml.capabilities ................... SKIPPED
[INFO] org.eclipse.wtp.capabilities.feature ............... SKIPPED
[INFO] org.eclipse.wtp.capabilities ....................... SKIPPED
[INFO] org.eclipse.wtp.feature.branding.template .......... SKIPPED
[INFO] org.eclipse.wtp.jee ................................ SKIPPED
[INFO] repositories ....................................... SKIPPED
[INFO] org.eclipse.webtools.dali .......................... SKIPPED
[INFO] org.eclipse.jpt.common.utility ..................... SKIPPED
[INFO] org.eclipse.jpt.common.core ........................ SKIPPED
[INFO] org.eclipse.jpt.common.eclipselink.core ............ SKIPPED
[INFO] org.eclipse.jpt.common.ui .......................... SKIPPED
[INFO] org.eclipse.jpt.common.branding .................... SKIPPED
[INFO] org.eclipse.jpt.common.feature ..................... SKIPPED
[INFO] org.eclipse.jpt.common.eclipselink.branding ........ SKIPPED
[INFO] org.eclipse.jpt.common.eclipselink.feature ......... SKIPPED
[INFO] org.eclipse.jpt.common.eclipselink_sdk.feature ..... SKIPPED
[INFO] org.eclipse.jpt.common_sdk.feature ................. SKIPPED
[INFO] org.eclipse.jpt.dbws.eclipselink.core.gen .......... SKIPPED
[INFO] org.eclipse.jpt.dbws.eclipselink.ui ................ SKIPPED
[INFO] org.eclipse.jpt.dbws.eclipselink.branding .......... SKIPPED
[INFO] org.eclipse.jpt.dbws.eclipselink.feature ........... SKIPPED
[INFO] org.eclipse.jpt.dbws.eclipselink_sdk.feature ....... SKIPPED
[INFO] org.eclipse.jpt.jaxb.core .......................... SKIPPED
[INFO] org.eclipse.jpt.jaxb.core.schemagen ................ SKIPPED
[INFO] org.eclipse.jpt.jaxb.eclipselink.core .............. SKIPPED
[INFO] org.eclipse.jpt.jaxb.eclipselink.core.schemagen .... SKIPPED
[INFO] org.eclipse.jpt.jaxb.ui ............................ SKIPPED
[INFO] org.eclipse.jpt.jaxb.branding ...................... SKIPPED
[INFO] org.eclipse.jpt.jaxb.feature ....................... SKIPPED
[INFO] org.eclipse.jpt.jaxb.eclipselink.ui ................ SKIPPED
[INFO] org.eclipse.jpt.jaxb.eclipselink.branding .......... SKIPPED
[INFO] org.eclipse.jpt.jaxb.eclipselink.feature ........... SKIPPED
[INFO] org.eclipse.jpt.jaxb.eclipselink_sdk.feature ....... SKIPPED
[INFO] org.eclipse.jpt.jaxb_sdk.feature ................... SKIPPED
[INFO] org.eclipse.jpt.jpa.db ............................. SKIPPED
[INFO] org.eclipse.jpt.jpa.core ........................... SKIPPED
[INFO] org.eclipse.jpt.jpa.annotate ....................... SKIPPED
[INFO] org.eclipse.jpt.jpa.db.ui .......................... SKIPPED
[INFO] org.eclipse.jpt.jpa.eclipselink.core ............... SKIPPED
[INFO] org.eclipse.jpt.jpa.eclipselink.core.ddlgen ........ SKIPPED
[INFO] org.eclipse.jpt.jpa.gen ............................ SKIPPED
[INFO] org.eclipse.jpt.jpa.ui ............................. SKIPPED
[INFO] org.eclipse.jpt.doc.user ........................... SKIPPED
[INFO] org.eclipse.jpt.jpa.branding ....................... SKIPPED
[INFO] org.eclipse.jpt.jpa.feature ........................ SKIPPED
[INFO] org.eclipse.jpt.jpa.eclipselink.ui ................. SKIPPED
[INFO] org.eclipse.jpt.jpa.eclipselink.branding ........... SKIPPED
[INFO] org.eclipse.jpt.jpa.eclipselink.feature ............ SKIPPED
[INFO] org.eclipse.jpt.jpa.eclipselink_sdk.feature ........ SKIPPED
[INFO] org.eclipse.jpt.doc.isv ............................ SKIPPED
[INFO] org.eclipse.jpt.jpa_sdk.feature .................... SKIPPED
[INFO] JPA Diagram Editor Branding Plug-in ................ SKIPPED
[INFO] JPA Diagram Editor Plug-in ......................... SKIPPED
[INFO] JPA Diagram Editor Branding Plug-in ................ SKIPPED
[INFO] JPA Diagram Editor Feature ......................... SKIPPED
[INFO] org.eclipse.jpt.jpadiagrameditor_sdk.feature ....... SKIPPED
[INFO] dali4x-sdk ......................................... SKIPPED
[INFO] org.eclipse.jpt.common.utility.tests ............... SKIPPED
[INFO] org.eclipse.jpt.common.core.tests .................. SKIPPED
[INFO] org.eclipse.jpt.common.tests.feature ............... SKIPPED
[INFO] org.eclipse.jpt.jpa.core.tests.extension.resource .. SKIPPED
[INFO] org.eclipse.jpt.jpa.tests.feature .................. SKIPPED
[INFO] org.eclipse.jpt.jaxb.eclipselink.tests.feature ..... SKIPPED
[INFO] org.eclipse.jpt.jaxb.tests.feature ................. SKIPPED
[INFO] JPA Diagram Editor Test Plug-in .................... SKIPPED
[INFO] org.eclipse.jpt.jpadiagrameditor.tests.feature ..... SKIPPED
[INFO] dali4x.tests ....................................... SKIPPED
[INFO] jst4x-sdk .......................................... SKIPPED
[INFO] jst4x.tests ........................................ SKIPPED
[INFO] org.eclipse.wst.jsdt.chromium_sdk.feature .......... SKIPPED
[INFO] wst4x-sdk .......................................... SKIPPED
[INFO] org.eclipse.wst.jsdt.chromium.debug.core.tests ..... SKIPPED
[INFO] org.eclipse.wst.jsdt.chromium.tests ................ SKIPPED
[INFO] org.eclipse.wst.jsdt.chromium_tests.feature ........ SKIPPED
[INFO] sourceediting.json.tests ........................... SKIPPED
[INFO] org.eclipse.wst.json.core.tests .................... SKIPPED
[INFO] org.eclipse.wst.json_tests.feature ................. SKIPPED
[INFO] wst4x.tests ........................................ SKIPPED
[INFO] repository ......................................... SKIPPED
[INFO] repositoryunittests ................................ SKIPPED
[INFO] org.eclipse.webtools.common.site ................... SKIPPED
[INFO] org.eclipse.servertools.doc.isv .................... SKIPPED
[INFO] org.eclipse.wst.server.http.core.tests ............. SKIPPED
[INFO] org.eclipse.wst.server.util.tests .................. SKIPPED
[INFO] org.eclipse.webtools.servertools.site .............. SKIPPED
[INFO] org.eclipse.wst.server_sdk.feature ................. SKIPPED
[INFO] org.eclipse.wst.jsdt.js.common.tests ............... SKIPPED
[INFO] org.eclipse.wst.jsdt.integration.tests ............. SKIPPED
[INFO] org.eclipse.webtools.jsdt.site ..................... SKIPPED
[INFO] PsychoPath XPath 2.0 Processor: SDK Documentation .. SKIPPED
[INFO] PsychoPath XPath 2.0 Processor: SDK Feature ........ SKIPPED
[INFO] PsychoPath XPath 2.0 Processor: Tests for WTP type support SKIPPED
[INFO] org.eclipse.webtools.sourceediting.site ............ SKIPPED
[INFO] org.eclipse.jst.doc.user.feature ................... SKIPPED
[INFO] org.eclipse.webtools.javaee.site ................... SKIPPED
[INFO] org.eclipse.jpt.assembly.feature ................... SKIPPED
[INFO] org.eclipse.jpt_sdk.assembly.feature ............... SKIPPED
[INFO] org.eclipse.jpt.tests.assembly.feature ............. SKIPPED
[INFO] JPA Editor Update Site ............................. SKIPPED
[INFO] org.eclipse.webtools.dali.site ..................... SKIPPED
[INFO] org.eclipse.jsf.assembly.feature ................... SKIPPED
[INFO] org.eclipse.jst.jsf.doc.feature .................... SKIPPED
[INFO] org.eclipse.webtools.jsf.site ...................... SKIPPED
[INFO] org.eclipse.webtools.webservices.site .............. SKIPPED
[INFO] org.eclipse.jst.ws.jaxws.assembly.feature .......... SKIPPED
[INFO] wtp-aggregator ..................................... SKIPPED
[INFO] ------------------------------------------------------------------------
[INFO] BUILD FAILURE
[INFO] ------------------------------------------------------------------------
[INFO] Total time: 01:36 h
[INFO] Finished at: 2018-01-28T16:27:35-05:00
[INFO] Final Memory: 1094M/12298M
[INFO] ------------------------------------------------------------------------
[INFO] o.h.m.e.h.MavenExecutionResultHandler - Build failed with exception(s)
[INFO] o.h.m.e.h.MavenExecutionResultHandler - [1] org.apache.maven.lifecycle.LifecycleExecutionException: Failed to execute goal org.eclipse.tycho:tycho-compiler-plugin:1.1.0-SNAPSHOT:compile (default-compile) on project org.eclipse.wst.xsl.xalan: Compilation failure
[DEBUG] Closing connection to remote
[ERROR] Failed to execute goal org.eclipse.tycho:tycho-compiler-plugin:1.1.0-SNAPSHOT:compile (default-compile) on project org.eclipse.wst.xsl.xalan: Compilation failure: Compilation failure:
[ERROR] /jobs/genie.webtools/WTP-R3_10_Integration/workspace/webtools.sourceediting/xsl/bundles/org.eclipse.wst.xsl.xalan/src-debugger/org/eclipse/wst/xsl/xalan/debugger/XalanDebugger.java:[46]
[ERROR] lastTransformerInChain.getSerializationHandler().flushPending();
[ERROR]                       ^^^^^^^^^^^^^^^^^^^^^^^
[ERROR] The method getSerializationHandler() is undefined for the type TransformerImpl
[ERROR] /jobs/genie.webtools/WTP-R3_10_Integration/workspace/webtools.sourceediting/xsl/bundles/org.eclipse.wst.xsl.xalan/src-debugger/org/eclipse/wst/xsl/xalan/debugger/XalanStyleFrame.java:[131]
[ERROR] currentLine = e.m_styleNode.getEndLineNumber();
[ERROR]                            ^^^^^^^^^^^^^^^^
[ERROR] The method getEndLineNumber() is undefined for the type ElemTemplateElement
[ERROR] 2 problems (2 errors)
[ERROR] -> [Help 1]
[ERROR]
[ERROR] To see the full stack trace of the errors, re-run Maven with the -e switch.
[ERROR] Re-run Maven using the -X switch to enable full debug logging.
[ERROR]
[ERROR] For more information about the errors and possible solutions, please read the following articles:
[ERROR] [Help 1] http://cwiki.apache.org/confluence/display/MAVEN/MojoFailureException
[ERROR]
[ERROR] After correcting the problems, you can resume the build with the command
[ERROR]   mvn <goals> -rf :org.eclipse.wst.xsl.xalan
[DEBUG] Waiting for process to finish
[DEBUG] Result: 1
Terminating xvnc.
Archiving artifacts

--
This message is automatically generated by Hudson.
For more information on Hudson, see: http://hudson-ci.org/
_______________________________________________
wtp-releng mailing list
[hidden email]
To change your delivery options, retrieve your password, or unsubscribe from this list, visit
https://dev.eclipse.org/mailman/listinfo/wtp-releng
Reply | Threaded
Open this post in threaded view
|

[Hudson] Build failed in Hudson: WTP-R3_10_Integration #243

hudsonbuild
See <https://hudson.eclipse.org/webtools/job/WTP-R3_10_Integration/243/>

------------------------------------------
[...truncated 366634 lines...]
[INFO] PsychoPath XPath 2.0 Processor ..................... SUCCESS [  3.756 s]
[INFO] org.eclipse.wst.xml.xpath.ui ....................... SUCCESS [  7.705 s]
[INFO] sourceediting.xpath.docs ........................... SUCCESS [  0.096 s]
[INFO] PsychoPath XPath 2.0 Processor: User Documentation . SUCCESS [  5.669 s]
[INFO] PsychoPath XPath 2.0 Processor: Branding Plug-in ... SUCCESS [  3.293 s]
[INFO] sourceediting.xpath.features ....................... SUCCESS [  0.087 s]
[INFO] PsychoPath XPath 2.0 Processor Feature ............. SUCCESS [  2.689 s]
[INFO] sourceediting.xsl .................................. SUCCESS [  0.081 s]
[INFO] sourceediting.xsl.bundles .......................... SUCCESS [  0.107 s]
[INFO] XSLT Core Plugin ................................... SUCCESS [ 14.286 s]
[INFO] XSLT Launching Plugin .............................. SUCCESS [05:05 min]
[INFO] XSLT Debug UI Plugin ............................... SUCCESS [ 18.935 s]
[INFO] sourceediting.xsl.docs ............................. SUCCESS [  1.881 s]
[INFO] org.eclipse.wst.xsl.doc ............................ SUCCESS [ 11.828 s]
[INFO] XSLT EXSLT Core Plugin ............................. SUCCESS [  6.081 s]
[INFO] XSLT UI Plugin ..................................... SUCCESS [ 28.814 s]
[INFO] XSLT EXSLT UI Plugin ............................... SUCCESS [ 15.312 s]
[INFO] XSLT JAXP Debug Plugin ............................. SUCCESS [  6.648 s]
[INFO] XSLT Xalan Plugin .................................. FAILURE [  0.547 s]
[INFO] XSLT Saxon Plugin .................................. SKIPPED
[INFO] XSL Tools Branding Plugin .......................... SKIPPED
[INFO] XSLT JAXP Launching UI Plugin ...................... SKIPPED
[INFO] XSLT JAXP Debug UI Plugin .......................... SKIPPED
[INFO] sourceediting.xsl.features ......................... SKIPPED
[INFO] XSLT FeaturePlugin ................................. SKIPPED
[INFO] org.eclipse.wst.xsl.sdk.documentation .............. SKIPPED
[INFO] org.eclipse.wst.xsl_sdk.feature .................... SKIPPED
[INFO] org.eclipse.wst.server.http.core ................... SKIPPED
[INFO] org.eclipse.wst.server.http.ui ..................... SKIPPED
[INFO] org.eclipse.wst.server.preview ..................... SKIPPED
[INFO] org.eclipse.wst.server.preview.adapter ............. SKIPPED
[INFO] org.eclipse.wst.server_adapters.feature ............ SKIPPED
[INFO] org.eclipse.wst.server_adapters.sdk.feature ........ SKIPPED
[INFO] org.eclipse.wst.sdk ................................ SKIPPED
[INFO] org.eclipse.wst.common.project.facet.core.tests .... SKIPPED
[INFO] org.eclipse.wst.common.project.facet.ui.tests ...... SKIPPED
[INFO] org.eclipse.wst.common.snippets.tests .............. SKIPPED
[INFO] org.eclipse.wst.common.tests.ui .................... SKIPPED
[INFO] org.eclipse.wst.common.tests.validation ............ SKIPPED
[INFO] org.eclipse.wst.common.tests.validation.guard ...... SKIPPED
[INFO] org.eclipse.wst.internet.cache.tests ............... SKIPPED
[INFO] org.eclipse.wst.common_tests.feature ............... SKIPPED
[INFO] org.eclipse.wst.css.core.tests ..................... SKIPPED
[INFO] org.eclipse.wst.css.tests.encoding ................. SKIPPED
[INFO] org.eclipse.wst.css.ui.tests ....................... SKIPPED
[INFO] org.eclipse.wst.dtd.core.tests ..................... SKIPPED
[INFO] org.eclipse.wst.dtd.ui.tests ....................... SKIPPED
[INFO] org.eclipse.wst.html.core.tests .................... SKIPPED
[INFO] org.eclipse.wst.html.tests.encoding ................ SKIPPED
[INFO] org.eclipse.wst.html.ui.tests ...................... SKIPPED
[INFO] org.eclipse.wst.internet.monitor.core.tests ........ SKIPPED
[INFO] org.eclipse.wst.internet.monitor.ui.tests .......... SKIPPED
[INFO] tests .............................................. SKIPPED
[INFO] org.eclipse.wst.jsdt.core.tests.compiler ........... SKIPPED
[INFO] org.eclipse.wst.jsdt.core.tests.model .............. SKIPPED
[INFO] org.eclipse.wst.jsdt.debug.core.tests .............. SKIPPED
[INFO] org.eclipse.wst.jsdt.debug.rhino.tests ............. SKIPPED
[INFO] org.eclipse.wst.jsdt.js.node.common.tests .......... SKIPPED
[INFO] org.eclipse.wst.jsdt.ui.tests ...................... SKIPPED
[INFO] org.eclipse.wst.jsdt.web.core.tests ................ SKIPPED
[INFO] org.eclipse.wst.jsdt.web.ui.tests .................. SKIPPED
[INFO] org.eclipse.wst.jsdt_tests.feature ................. SKIPPED
[INFO] org.eclipse.wst.server_tests.feature ............... SKIPPED
[INFO] sourceediting.core.tests ........................... SKIPPED
[INFO] org.eclipse.wst.sse.core.tests ..................... SKIPPED
[INFO] org.eclipse.wst.sse.ui.tests ....................... SKIPPED
[INFO] org.eclipse.wtp.releng.fixups ...................... SKIPPED
[INFO] org.eclipse.wtp.releng.fixups.feature .............. SKIPPED
[INFO] org.eclipse.wtp.releng.tests ....................... SKIPPED
[INFO] org.eclipse.wtp.releng.tools ....................... SKIPPED
[INFO] org.eclipse.wtp.releng.tools.feature ............... SKIPPED
[INFO] org.eclipse.wtp.releng.tests.feature ............... SKIPPED
[INFO] org.eclipse.wst.xml.catalog.tests .................. SKIPPED
[INFO] org.eclipse.wst.xml.core.tests ..................... SKIPPED
[INFO] org.eclipse.wst.xml.ui.tests ....................... SKIPPED
[INFO] org.eclipse.wst.xml.validation.tests ............... SKIPPED
[INFO] org.eclipse.wst.xsd.validation.tests ............... SKIPPED
[INFO] org.eclipse.wst.xsd.core.tests ..................... SKIPPED
[INFO] org.eclipse.wst.xsd.ui.tests ....................... SKIPPED
[INFO] org.eclipse.wst.xml_tests.feature .................. SKIPPED
[INFO] sourceediting.xpath.tests .......................... SKIPPED
[INFO] org.eclipse.wst.xml.xpath.core.tests ............... SKIPPED
[INFO] org.eclipse.wst.xml.xpath.ui.tests ................. SKIPPED
[INFO] PsychoPath XPath 2.0 Processor: XQuery Test Suite .. SKIPPED
[INFO] PsychoPath XPath 2.0 Processor: Tests .............. SKIPPED
[INFO] sourceediting.xsl.tests ............................ SKIPPED
[INFO] XSLT Core Tests .................................... SKIPPED
[INFO] EXSLT Core Tests ................................... SKIPPED
[INFO] XSLT UI Tests ...................................... SKIPPED
[INFO] EXSLT UI Tests ..................................... SKIPPED
[INFO] JAXP Debug Tests ................................... SKIPPED
[INFO] XSL Launching Tests ................................ SKIPPED
[INFO] org.eclipse.wst.xsl.tests .......................... SKIPPED
[INFO] org.eclipse.wst.xsl_tests.feature .................. SKIPPED
[INFO] org.eclipse.wst.web_tests.feature .................. SKIPPED
[INFO] org.eclipse.wst.tests.feature ...................... SKIPPED
[INFO] org.eclipse.wtp.requiredpreques .................... SKIPPED
[INFO] org.eclipse.wtp.xml.dev ............................ SKIPPED
[INFO] org.eclipse.wtp.xml.dev.assembly.feature ........... SKIPPED
[INFO] org.uddi4j.feature ................................. SKIPPED
[INFO] org.eclipse.jst .................................... SKIPPED
[INFO] org.eclipse.wst .................................... SKIPPED
[INFO] org.eclipse.wst.doc.isv.feature .................... SKIPPED
[INFO] org.eclipse.wst.doc.user.feature ................... SKIPPED
[INFO] org.eclipse.wtp.epp.package.jee.intro .............. SKIPPED
[INFO] org.eclipse.wtp.epp.package.capabilities ........... SKIPPED
[INFO] org.eclipse.wtp.javascript.capabilities ............ SKIPPED
[INFO] org.eclipse.wtp.jee.capabilities ................... SKIPPED
[INFO] org.eclipse.wtp.web.capabilities ................... SKIPPED
[INFO] org.eclipse.wtp.xml.capabilities ................... SKIPPED
[INFO] org.eclipse.wtp.capabilities.feature ............... SKIPPED
[INFO] org.eclipse.wtp.capabilities ....................... SKIPPED
[INFO] org.eclipse.wtp.feature.branding.template .......... SKIPPED
[INFO] org.eclipse.wtp.jee ................................ SKIPPED
[INFO] repositories ....................................... SKIPPED
[INFO] org.eclipse.webtools.dali .......................... SKIPPED
[INFO] org.eclipse.jpt.common.utility ..................... SKIPPED
[INFO] org.eclipse.jpt.common.core ........................ SKIPPED
[INFO] org.eclipse.jpt.common.eclipselink.core ............ SKIPPED
[INFO] org.eclipse.jpt.common.ui .......................... SKIPPED
[INFO] org.eclipse.jpt.common.branding .................... SKIPPED
[INFO] org.eclipse.jpt.common.feature ..................... SKIPPED
[INFO] org.eclipse.jpt.common.eclipselink.branding ........ SKIPPED
[INFO] org.eclipse.jpt.common.eclipselink.feature ......... SKIPPED
[INFO] org.eclipse.jpt.common.eclipselink_sdk.feature ..... SKIPPED
[INFO] org.eclipse.jpt.common_sdk.feature ................. SKIPPED
[INFO] org.eclipse.jpt.dbws.eclipselink.core.gen .......... SKIPPED
[INFO] org.eclipse.jpt.dbws.eclipselink.ui ................ SKIPPED
[INFO] org.eclipse.jpt.dbws.eclipselink.branding .......... SKIPPED
[INFO] org.eclipse.jpt.dbws.eclipselink.feature ........... SKIPPED
[INFO] org.eclipse.jpt.dbws.eclipselink_sdk.feature ....... SKIPPED
[INFO] org.eclipse.jpt.jaxb.core .......................... SKIPPED
[INFO] org.eclipse.jpt.jaxb.core.schemagen ................ SKIPPED
[INFO] org.eclipse.jpt.jaxb.eclipselink.core .............. SKIPPED
[INFO] org.eclipse.jpt.jaxb.eclipselink.core.schemagen .... SKIPPED
[INFO] org.eclipse.jpt.jaxb.ui ............................ SKIPPED
[INFO] org.eclipse.jpt.jaxb.branding ...................... SKIPPED
[INFO] org.eclipse.jpt.jaxb.feature ....................... SKIPPED
[INFO] org.eclipse.jpt.jaxb.eclipselink.ui ................ SKIPPED
[INFO] org.eclipse.jpt.jaxb.eclipselink.branding .......... SKIPPED
[INFO] org.eclipse.jpt.jaxb.eclipselink.feature ........... SKIPPED
[INFO] org.eclipse.jpt.jaxb.eclipselink_sdk.feature ....... SKIPPED
[INFO] org.eclipse.jpt.jaxb_sdk.feature ................... SKIPPED
[INFO] org.eclipse.jpt.jpa.db ............................. SKIPPED
[INFO] org.eclipse.jpt.jpa.core ........................... SKIPPED
[INFO] org.eclipse.jpt.jpa.annotate ....................... SKIPPED
[INFO] org.eclipse.jpt.jpa.db.ui .......................... SKIPPED
[INFO] org.eclipse.jpt.jpa.eclipselink.core ............... SKIPPED
[INFO] org.eclipse.jpt.jpa.eclipselink.core.ddlgen ........ SKIPPED
[INFO] org.eclipse.jpt.jpa.gen ............................ SKIPPED
[INFO] org.eclipse.jpt.jpa.ui ............................. SKIPPED
[INFO] org.eclipse.jpt.doc.user ........................... SKIPPED
[INFO] org.eclipse.jpt.jpa.branding ....................... SKIPPED
[INFO] org.eclipse.jpt.jpa.feature ........................ SKIPPED
[INFO] org.eclipse.jpt.jpa.eclipselink.ui ................. SKIPPED
[INFO] org.eclipse.jpt.jpa.eclipselink.branding ........... SKIPPED
[INFO] org.eclipse.jpt.jpa.eclipselink.feature ............ SKIPPED
[INFO] org.eclipse.jpt.jpa.eclipselink_sdk.feature ........ SKIPPED
[INFO] org.eclipse.jpt.doc.isv ............................ SKIPPED
[INFO] org.eclipse.jpt.jpa_sdk.feature .................... SKIPPED
[INFO] JPA Diagram Editor Branding Plug-in ................ SKIPPED
[INFO] JPA Diagram Editor Plug-in ......................... SKIPPED
[INFO] JPA Diagram Editor Branding Plug-in ................ SKIPPED
[INFO] JPA Diagram Editor Feature ......................... SKIPPED
[INFO] org.eclipse.jpt.jpadiagrameditor_sdk.feature ....... SKIPPED
[INFO] dali4x-sdk ......................................... SKIPPED
[INFO] org.eclipse.jpt.common.utility.tests ............... SKIPPED
[INFO] org.eclipse.jpt.common.core.tests .................. SKIPPED
[INFO] org.eclipse.jpt.common.tests.feature ............... SKIPPED
[INFO] org.eclipse.jpt.jpa.core.tests.extension.resource .. SKIPPED
[INFO] org.eclipse.jpt.jpa.tests.feature .................. SKIPPED
[INFO] org.eclipse.jpt.jaxb.eclipselink.tests.feature ..... SKIPPED
[INFO] org.eclipse.jpt.jaxb.tests.feature ................. SKIPPED
[INFO] JPA Diagram Editor Test Plug-in .................... SKIPPED
[INFO] org.eclipse.jpt.jpadiagrameditor.tests.feature ..... SKIPPED
[INFO] dali4x.tests ....................................... SKIPPED
[INFO] jst4x-sdk .......................................... SKIPPED
[INFO] jst4x.tests ........................................ SKIPPED
[INFO] org.eclipse.wst.jsdt.chromium_sdk.feature .......... SKIPPED
[INFO] wst4x-sdk .......................................... SKIPPED
[INFO] org.eclipse.wst.jsdt.chromium.debug.core.tests ..... SKIPPED
[INFO] org.eclipse.wst.jsdt.chromium.tests ................ SKIPPED
[INFO] org.eclipse.wst.jsdt.chromium_tests.feature ........ SKIPPED
[INFO] sourceediting.json.tests ........................... SKIPPED
[INFO] org.eclipse.wst.json.core.tests .................... SKIPPED
[INFO] org.eclipse.wst.json_tests.feature ................. SKIPPED
[INFO] wst4x.tests ........................................ SKIPPED
[INFO] repository ......................................... SKIPPED
[INFO] repositoryunittests ................................ SKIPPED
[INFO] org.eclipse.webtools.common.site ................... SKIPPED
[INFO] org.eclipse.servertools.doc.isv .................... SKIPPED
[INFO] org.eclipse.wst.server.http.core.tests ............. SKIPPED
[INFO] org.eclipse.wst.server.util.tests .................. SKIPPED
[INFO] org.eclipse.webtools.servertools.site .............. SKIPPED
[INFO] org.eclipse.wst.server_sdk.feature ................. SKIPPED
[INFO] org.eclipse.wst.jsdt.js.common.tests ............... SKIPPED
[INFO] org.eclipse.wst.jsdt.integration.tests ............. SKIPPED
[INFO] org.eclipse.webtools.jsdt.site ..................... SKIPPED
[INFO] PsychoPath XPath 2.0 Processor: SDK Documentation .. SKIPPED
[INFO] PsychoPath XPath 2.0 Processor: SDK Feature ........ SKIPPED
[INFO] PsychoPath XPath 2.0 Processor: Tests for WTP type support SKIPPED
[INFO] org.eclipse.webtools.sourceediting.site ............ SKIPPED
[INFO] org.eclipse.jst.doc.user.feature ................... SKIPPED
[INFO] org.eclipse.webtools.javaee.site ................... SKIPPED
[INFO] org.eclipse.jpt.assembly.feature ................... SKIPPED
[INFO] org.eclipse.jpt_sdk.assembly.feature ............... SKIPPED
[INFO] org.eclipse.jpt.tests.assembly.feature ............. SKIPPED
[INFO] JPA Editor Update Site ............................. SKIPPED
[INFO] org.eclipse.webtools.dali.site ..................... SKIPPED
[INFO] org.eclipse.jsf.assembly.feature ................... SKIPPED
[INFO] org.eclipse.jst.jsf.doc.feature .................... SKIPPED
[INFO] org.eclipse.webtools.jsf.site ...................... SKIPPED
[INFO] org.eclipse.webtools.webservices.site .............. SKIPPED
[INFO] org.eclipse.jst.ws.jaxws.assembly.feature .......... SKIPPED
[INFO] wtp-aggregator ..................................... SKIPPED
[INFO] ------------------------------------------------------------------------
[INFO] BUILD FAILURE
[INFO] ------------------------------------------------------------------------
[INFO] Total time: 03:44 h
[INFO] Finished at: 2018-01-29T04:07:28-05:00
[INFO] Final Memory: 1107M/11555M
[INFO] ------------------------------------------------------------------------
[INFO] o.h.m.e.h.MavenExecutionResultHandler - Build failed with exception(s)
[INFO] o.h.m.e.h.MavenExecutionResultHandler - [1] org.apache.maven.lifecycle.LifecycleExecutionException: Failed to execute goal org.eclipse.tycho:tycho-compiler-plugin:1.1.0-SNAPSHOT:compile (default-compile) on project org.eclipse.wst.xsl.xalan: Compilation failure
[DEBUG] Closing connection to remote
[ERROR] Failed to execute goal org.eclipse.tycho:tycho-compiler-plugin:1.1.0-SNAPSHOT:compile (default-compile) on project org.eclipse.wst.xsl.xalan: Compilation failure: Compilation failure:
[ERROR] /jobs/genie.webtools/WTP-R3_10_Integration/workspace/webtools.sourceediting/xsl/bundles/org.eclipse.wst.xsl.xalan/src-debugger/org/eclipse/wst/xsl/xalan/debugger/XalanDebugger.java:[46]
[ERROR] lastTransformerInChain.getSerializationHandler().flushPending();
[ERROR]                       ^^^^^^^^^^^^^^^^^^^^^^^
[ERROR] The method getSerializationHandler() is undefined for the type TransformerImpl
[ERROR] /jobs/genie.webtools/WTP-R3_10_Integration/workspace/webtools.sourceediting/xsl/bundles/org.eclipse.wst.xsl.xalan/src-debugger/org/eclipse/wst/xsl/xalan/debugger/XalanStyleFrame.java:[131]
[ERROR] currentLine = e.m_styleNode.getEndLineNumber();
[ERROR]                            ^^^^^^^^^^^^^^^^
[ERROR] The method getEndLineNumber() is undefined for the type ElemTemplateElement
[ERROR] 2 problems (2 errors)
[ERROR] -> [Help 1]
[ERROR]
[ERROR] To see the full stack trace of the errors, re-run Maven with the -e switch.
[ERROR] Re-run Maven using the -X switch to enable full debug logging.
[ERROR]
[ERROR] For more information about the errors and possible solutions, please read the following articles:
[ERROR] [Help 1] http://cwiki.apache.org/confluence/display/MAVEN/MojoFailureException
[ERROR]
[ERROR] After correcting the problems, you can resume the build with the command
[ERROR]   mvn <goals> -rf :org.eclipse.wst.xsl.xalan
[DEBUG] Waiting for process to finish
[DEBUG] Result: 1
Terminating xvnc.
Archiving artifacts

--
This message is automatically generated by Hudson.
For more information on Hudson, see: http://hudson-ci.org/
_______________________________________________
wtp-releng mailing list
[hidden email]
To change your delivery options, retrieve your password, or unsubscribe from this list, visit
https://dev.eclipse.org/mailman/listinfo/wtp-releng
Reply | Threaded
Open this post in threaded view
|

[Hudson] Hudson build is back to normal : WTP-R3_10_Integration #244

hudsonbuild
See <https://hudson.eclipse.org/webtools/job/WTP-R3_10_Integration/244/changes>


--
This message is automatically generated by Hudson.
For more information on Hudson, see: http://hudson-ci.org/
_______________________________________________
wtp-releng mailing list
[hidden email]
To change your delivery options, retrieve your password, or unsubscribe from this list, visit
https://dev.eclipse.org/mailman/listinfo/wtp-releng