[Hudson] Build failed in Hudson: WTP-R3_10_Integration #245

classic Classic list List threaded Threaded
7 messages Options
Reply | Threaded
Open this post in threaded view
|

[Hudson] Build failed in Hudson: WTP-R3_10_Integration #245

hudsonbuild
See <https://hudson.eclipse.org/webtools/job/WTP-R3_10_Integration/245/>

------------------------------------------
[...truncated 366634 lines...]
[INFO] PsychoPath XPath 2.0 Processor ..................... SUCCESS [  2.834 s]
[INFO] org.eclipse.wst.xml.xpath.ui ....................... SUCCESS [  3.727 s]
[INFO] sourceediting.xpath.docs ........................... SUCCESS [  0.085 s]
[INFO] PsychoPath XPath 2.0 Processor: User Documentation . SUCCESS [  3.703 s]
[INFO] PsychoPath XPath 2.0 Processor: Branding Plug-in ... SUCCESS [  2.390 s]
[INFO] sourceediting.xpath.features ....................... SUCCESS [  0.092 s]
[INFO] PsychoPath XPath 2.0 Processor Feature ............. SUCCESS [  2.240 s]
[INFO] sourceediting.xsl .................................. SUCCESS [  0.103 s]
[INFO] sourceediting.xsl.bundles .......................... SUCCESS [  0.102 s]
[INFO] XSLT Core Plugin ................................... SUCCESS [ 11.987 s]
[INFO] XSLT Launching Plugin .............................. SUCCESS [  3.030 s]
[INFO] XSLT Debug UI Plugin ............................... SUCCESS [  6.718 s]
[INFO] sourceediting.xsl.docs ............................. SUCCESS [  0.078 s]
[INFO] org.eclipse.wst.xsl.doc ............................ SUCCESS [  5.067 s]
[INFO] XSLT EXSLT Core Plugin ............................. SUCCESS [  2.887 s]
[INFO] XSLT UI Plugin ..................................... SUCCESS [  7.716 s]
[INFO] XSLT EXSLT UI Plugin ............................... SUCCESS [  3.167 s]
[INFO] XSLT JAXP Debug Plugin ............................. SUCCESS [  3.197 s]
[INFO] XSLT Xalan Plugin .................................. FAILURE [  0.478 s]
[INFO] XSLT Saxon Plugin .................................. SKIPPED
[INFO] XSL Tools Branding Plugin .......................... SKIPPED
[INFO] XSLT JAXP Launching UI Plugin ...................... SKIPPED
[INFO] XSLT JAXP Debug UI Plugin .......................... SKIPPED
[INFO] sourceediting.xsl.features ......................... SKIPPED
[INFO] XSLT FeaturePlugin ................................. SKIPPED
[INFO] org.eclipse.wst.xsl.sdk.documentation .............. SKIPPED
[INFO] org.eclipse.wst.xsl_sdk.feature .................... SKIPPED
[INFO] org.eclipse.wst.server.http.core ................... SKIPPED
[INFO] org.eclipse.wst.server.http.ui ..................... SKIPPED
[INFO] org.eclipse.wst.server.preview ..................... SKIPPED
[INFO] org.eclipse.wst.server.preview.adapter ............. SKIPPED
[INFO] org.eclipse.wst.server_adapters.feature ............ SKIPPED
[INFO] org.eclipse.wst.server_adapters.sdk.feature ........ SKIPPED
[INFO] org.eclipse.wst.sdk ................................ SKIPPED
[INFO] org.eclipse.wst.common.project.facet.core.tests .... SKIPPED
[INFO] org.eclipse.wst.common.project.facet.ui.tests ...... SKIPPED
[INFO] org.eclipse.wst.common.snippets.tests .............. SKIPPED
[INFO] org.eclipse.wst.common.tests.ui .................... SKIPPED
[INFO] org.eclipse.wst.common.tests.validation ............ SKIPPED
[INFO] org.eclipse.wst.common.tests.validation.guard ...... SKIPPED
[INFO] org.eclipse.wst.internet.cache.tests ............... SKIPPED
[INFO] org.eclipse.wst.common_tests.feature ............... SKIPPED
[INFO] org.eclipse.wst.css.core.tests ..................... SKIPPED
[INFO] org.eclipse.wst.css.tests.encoding ................. SKIPPED
[INFO] org.eclipse.wst.css.ui.tests ....................... SKIPPED
[INFO] org.eclipse.wst.dtd.core.tests ..................... SKIPPED
[INFO] org.eclipse.wst.dtd.ui.tests ....................... SKIPPED
[INFO] org.eclipse.wst.html.core.tests .................... SKIPPED
[INFO] org.eclipse.wst.html.tests.encoding ................ SKIPPED
[INFO] org.eclipse.wst.html.ui.tests ...................... SKIPPED
[INFO] org.eclipse.wst.internet.monitor.core.tests ........ SKIPPED
[INFO] org.eclipse.wst.internet.monitor.ui.tests .......... SKIPPED
[INFO] tests .............................................. SKIPPED
[INFO] org.eclipse.wst.jsdt.core.tests.compiler ........... SKIPPED
[INFO] org.eclipse.wst.jsdt.core.tests.model .............. SKIPPED
[INFO] org.eclipse.wst.jsdt.debug.core.tests .............. SKIPPED
[INFO] org.eclipse.wst.jsdt.debug.rhino.tests ............. SKIPPED
[INFO] org.eclipse.wst.jsdt.js.node.common.tests .......... SKIPPED
[INFO] org.eclipse.wst.jsdt.ui.tests ...................... SKIPPED
[INFO] org.eclipse.wst.jsdt.web.core.tests ................ SKIPPED
[INFO] org.eclipse.wst.jsdt.web.ui.tests .................. SKIPPED
[INFO] org.eclipse.wst.jsdt_tests.feature ................. SKIPPED
[INFO] org.eclipse.wst.server_tests.feature ............... SKIPPED
[INFO] sourceediting.core.tests ........................... SKIPPED
[INFO] org.eclipse.wst.sse.core.tests ..................... SKIPPED
[INFO] org.eclipse.wst.sse.ui.tests ....................... SKIPPED
[INFO] org.eclipse.wtp.releng.fixups ...................... SKIPPED
[INFO] org.eclipse.wtp.releng.fixups.feature .............. SKIPPED
[INFO] org.eclipse.wtp.releng.tests ....................... SKIPPED
[INFO] org.eclipse.wtp.releng.tools ....................... SKIPPED
[INFO] org.eclipse.wtp.releng.tools.feature ............... SKIPPED
[INFO] org.eclipse.wtp.releng.tests.feature ............... SKIPPED
[INFO] org.eclipse.wst.xml.catalog.tests .................. SKIPPED
[INFO] org.eclipse.wst.xml.core.tests ..................... SKIPPED
[INFO] org.eclipse.wst.xml.ui.tests ....................... SKIPPED
[INFO] org.eclipse.wst.xml.validation.tests ............... SKIPPED
[INFO] org.eclipse.wst.xsd.validation.tests ............... SKIPPED
[INFO] org.eclipse.wst.xsd.core.tests ..................... SKIPPED
[INFO] org.eclipse.wst.xsd.ui.tests ....................... SKIPPED
[INFO] org.eclipse.wst.xml_tests.feature .................. SKIPPED
[INFO] sourceediting.xpath.tests .......................... SKIPPED
[INFO] org.eclipse.wst.xml.xpath.core.tests ............... SKIPPED
[INFO] org.eclipse.wst.xml.xpath.ui.tests ................. SKIPPED
[INFO] PsychoPath XPath 2.0 Processor: XQuery Test Suite .. SKIPPED
[INFO] PsychoPath XPath 2.0 Processor: Tests .............. SKIPPED
[INFO] sourceediting.xsl.tests ............................ SKIPPED
[INFO] XSLT Core Tests .................................... SKIPPED
[INFO] EXSLT Core Tests ................................... SKIPPED
[INFO] XSLT UI Tests ...................................... SKIPPED
[INFO] EXSLT UI Tests ..................................... SKIPPED
[INFO] JAXP Debug Tests ................................... SKIPPED
[INFO] XSL Launching Tests ................................ SKIPPED
[INFO] org.eclipse.wst.xsl.tests .......................... SKIPPED
[INFO] org.eclipse.wst.xsl_tests.feature .................. SKIPPED
[INFO] org.eclipse.wst.web_tests.feature .................. SKIPPED
[INFO] org.eclipse.wst.tests.feature ...................... SKIPPED
[INFO] org.eclipse.wtp.requiredpreques .................... SKIPPED
[INFO] org.eclipse.wtp.xml.dev ............................ SKIPPED
[INFO] org.eclipse.wtp.xml.dev.assembly.feature ........... SKIPPED
[INFO] org.uddi4j.feature ................................. SKIPPED
[INFO] org.eclipse.jst .................................... SKIPPED
[INFO] org.eclipse.wst .................................... SKIPPED
[INFO] org.eclipse.wst.doc.isv.feature .................... SKIPPED
[INFO] org.eclipse.wst.doc.user.feature ................... SKIPPED
[INFO] org.eclipse.wtp.epp.package.jee.intro .............. SKIPPED
[INFO] org.eclipse.wtp.epp.package.capabilities ........... SKIPPED
[INFO] org.eclipse.wtp.javascript.capabilities ............ SKIPPED
[INFO] org.eclipse.wtp.jee.capabilities ................... SKIPPED
[INFO] org.eclipse.wtp.web.capabilities ................... SKIPPED
[INFO] org.eclipse.wtp.xml.capabilities ................... SKIPPED
[INFO] org.eclipse.wtp.capabilities.feature ............... SKIPPED
[INFO] org.eclipse.wtp.capabilities ....................... SKIPPED
[INFO] org.eclipse.wtp.feature.branding.template .......... SKIPPED
[INFO] org.eclipse.wtp.jee ................................ SKIPPED
[INFO] repositories ....................................... SKIPPED
[INFO] org.eclipse.webtools.dali .......................... SKIPPED
[INFO] org.eclipse.jpt.common.utility ..................... SKIPPED
[INFO] org.eclipse.jpt.common.core ........................ SKIPPED
[INFO] org.eclipse.jpt.common.eclipselink.core ............ SKIPPED
[INFO] org.eclipse.jpt.common.ui .......................... SKIPPED
[INFO] org.eclipse.jpt.common.branding .................... SKIPPED
[INFO] org.eclipse.jpt.common.feature ..................... SKIPPED
[INFO] org.eclipse.jpt.common.eclipselink.branding ........ SKIPPED
[INFO] org.eclipse.jpt.common.eclipselink.feature ......... SKIPPED
[INFO] org.eclipse.jpt.common.eclipselink_sdk.feature ..... SKIPPED
[INFO] org.eclipse.jpt.common_sdk.feature ................. SKIPPED
[INFO] org.eclipse.jpt.dbws.eclipselink.core.gen .......... SKIPPED
[INFO] org.eclipse.jpt.dbws.eclipselink.ui ................ SKIPPED
[INFO] org.eclipse.jpt.dbws.eclipselink.branding .......... SKIPPED
[INFO] org.eclipse.jpt.dbws.eclipselink.feature ........... SKIPPED
[INFO] org.eclipse.jpt.dbws.eclipselink_sdk.feature ....... SKIPPED
[INFO] org.eclipse.jpt.jaxb.core .......................... SKIPPED
[INFO] org.eclipse.jpt.jaxb.core.schemagen ................ SKIPPED
[INFO] org.eclipse.jpt.jaxb.eclipselink.core .............. SKIPPED
[INFO] org.eclipse.jpt.jaxb.eclipselink.core.schemagen .... SKIPPED
[INFO] org.eclipse.jpt.jaxb.ui ............................ SKIPPED
[INFO] org.eclipse.jpt.jaxb.branding ...................... SKIPPED
[INFO] org.eclipse.jpt.jaxb.feature ....................... SKIPPED
[INFO] org.eclipse.jpt.jaxb.eclipselink.ui ................ SKIPPED
[INFO] org.eclipse.jpt.jaxb.eclipselink.branding .......... SKIPPED
[INFO] org.eclipse.jpt.jaxb.eclipselink.feature ........... SKIPPED
[INFO] org.eclipse.jpt.jaxb.eclipselink_sdk.feature ....... SKIPPED
[INFO] org.eclipse.jpt.jaxb_sdk.feature ................... SKIPPED
[INFO] org.eclipse.jpt.jpa.db ............................. SKIPPED
[INFO] org.eclipse.jpt.jpa.core ........................... SKIPPED
[INFO] org.eclipse.jpt.jpa.annotate ....................... SKIPPED
[INFO] org.eclipse.jpt.jpa.db.ui .......................... SKIPPED
[INFO] org.eclipse.jpt.jpa.eclipselink.core ............... SKIPPED
[INFO] org.eclipse.jpt.jpa.eclipselink.core.ddlgen ........ SKIPPED
[INFO] org.eclipse.jpt.jpa.gen ............................ SKIPPED
[INFO] org.eclipse.jpt.jpa.ui ............................. SKIPPED
[INFO] org.eclipse.jpt.doc.user ........................... SKIPPED
[INFO] org.eclipse.jpt.jpa.branding ....................... SKIPPED
[INFO] org.eclipse.jpt.jpa.feature ........................ SKIPPED
[INFO] org.eclipse.jpt.jpa.eclipselink.ui ................. SKIPPED
[INFO] org.eclipse.jpt.jpa.eclipselink.branding ........... SKIPPED
[INFO] org.eclipse.jpt.jpa.eclipselink.feature ............ SKIPPED
[INFO] org.eclipse.jpt.jpa.eclipselink_sdk.feature ........ SKIPPED
[INFO] org.eclipse.jpt.doc.isv ............................ SKIPPED
[INFO] org.eclipse.jpt.jpa_sdk.feature .................... SKIPPED
[INFO] JPA Diagram Editor Branding Plug-in ................ SKIPPED
[INFO] JPA Diagram Editor Plug-in ......................... SKIPPED
[INFO] JPA Diagram Editor Branding Plug-in ................ SKIPPED
[INFO] JPA Diagram Editor Feature ......................... SKIPPED
[INFO] org.eclipse.jpt.jpadiagrameditor_sdk.feature ....... SKIPPED
[INFO] dali4x-sdk ......................................... SKIPPED
[INFO] org.eclipse.jpt.common.utility.tests ............... SKIPPED
[INFO] org.eclipse.jpt.common.core.tests .................. SKIPPED
[INFO] org.eclipse.jpt.common.tests.feature ............... SKIPPED
[INFO] org.eclipse.jpt.jpa.core.tests.extension.resource .. SKIPPED
[INFO] org.eclipse.jpt.jpa.tests.feature .................. SKIPPED
[INFO] org.eclipse.jpt.jaxb.eclipselink.tests.feature ..... SKIPPED
[INFO] org.eclipse.jpt.jaxb.tests.feature ................. SKIPPED
[INFO] JPA Diagram Editor Test Plug-in .................... SKIPPED
[INFO] org.eclipse.jpt.jpadiagrameditor.tests.feature ..... SKIPPED
[INFO] dali4x.tests ....................................... SKIPPED
[INFO] jst4x-sdk .......................................... SKIPPED
[INFO] jst4x.tests ........................................ SKIPPED
[INFO] org.eclipse.wst.jsdt.chromium_sdk.feature .......... SKIPPED
[INFO] wst4x-sdk .......................................... SKIPPED
[INFO] org.eclipse.wst.jsdt.chromium.debug.core.tests ..... SKIPPED
[INFO] org.eclipse.wst.jsdt.chromium.tests ................ SKIPPED
[INFO] org.eclipse.wst.jsdt.chromium_tests.feature ........ SKIPPED
[INFO] sourceediting.json.tests ........................... SKIPPED
[INFO] org.eclipse.wst.json.core.tests .................... SKIPPED
[INFO] org.eclipse.wst.json_tests.feature ................. SKIPPED
[INFO] wst4x.tests ........................................ SKIPPED
[INFO] repository ......................................... SKIPPED
[INFO] repositoryunittests ................................ SKIPPED
[INFO] org.eclipse.webtools.common.site ................... SKIPPED
[INFO] org.eclipse.servertools.doc.isv .................... SKIPPED
[INFO] org.eclipse.wst.server.http.core.tests ............. SKIPPED
[INFO] org.eclipse.wst.server.util.tests .................. SKIPPED
[INFO] org.eclipse.webtools.servertools.site .............. SKIPPED
[INFO] org.eclipse.wst.server_sdk.feature ................. SKIPPED
[INFO] org.eclipse.wst.jsdt.js.common.tests ............... SKIPPED
[INFO] org.eclipse.wst.jsdt.integration.tests ............. SKIPPED
[INFO] org.eclipse.webtools.jsdt.site ..................... SKIPPED
[INFO] PsychoPath XPath 2.0 Processor: SDK Documentation .. SKIPPED
[INFO] PsychoPath XPath 2.0 Processor: SDK Feature ........ SKIPPED
[INFO] PsychoPath XPath 2.0 Processor: Tests for WTP type support SKIPPED
[INFO] org.eclipse.webtools.sourceediting.site ............ SKIPPED
[INFO] org.eclipse.jst.doc.user.feature ................... SKIPPED
[INFO] org.eclipse.webtools.javaee.site ................... SKIPPED
[INFO] org.eclipse.jpt.assembly.feature ................... SKIPPED
[INFO] org.eclipse.jpt_sdk.assembly.feature ............... SKIPPED
[INFO] org.eclipse.jpt.tests.assembly.feature ............. SKIPPED
[INFO] JPA Editor Update Site ............................. SKIPPED
[INFO] org.eclipse.webtools.dali.site ..................... SKIPPED
[INFO] org.eclipse.jsf.assembly.feature ................... SKIPPED
[INFO] org.eclipse.jst.jsf.doc.feature .................... SKIPPED
[INFO] org.eclipse.webtools.jsf.site ...................... SKIPPED
[INFO] org.eclipse.webtools.webservices.site .............. SKIPPED
[INFO] org.eclipse.jst.ws.jaxws.assembly.feature .......... SKIPPED
[INFO] wtp-aggregator ..................................... SKIPPED
[INFO] ------------------------------------------------------------------------
[INFO] BUILD FAILURE
[INFO] ------------------------------------------------------------------------
[INFO] Total time: 03:04 h
[INFO] Finished at: 2018-01-30T03:35:34-05:00
[INFO] Final Memory: 1119M/7609M
[INFO] ------------------------------------------------------------------------
[INFO] o.h.m.e.h.MavenExecutionResultHandler - Build failed with exception(s)
[INFO] o.h.m.e.h.MavenExecutionResultHandler - [1] org.apache.maven.lifecycle.LifecycleExecutionException: Failed to execute goal org.eclipse.tycho:tycho-compiler-plugin:1.1.0-SNAPSHOT:compile (default-compile) on project org.eclipse.wst.xsl.xalan: Compilation failure
[DEBUG] Closing connection to remote
[ERROR] Failed to execute goal org.eclipse.tycho:tycho-compiler-plugin:1.1.0-SNAPSHOT:compile (default-compile) on project org.eclipse.wst.xsl.xalan: Compilation failure: Compilation failure:
[ERROR] /jobs/genie.webtools/WTP-R3_10_Integration/workspace/webtools.sourceediting/xsl/bundles/org.eclipse.wst.xsl.xalan/src-debugger/org/eclipse/wst/xsl/xalan/debugger/XalanDebugger.java:[46]
[ERROR] lastTransformerInChain.getSerializationHandler().flushPending();
[ERROR]                       ^^^^^^^^^^^^^^^^^^^^^^^
[ERROR] The method getSerializationHandler() is undefined for the type TransformerImpl
[ERROR] /jobs/genie.webtools/WTP-R3_10_Integration/workspace/webtools.sourceediting/xsl/bundles/org.eclipse.wst.xsl.xalan/src-debugger/org/eclipse/wst/xsl/xalan/debugger/XalanStyleFrame.java:[131]
[ERROR] currentLine = e.m_styleNode.getEndLineNumber();
[ERROR]                            ^^^^^^^^^^^^^^^^
[ERROR] The method getEndLineNumber() is undefined for the type ElemTemplateElement
[ERROR] 2 problems (2 errors)
[ERROR] -> [Help 1]
[ERROR]
[ERROR] To see the full stack trace of the errors, re-run Maven with the -e switch.
[ERROR] Re-run Maven using the -X switch to enable full debug logging.
[ERROR]
[ERROR] For more information about the errors and possible solutions, please read the following articles:
[ERROR] [Help 1] http://cwiki.apache.org/confluence/display/MAVEN/MojoFailureException
[ERROR]
[ERROR] After correcting the problems, you can resume the build with the command
[ERROR]   mvn <goals> -rf :org.eclipse.wst.xsl.xalan
[DEBUG] Waiting for process to finish
[DEBUG] Result: 1
Terminating xvnc.
Archiving artifacts

--
This message is automatically generated by Hudson.
For more information on Hudson, see: http://hudson-ci.org/
_______________________________________________
wtp-releng mailing list
[hidden email]
To change your delivery options, retrieve your password, or unsubscribe from this list, visit
https://dev.eclipse.org/mailman/listinfo/wtp-releng
Reply | Threaded
Open this post in threaded view
|

[Hudson] Build failed in Hudson: WTP-R3_10_Integration #246

hudsonbuild
See <https://hudson.eclipse.org/webtools/job/WTP-R3_10_Integration/246/>

------------------------------------------
[...truncated 313430 lines...]
[INFO] org.eclipse.wst.webtools.doc.user .................. SKIPPED
[INFO] org.eclipse.wst.web_userdoc.feature ................ SKIPPED
[INFO] org.eclipse.wst.html.ui.infopop .................... SKIPPED
[INFO] org.eclipse.wst.web.ui.infopop ..................... SKIPPED
[INFO] org.eclipse.wst.web_ui.feature ..................... SKIPPED
[INFO] org.eclipse.wst.web_sdk.feature .................... SKIPPED
[INFO] sourceediting.xpath ................................ SKIPPED
[INFO] sourceediting.xpath.bundles ........................ SKIPPED
[INFO] PsychoPath XPath 2.0 Processor ..................... SKIPPED
[INFO] org.eclipse.wst.xml.xpath.core ..................... SKIPPED
[INFO] PsychoPath XPath 2.0 Processor ..................... SKIPPED
[INFO] org.eclipse.wst.xml.xpath.ui ....................... SKIPPED
[INFO] sourceediting.xpath.docs ........................... SKIPPED
[INFO] PsychoPath XPath 2.0 Processor: User Documentation . SKIPPED
[INFO] PsychoPath XPath 2.0 Processor: Branding Plug-in ... SKIPPED
[INFO] sourceediting.xpath.features ....................... SKIPPED
[INFO] PsychoPath XPath 2.0 Processor Feature ............. SKIPPED
[INFO] sourceediting.xsl .................................. SKIPPED
[INFO] sourceediting.xsl.bundles .......................... SKIPPED
[INFO] XSLT Core Plugin ................................... SKIPPED
[INFO] XSLT Launching Plugin .............................. SKIPPED
[INFO] XSLT Debug UI Plugin ............................... SKIPPED
[INFO] sourceediting.xsl.docs ............................. SKIPPED
[INFO] org.eclipse.wst.xsl.doc ............................ SKIPPED
[INFO] XSLT EXSLT Core Plugin ............................. SKIPPED
[INFO] XSLT UI Plugin ..................................... SKIPPED
[INFO] XSLT EXSLT UI Plugin ............................... SKIPPED
[INFO] XSLT JAXP Debug Plugin ............................. SKIPPED
[INFO] XSLT Xalan Plugin .................................. SKIPPED
[INFO] XSLT Saxon Plugin .................................. SKIPPED
[INFO] XSL Tools Branding Plugin .......................... SKIPPED
[INFO] XSLT JAXP Launching UI Plugin ...................... SKIPPED
[INFO] XSLT JAXP Debug UI Plugin .......................... SKIPPED
[INFO] sourceediting.xsl.features ......................... SKIPPED
[INFO] XSLT FeaturePlugin ................................. SKIPPED
[INFO] org.eclipse.wst.xsl.sdk.documentation .............. SKIPPED
[INFO] org.eclipse.wst.xsl_sdk.feature .................... SKIPPED
[INFO] org.eclipse.wst.server.http.core ................... SKIPPED
[INFO] org.eclipse.wst.server.http.ui ..................... SKIPPED
[INFO] org.eclipse.wst.server.preview ..................... SKIPPED
[INFO] org.eclipse.wst.server.preview.adapter ............. SKIPPED
[INFO] org.eclipse.wst.server_adapters.feature ............ SKIPPED
[INFO] org.eclipse.wst.server_adapters.sdk.feature ........ SKIPPED
[INFO] org.eclipse.wst.sdk ................................ SKIPPED
[INFO] org.eclipse.wst.common.project.facet.core.tests .... SKIPPED
[INFO] org.eclipse.wst.common.project.facet.ui.tests ...... SKIPPED
[INFO] org.eclipse.wst.common.snippets.tests .............. SKIPPED
[INFO] org.eclipse.wst.common.tests.ui .................... SKIPPED
[INFO] org.eclipse.wst.common.tests.validation ............ SKIPPED
[INFO] org.eclipse.wst.common.tests.validation.guard ...... SKIPPED
[INFO] org.eclipse.wst.internet.cache.tests ............... SKIPPED
[INFO] org.eclipse.wst.common_tests.feature ............... SKIPPED
[INFO] org.eclipse.wst.css.core.tests ..................... SKIPPED
[INFO] org.eclipse.wst.css.tests.encoding ................. SKIPPED
[INFO] org.eclipse.wst.css.ui.tests ....................... SKIPPED
[INFO] org.eclipse.wst.dtd.core.tests ..................... SKIPPED
[INFO] org.eclipse.wst.dtd.ui.tests ....................... SKIPPED
[INFO] org.eclipse.wst.html.core.tests .................... SKIPPED
[INFO] org.eclipse.wst.html.tests.encoding ................ SKIPPED
[INFO] org.eclipse.wst.html.ui.tests ...................... SKIPPED
[INFO] org.eclipse.wst.internet.monitor.core.tests ........ SKIPPED
[INFO] org.eclipse.wst.internet.monitor.ui.tests .......... SKIPPED
[INFO] tests .............................................. SKIPPED
[INFO] org.eclipse.wst.jsdt.core.tests.compiler ........... SKIPPED
[INFO] org.eclipse.wst.jsdt.core.tests.model .............. SKIPPED
[INFO] org.eclipse.wst.jsdt.debug.core.tests .............. SKIPPED
[INFO] org.eclipse.wst.jsdt.debug.rhino.tests ............. SKIPPED
[INFO] org.eclipse.wst.jsdt.js.node.common.tests .......... SKIPPED
[INFO] org.eclipse.wst.jsdt.ui.tests ...................... SKIPPED
[INFO] org.eclipse.wst.jsdt.web.core.tests ................ SKIPPED
[INFO] org.eclipse.wst.jsdt.web.ui.tests .................. SKIPPED
[INFO] org.eclipse.wst.jsdt_tests.feature ................. SKIPPED
[INFO] org.eclipse.wst.server_tests.feature ............... SKIPPED
[INFO] sourceediting.core.tests ........................... SKIPPED
[INFO] org.eclipse.wst.sse.core.tests ..................... SKIPPED
[INFO] org.eclipse.wst.sse.ui.tests ....................... SKIPPED
[INFO] org.eclipse.wtp.releng.fixups ...................... SKIPPED
[INFO] org.eclipse.wtp.releng.fixups.feature .............. SKIPPED
[INFO] org.eclipse.wtp.releng.tests ....................... SKIPPED
[INFO] org.eclipse.wtp.releng.tools ....................... SKIPPED
[INFO] org.eclipse.wtp.releng.tools.feature ............... SKIPPED
[INFO] org.eclipse.wtp.releng.tests.feature ............... SKIPPED
[INFO] org.eclipse.wst.xml.catalog.tests .................. SKIPPED
[INFO] org.eclipse.wst.xml.core.tests ..................... SKIPPED
[INFO] org.eclipse.wst.xml.ui.tests ....................... SKIPPED
[INFO] org.eclipse.wst.xml.validation.tests ............... SKIPPED
[INFO] org.eclipse.wst.xsd.validation.tests ............... SKIPPED
[INFO] org.eclipse.wst.xsd.core.tests ..................... SKIPPED
[INFO] org.eclipse.wst.xsd.ui.tests ....................... SKIPPED
[INFO] org.eclipse.wst.xml_tests.feature .................. SKIPPED
[INFO] sourceediting.xpath.tests .......................... SKIPPED
[INFO] org.eclipse.wst.xml.xpath.core.tests ............... SKIPPED
[INFO] org.eclipse.wst.xml.xpath.ui.tests ................. SKIPPED
[INFO] PsychoPath XPath 2.0 Processor: XQuery Test Suite .. SKIPPED
[INFO] PsychoPath XPath 2.0 Processor: Tests .............. SKIPPED
[INFO] sourceediting.xsl.tests ............................ SKIPPED
[INFO] XSLT Core Tests .................................... SKIPPED
[INFO] EXSLT Core Tests ................................... SKIPPED
[INFO] XSLT UI Tests ...................................... SKIPPED
[INFO] EXSLT UI Tests ..................................... SKIPPED
[INFO] JAXP Debug Tests ................................... SKIPPED
[INFO] XSL Launching Tests ................................ SKIPPED
[INFO] org.eclipse.wst.xsl.tests .......................... SKIPPED
[INFO] org.eclipse.wst.xsl_tests.feature .................. SKIPPED
[INFO] org.eclipse.wst.web_tests.feature .................. SKIPPED
[INFO] org.eclipse.wst.tests.feature ...................... SKIPPED
[INFO] org.eclipse.wtp.requiredpreques .................... SKIPPED
[INFO] org.eclipse.wtp.xml.dev ............................ SKIPPED
[INFO] org.eclipse.wtp.xml.dev.assembly.feature ........... SKIPPED
[INFO] org.uddi4j.feature ................................. SKIPPED
[INFO] org.eclipse.jst .................................... SKIPPED
[INFO] org.eclipse.wst .................................... SKIPPED
[INFO] org.eclipse.wst.doc.isv.feature .................... SKIPPED
[INFO] org.eclipse.wst.doc.user.feature ................... SKIPPED
[INFO] org.eclipse.wtp.epp.package.jee.intro .............. SKIPPED
[INFO] org.eclipse.wtp.epp.package.capabilities ........... SKIPPED
[INFO] org.eclipse.wtp.javascript.capabilities ............ SKIPPED
[INFO] org.eclipse.wtp.jee.capabilities ................... SKIPPED
[INFO] org.eclipse.wtp.web.capabilities ................... SKIPPED
[INFO] org.eclipse.wtp.xml.capabilities ................... SKIPPED
[INFO] org.eclipse.wtp.capabilities.feature ............... SKIPPED
[INFO] org.eclipse.wtp.capabilities ....................... SKIPPED
[INFO] org.eclipse.wtp.feature.branding.template .......... SKIPPED
[INFO] org.eclipse.wtp.jee ................................ SKIPPED
[INFO] repositories ....................................... SKIPPED
[INFO] org.eclipse.webtools.dali .......................... SKIPPED
[INFO] org.eclipse.jpt.common.utility ..................... SKIPPED
[INFO] org.eclipse.jpt.common.core ........................ SKIPPED
[INFO] org.eclipse.jpt.common.eclipselink.core ............ SKIPPED
[INFO] org.eclipse.jpt.common.ui .......................... SKIPPED
[INFO] org.eclipse.jpt.common.branding .................... SKIPPED
[INFO] org.eclipse.jpt.common.feature ..................... SKIPPED
[INFO] org.eclipse.jpt.common.eclipselink.branding ........ SKIPPED
[INFO] org.eclipse.jpt.common.eclipselink.feature ......... SKIPPED
[INFO] org.eclipse.jpt.common.eclipselink_sdk.feature ..... SKIPPED
[INFO] org.eclipse.jpt.common_sdk.feature ................. SKIPPED
[INFO] org.eclipse.jpt.dbws.eclipselink.core.gen .......... SKIPPED
[INFO] org.eclipse.jpt.dbws.eclipselink.ui ................ SKIPPED
[INFO] org.eclipse.jpt.dbws.eclipselink.branding .......... SKIPPED
[INFO] org.eclipse.jpt.dbws.eclipselink.feature ........... SKIPPED
[INFO] org.eclipse.jpt.dbws.eclipselink_sdk.feature ....... SKIPPED
[INFO] org.eclipse.jpt.jaxb.core .......................... SKIPPED
[INFO] org.eclipse.jpt.jaxb.core.schemagen ................ SKIPPED
[INFO] org.eclipse.jpt.jaxb.eclipselink.core .............. SKIPPED
[INFO] org.eclipse.jpt.jaxb.eclipselink.core.schemagen .... SKIPPED
[INFO] org.eclipse.jpt.jaxb.ui ............................ SKIPPED
[INFO] org.eclipse.jpt.jaxb.branding ...................... SKIPPED
[INFO] org.eclipse.jpt.jaxb.feature ....................... SKIPPED
[INFO] org.eclipse.jpt.jaxb.eclipselink.ui ................ SKIPPED
[INFO] org.eclipse.jpt.jaxb.eclipselink.branding .......... SKIPPED
[INFO] org.eclipse.jpt.jaxb.eclipselink.feature ........... SKIPPED
[INFO] org.eclipse.jpt.jaxb.eclipselink_sdk.feature ....... SKIPPED
[INFO] org.eclipse.jpt.jaxb_sdk.feature ................... SKIPPED
[INFO] org.eclipse.jpt.jpa.db ............................. SKIPPED
[INFO] org.eclipse.jpt.jpa.core ........................... SKIPPED
[INFO] org.eclipse.jpt.jpa.annotate ....................... SKIPPED
[INFO] org.eclipse.jpt.jpa.db.ui .......................... SKIPPED
[INFO] org.eclipse.jpt.jpa.eclipselink.core ............... SKIPPED
[INFO] org.eclipse.jpt.jpa.eclipselink.core.ddlgen ........ SKIPPED
[INFO] org.eclipse.jpt.jpa.gen ............................ SKIPPED
[INFO] org.eclipse.jpt.jpa.ui ............................. SKIPPED
[INFO] org.eclipse.jpt.doc.user ........................... SKIPPED
[INFO] org.eclipse.jpt.jpa.branding ....................... SKIPPED
[INFO] org.eclipse.jpt.jpa.feature ........................ SKIPPED
[INFO] org.eclipse.jpt.jpa.eclipselink.ui ................. SKIPPED
[INFO] org.eclipse.jpt.jpa.eclipselink.branding ........... SKIPPED
[INFO] org.eclipse.jpt.jpa.eclipselink.feature ............ SKIPPED
[INFO] org.eclipse.jpt.jpa.eclipselink_sdk.feature ........ SKIPPED
[INFO] org.eclipse.jpt.doc.isv ............................ SKIPPED
[INFO] org.eclipse.jpt.jpa_sdk.feature .................... SKIPPED
[INFO] JPA Diagram Editor Branding Plug-in ................ SKIPPED
[INFO] JPA Diagram Editor Plug-in ......................... SKIPPED
[INFO] JPA Diagram Editor Branding Plug-in ................ SKIPPED
[INFO] JPA Diagram Editor Feature ......................... SKIPPED
[INFO] org.eclipse.jpt.jpadiagrameditor_sdk.feature ....... SKIPPED
[INFO] dali4x-sdk ......................................... SKIPPED
[INFO] org.eclipse.jpt.common.utility.tests ............... SKIPPED
[INFO] org.eclipse.jpt.common.core.tests .................. SKIPPED
[INFO] org.eclipse.jpt.common.tests.feature ............... SKIPPED
[INFO] org.eclipse.jpt.jpa.core.tests.extension.resource .. SKIPPED
[INFO] org.eclipse.jpt.jpa.tests.feature .................. SKIPPED
[INFO] org.eclipse.jpt.jaxb.eclipselink.tests.feature ..... SKIPPED
[INFO] org.eclipse.jpt.jaxb.tests.feature ................. SKIPPED
[INFO] JPA Diagram Editor Test Plug-in .................... SKIPPED
[INFO] org.eclipse.jpt.jpadiagrameditor.tests.feature ..... SKIPPED
[INFO] dali4x.tests ....................................... SKIPPED
[INFO] jst4x-sdk .......................................... SKIPPED
[INFO] jst4x.tests ........................................ SKIPPED
[INFO] org.eclipse.wst.jsdt.chromium_sdk.feature .......... SKIPPED
[INFO] wst4x-sdk .......................................... SKIPPED
[INFO] org.eclipse.wst.jsdt.chromium.debug.core.tests ..... SKIPPED
[INFO] org.eclipse.wst.jsdt.chromium.tests ................ SKIPPED
[INFO] org.eclipse.wst.jsdt.chromium_tests.feature ........ SKIPPED
[INFO] sourceediting.json.tests ........................... SKIPPED
[INFO] org.eclipse.wst.json.core.tests .................... SKIPPED
[INFO] org.eclipse.wst.json_tests.feature ................. SKIPPED
[INFO] wst4x.tests ........................................ SKIPPED
[INFO] repository ......................................... SKIPPED
[INFO] repositoryunittests ................................ SKIPPED
[INFO] org.eclipse.webtools.common.site ................... SKIPPED
[INFO] org.eclipse.servertools.doc.isv .................... SKIPPED
[INFO] org.eclipse.wst.server.http.core.tests ............. SKIPPED
[INFO] org.eclipse.wst.server.util.tests .................. SKIPPED
[INFO] org.eclipse.webtools.servertools.site .............. SKIPPED
[INFO] org.eclipse.wst.server_sdk.feature ................. SKIPPED
[INFO] org.eclipse.wst.jsdt.js.common.tests ............... SKIPPED
[INFO] org.eclipse.wst.jsdt.integration.tests ............. SKIPPED
[INFO] org.eclipse.webtools.jsdt.site ..................... SKIPPED
[INFO] PsychoPath XPath 2.0 Processor: SDK Documentation .. SKIPPED
[INFO] PsychoPath XPath 2.0 Processor: SDK Feature ........ SKIPPED
[INFO] PsychoPath XPath 2.0 Processor: Tests for WTP type support SKIPPED
[INFO] org.eclipse.webtools.sourceediting.site ............ SKIPPED
[INFO] org.eclipse.jst.doc.user.feature ................... SKIPPED
[INFO] org.eclipse.webtools.javaee.site ................... SKIPPED
[INFO] org.eclipse.jpt.assembly.feature ................... SKIPPED
[INFO] org.eclipse.jpt_sdk.assembly.feature ............... SKIPPED
[INFO] org.eclipse.jpt.tests.assembly.feature ............. SKIPPED
[INFO] JPA Editor Update Site ............................. SKIPPED
[INFO] org.eclipse.webtools.dali.site ..................... SKIPPED
[INFO] org.eclipse.jsf.assembly.feature ................... SKIPPED
[INFO] org.eclipse.jst.jsf.doc.feature .................... SKIPPED
[INFO] org.eclipse.webtools.jsf.site ...................... SKIPPED
[INFO] org.eclipse.webtools.webservices.site .............. SKIPPED
[INFO] org.eclipse.jst.ws.jaxws.assembly.feature .......... SKIPPED
[INFO] wtp-aggregator ..................................... SKIPPED
[INFO] ------------------------------------------------------------------------
[INFO] BUILD FAILURE
[INFO] ------------------------------------------------------------------------
[INFO] Total time: 02:28 h
[INFO] Finished at: 2018-01-31T03:03:05-05:00
[INFO] Final Memory: 1029M/6157M
[INFO] ------------------------------------------------------------------------
[INFO] o.h.m.e.h.MavenExecutionResultHandler - Build failed with exception(s)
[INFO] o.h.m.e.h.MavenExecutionResultHandler - [1] org.apache.maven.lifecycle.LifecycleExecutionException: Failed to execute goal org.eclipse.tycho.extras:tycho-pack200a-plugin:1.0.0:normalize (pack200-normalize) on project org.eclipse.jst.jsf.designtime.tests: Execution pack200-normalize of goal org.eclipse.tycho.extras:tycho-pack200a-plugin:1.0.0:normalize failed: Could not execute pack200, see log for details.
[DEBUG] Closing connection to remote
[ERROR] Failed to execute goal org.eclipse.tycho.extras:tycho-pack200a-plugin:1.0.0:normalize (pack200-normalize) on project org.eclipse.jst.jsf.designtime.tests: Execution pack200-normalize of goal org.eclipse.tycho.extras:tycho-pack200a-plugin:1.0.0:normalize failed: Could not execute pack200, see log for details. Error while executing external command, process killed. Process timeout out after 100 seconds -> [Help 1]
[ERROR]
[ERROR] To see the full stack trace of the errors, re-run Maven with the -e switch.
[ERROR] Re-run Maven using the -X switch to enable full debug logging.
[ERROR]
[ERROR] For more information about the errors and possible solutions, please read the following articles:
[ERROR] [Help 1] http://cwiki.apache.org/confluence/display/MAVEN/PluginExecutionException
[ERROR]
[ERROR] After correcting the problems, you can resume the build with the command
[ERROR]   mvn <goals> -rf :org.eclipse.jst.jsf.designtime.tests
[DEBUG] Waiting for process to finish
[DEBUG] Result: 1
Terminating xvnc.
Archiving artifacts

--
This message is automatically generated by Hudson.
For more information on Hudson, see: http://hudson-ci.org/
_______________________________________________
wtp-releng mailing list
[hidden email]
To change your delivery options, retrieve your password, or unsubscribe from this list, visit
https://dev.eclipse.org/mailman/listinfo/wtp-releng
Reply | Threaded
Open this post in threaded view
|

[Hudson] Build failed in Hudson: WTP-R3_10_Integration #247

hudsonbuild
See <https://hudson.eclipse.org/webtools/job/WTP-R3_10_Integration/247/changes>

Changes:

[nickboldt] Bug 530465 - use followStrictOnly=true when mirroring dali, wst, and jst update sites into main repository

[nickboldt] pull latest from webtools.webservices (feature moves and repo merge)

[nickboldt] repos merged so no longer need webtools.webservices.axis2 and jaxws repos

[nickboldt] repos merged so no longer need webtools.webservices.axis2 and jaxws repos

[Carl Anderson] Update prereqs for WTP 3.10.0

------------------------------------------
[...truncated 4 lines...]
Git Exe: git
Last Built Revision: Revision 9720ca036ae1260d612e566cdfcb54ec941daa46 (origin/master)
Checkout:workspace / <https://hudson.eclipse.org/webtools/job/WTP-R3_10_Integration/ws/> - hudson.remoting.LocalChannel@70d62f5f
Wiping out workspace first.
Cloning the remote Git repository
Cloning repository origin
Fetching upstream changes from git://git.eclipse.org/gitroot/webtools/webtools.releng.aggregator.git
Commencing build of Revision c6880ef8091474303f3b22326f60f05fa6d1b001 (origin/master)
Checking out Revision c6880ef8091474303f3b22326f60f05fa6d1b001 (origin/master)
The origin is non-bare.
Trying to fetch webtools.common into <https://hudson.eclipse.org/webtools/job/WTP-R3_10_Integration/ws/webtools.common>
Fetching upstream changes from git://git.eclipse.org/gitroot/webtools-common/webtools.common
Trying to fetch webtools.dali into <https://hudson.eclipse.org/webtools/job/WTP-R3_10_Integration/ws/webtools.dali>
Fetching upstream changes from git://git.eclipse.org/gitroot/dali/webtools.dali
Trying to fetch webtools.javaee into <https://hudson.eclipse.org/webtools/job/WTP-R3_10_Integration/ws/webtools.javaee>
Fetching upstream changes from git://git.eclipse.org/gitroot/jeetools/webtools.javaee
Trying to fetch webtools.jsdt into <https://hudson.eclipse.org/webtools/job/WTP-R3_10_Integration/ws/webtools.jsdt>
Fetching upstream changes from git://git.eclipse.org/gitroot/jsdt/webtools.jsdt
Trying to fetch webtools.jsf into <https://hudson.eclipse.org/webtools/job/WTP-R3_10_Integration/ws/webtools.jsf>
Fetching upstream changes from git://git.eclipse.org/gitroot/jsf/webtools.jsf
Trying to fetch webtools.releng into <https://hudson.eclipse.org/webtools/job/WTP-R3_10_Integration/ws/webtools.releng>
Fetching upstream changes from git://git.eclipse.org/gitroot/webtools/webtools.releng
Trying to fetch webtools.servertools into <https://hudson.eclipse.org/webtools/job/WTP-R3_10_Integration/ws/webtools.servertools>
Fetching upstream changes from git://git.eclipse.org/gitroot/servertools/webtools.servertools
Trying to fetch webtools.sourceediting into <https://hudson.eclipse.org/webtools/job/WTP-R3_10_Integration/ws/webtools.sourceediting>
Fetching upstream changes from git://git.eclipse.org/gitroot/sourceediting/webtools.sourceediting
Trying to fetch webtools.webservices into <https://hudson.eclipse.org/webtools/job/WTP-R3_10_Integration/ws/webtools.webservices>
Fetching upstream changes from git://git.eclipse.org/gitroot/webservices/webtools.webservices
The origin is non-bare.
Starting xvnc
[workspace] $ Xvnc :451 -geometry 1024x768 -depth 24 -ac -SecurityTypes none -noreset
[workspace] $ /bin/bash /tmp/hudson4131520648286074778.sh

Xvnc TigerVNC 1.4.1 - built ??? ?? ???? ??:??:??
Copyright (C) 1999-2013 TigerVNC Team and many others (see README.txt)
See http://www.tigervnc.org for information on TigerVNC.
Underlying X server release 11502000, The X.Org Foundation

Initializing built-in extension VNC-EXTENSION
Initializing built-in extension Generic Event Extension
Initializing built-in extension SHAPE
Initializing built-in extension MIT-SHM
Initializing built-in extension XInputExtension
Initializing built-in extension XTEST
Initializing built-in extension BIG-REQUESTS
Initializing built-in extension SYNC
Initializing built-in extension XKEYBOARD
Initializing built-in extension XC-MISC
Initializing built-in extension XFIXES
Initializing built-in extension RENDER
Initializing built-in extension RANDR
Initializing built-in extension COMPOSITE
Initializing built-in extension DAMAGE
Initializing built-in extension MIT-SCREEN-SAVER
Initializing built-in extension DOUBLE-BUFFER
Initializing built-in extension RECORD
Initializing built-in extension DPMS
Initializing built-in extension Present
Initializing built-in extension X-Resource
Initializing built-in extension XVideo
Initializing built-in extension XVideo-MotionCompensation
Initializing built-in extension GLX

Thu Feb  1 00:46:57 2018
 vncext:      VNC extension running!
 vncext:      Listening for VNC connections on all interface(s), port 6351
 vncext:      created VNC server for screen 0
Entering 'webtools.common'
Entering 'webtools.dali'
Entering 'webtools.javaee'
Entering 'webtools.jsdt'
Entering 'webtools.jsf'
[dix] Could not init font path element /usr/share/fonts/TTF/, removing from list!
[dix] Could not init font path element /usr/share/fonts/OTF/, removing from list!
Entering 'webtools.releng'
Entering 'webtools.servertools'
Entering 'webtools.sourceediting'
Entering 'webtools.webservices'
Entering 'webtools.common'
HEAD is now at b185b74 Bug 525342 remove unneeded sourceTemplate{Plugin,Bundle}/ content; add .gitkeep files for more sourceTemplateFeature folders
Entering 'webtools.dali'
HEAD is now at 51fe2e9 add references to upstream webtools-sourceediting-site and webtools-jeetools-site repos
Entering 'webtools.javaee'
HEAD is now at 4e7cbc9 528792 add README.deprecated.txt notes to the features that moved to webservices
Entering 'webtools.jsdt'
HEAD is now at d905e75 add bundle org.eclipse.wst.jsdt.debug.rhino.ui to webtools.jsdt update site, since required by downstream webservices repo : org.eclipse.jst.web_ui.feature.feature.group
Entering 'webtools.jsf'
HEAD is now at 490184c add jar files to .gitignore
Entering 'webtools.releng'
HEAD is now at 4982c8a Mark old index.html.template.php deprecated, since we now generate the web page from webtools.releng.aggregator/wtp-parent/templateFiles/index.html.template.php
Entering 'webtools.servertools'
HEAD is now at 112f125 Bug 529801 - [Photon] Modify url in discovery plugin for jbosstools update site
Entering 'webtools.sourceediting'
HEAD is now at b83ce57 remove unused @buildversionid@; add org.eclipse.jst.jsp.core.tests so it can be seen by downstream repos
Entering 'webtools.webservices'
HEAD is now at 4a5de39 Fix all poms.xml
Removing .Xauthority-5981888837252812343
HEAD is now at c6880ef Update prereqs for WTP 3.10.0
/jobs/genie.webtools/WTP-R3_10_Integration/workspace/webtools.releng /jobs/genie.webtools/WTP-R3_10_Integration/workspace
Switched to branch 'master'
Your branch is up-to-date with 'origin/master'.
Already up-to-date.
/jobs/genie.webtools/WTP-R3_10_Integration/workspace
/jobs/genie.webtools/WTP-R3_10_Integration/workspace/webtools.common /jobs/genie.webtools/WTP-R3_10_Integration/workspace
Switched to branch 'master'
Your branch is up-to-date with 'origin/master'.
Already up-to-date.
/jobs/genie.webtools/WTP-R3_10_Integration/workspace
/jobs/genie.webtools/WTP-R3_10_Integration/workspace/webtools.servertools /jobs/genie.webtools/WTP-R3_10_Integration/workspace
Switched to branch 'master'
Your branch is up-to-date with 'origin/master'.
Already up-to-date.
/jobs/genie.webtools/WTP-R3_10_Integration/workspace
/jobs/genie.webtools/WTP-R3_10_Integration/workspace/webtools.jsdt /jobs/genie.webtools/WTP-R3_10_Integration/workspace
Switched to branch 'master'
Your branch is up-to-date with 'origin/master'.
Already up-to-date.
/jobs/genie.webtools/WTP-R3_10_Integration/workspace
/jobs/genie.webtools/WTP-R3_10_Integration/workspace/webtools.sourceediting /jobs/genie.webtools/WTP-R3_10_Integration/workspace
Switched to branch 'master'
Your branch is up-to-date with 'origin/master'.
Already up-to-date.
/jobs/genie.webtools/WTP-R3_10_Integration/workspace
/jobs/genie.webtools/WTP-R3_10_Integration/workspace/webtools.javaee /jobs/genie.webtools/WTP-R3_10_Integration/workspace
Switched to branch 'master'
Your branch is up-to-date with 'origin/master'.
Already up-to-date.
/jobs/genie.webtools/WTP-R3_10_Integration/workspace
/jobs/genie.webtools/WTP-R3_10_Integration/workspace/webtools.dali /jobs/genie.webtools/WTP-R3_10_Integration/workspace
Switched to branch 'master'
Your branch is up-to-date with 'origin/master'.
Already up-to-date.
/jobs/genie.webtools/WTP-R3_10_Integration/workspace
/jobs/genie.webtools/WTP-R3_10_Integration/workspace/webtools.jsf /jobs/genie.webtools/WTP-R3_10_Integration/workspace
Switched to branch 'master'
Your branch is up-to-date with 'origin/master'.
Already up-to-date.
/jobs/genie.webtools/WTP-R3_10_Integration/workspace
/jobs/genie.webtools/WTP-R3_10_Integration/workspace/webtools.webservices /jobs/genie.webtools/WTP-R3_10_Integration/workspace
Previous HEAD position was 4a5de39... Fix all poms.xml
Switched to branch 'master'
Your branch is up-to-date with 'origin/master'.
Already up-to-date.
/jobs/genie.webtools/WTP-R3_10_Integration/workspace
[INFO] Using Maven 3 installation: Maven 3.5.2
[INFO] Checking Maven 3 installation environment
[workspace] $ /shared/common/maven/apache-maven-3.5.2/bin/mvn --help
[INFO] Checking Maven 3 installation version
[INFO] Detected Maven 3 installation version: 3.5.2
[WARN] Detected superfluous option: -V
[workspace] $ /shared/common/maven/apache-maven-3.5.2/bin/mvn clean install -Pintegration -V -U -V -B -DplatformRepoUrl=http://download.eclipse.org/eclipse/updates/4.8milestones/S-4.8M5-201801242000/ -DtychoVersion=1.0.0 -Dmaven.test.skip=true -Dplatform-repo.url=http://download.eclipse.org/eclipse/updates/4.8milestones/S-4.8M5-201801242000/ -Dmaven.test.error.ignore=true -Dmaven.test.failure.ignore=true -Dtycho-extras.version=1.0.0 -Dsurefire.timeout=1800 -DskipWithIssues=false -Dtycho.version=1.0.0 -Dmaven.ext.class.path=/home/hudson/genie.webtools/.hudson/maven/slavebundle/resources:/home/hudson/genie.webtools/.hudson/maven/slavebundle/lib/maven3-eventspy-3.1.jar:/home/hudson/genie.webtools/.hudson/war/webapp/WEB-INF/lib/hudson-remoting-3.0.3.jar -Dhudson.eventspy.port=39454 -Dmaven.repo.local=<https://hudson.eclipse.org/webtools/job/WTP-R3_10_Integration/ws/.maven/repo> -f pom.xml -P bree-libs -P eclipse-sign -ff
[DEBUG] Waiting for connection on port: 39454
Apache Maven 3.5.2 (138edd61fd100ec658bfa2d307c43b76940a5d7d; 2017-10-18T03:58:13-04:00)
Maven home: /shared/common/maven/apache-maven-3.5.2
Java version: 1.8.0_162, vendor: Oracle Corporation
Java home: /opt/public/common/java/oracle/jdk1.8.0_162_x64/jre
Default locale: en_US, platform encoding: UTF-8
OS name: "linux", version: "3.12.51-52.39-default", arch: "amd64", family: "unix"
SLF4J: Class path contains multiple SLF4J bindings.
SLF4J: Found binding in [jar:file:/home/hudson/genie.webtools/.hudson/maven/slavebundle/lib/maven3-eventspy-runtime.jar!/org/slf4j/impl/StaticLoggerBinder.class]
SLF4J: Found binding in [jar:file:/shared/common/maven/apache-maven-3.5.2/lib/maven-slf4j-provider-3.5.2.jar!/org/slf4j/impl/StaticLoggerBinder.class]
SLF4J: See http://www.slf4j.org/codes.html#multiple_bindings for an explanation.
[DEBUG] Connected to remote
[WARNING] Failed to notify spy org.hudsonci.maven.eventspy_31.DelegatingEventSpy: DEFAULT_USER_SETTINGS_FILE
[WARN] o.h.m.e.EventSpyProcessor - Unhandled event: org.apache.maven.toolchain.building.DefaultToolchainsBuildingRequest@3e6f3bae (org.apache.maven.toolchain.building.DefaultToolchainsBuildingRequest)
[WARN] o.h.m.e.EventSpyProcessor - Unhandled event: org.apache.maven.toolchain.building.DefaultToolchainsBuildingRequest@3e6f3bae (org.apache.maven.toolchain.building.DefaultToolchainsBuildingRequest)
[INFO] o.h.m.e.h.MavenExecutionRequestHandler - Using tool-chains document ID: f1492191-c1d9-4caa-a6bf-44160486454d
[INFO] Scanning for projects...
[ERROR] [ERROR] Some problems were encountered while processing the POMs:
[FATAL] Non-resolvable parent POM for org.eclipse.webtools.javaee:org.eclipse.jst.enterprise_core.feature:3.9.0-SNAPSHOT: Could not find artifact org.eclipse.webtools.javaee:javaee.features:pom:3.6.0-SNAPSHOT and 'parent.relativePath' points at wrong local POM @ line 16, column 11
[FATAL] Non-resolvable parent POM for org.eclipse.webtools.javaee:org.eclipse.jst.web_tests.feature:3.6.1-SNAPSHOT: Could not find artifact org.eclipse.webtools.javaee:javaee.features:pom:3.6.0-SNAPSHOT and 'parent.relativePath' points at wrong local POM @ line 16, column 11
[FATAL] Non-resolvable parent POM for org.eclipse.webtools.javaee:org.eclipse.jst.doc.user.feature:1.6.0-SNAPSHOT: Could not find artifact org.eclipse.webtools.javaee:javaee.features:pom:3.6.0-SNAPSHOT and 'parent.relativePath' points at wrong local POM @ line 16, column 11
[FATAL] Non-resolvable parent POM for org.eclipse.webtools.javaee:org.eclipse.jst.enterprise_sdk.feature:3.8.1-SNAPSHOT: Could not find artifact org.eclipse.webtools.javaee:javaee.features:pom:3.6.0-SNAPSHOT and 'parent.relativePath' points at wrong local POM @ line 16, column 11
[FATAL] Non-resolvable parent POM for org.eclipse.webtools.javaee:org.eclipse.jst.enterprise_tests.feature:3.6.0-SNAPSHOT: Could not find artifact org.eclipse.webtools.javaee:javaee.features:pom:3.6.0-SNAPSHOT and 'parent.relativePath' points at wrong local POM @ line 16, column 11
[FATAL] Non-resolvable parent POM for org.eclipse.webtools.javaee:org.eclipse.jst.enterprise_ui.feature:3.9.2-SNAPSHOT: Could not find artifact org.eclipse.webtools.javaee:javaee.features:pom:3.6.0-SNAPSHOT and 'parent.relativePath' points at wrong local POM @ line 16, column 11
[FATAL] Non-resolvable parent POM for org.eclipse.webtools.javaee:org.eclipse.jst.enterprise_userdoc.feature:3.6.0-SNAPSHOT: Could not find artifact org.eclipse.webtools.javaee:javaee.features:pom:3.6.0-SNAPSHOT and 'parent.relativePath' points at wrong local POM @ line 16, column 11
[FATAL] Non-resolvable parent POM for org.eclipse.webtools.javaee:org.eclipse.jst.web_core.feature:3.9.1-SNAPSHOT: Could not find artifact org.eclipse.webtools.javaee:javaee.features:pom:3.6.0-SNAPSHOT and 'parent.relativePath' points at wrong local POM @ line 16, column 11
[FATAL] Non-resolvable parent POM for org.eclipse.webtools.javaee:org.eclipse.jst.web_sdk.feature:3.8.0-SNAPSHOT: Could not find artifact org.eclipse.webtools.javaee:javaee.features:pom:3.6.0-SNAPSHOT and 'parent.relativePath' points at wrong local POM @ line 16, column 11
[FATAL] Non-resolvable parent POM for org.eclipse.webtools.javaee:org.eclipse.jst.web_ui.feature:3.9.0-SNAPSHOT: Could not find artifact org.eclipse.webtools.javaee:javaee.features:pom:3.6.0-SNAPSHOT and 'parent.relativePath' points at wrong local POM @ line 16, column 11
[FATAL] Non-resolvable parent POM for org.eclipse.webtools.javaee:org.eclipse.jst.web_userdoc.feature:3.6.0-SNAPSHOT: Could not find artifact org.eclipse.webtools.javaee:javaee.features:pom:3.6.0-SNAPSHOT and 'parent.relativePath' points at wrong local POM @ line 16, column 11
[ERROR] Child module /jobs/genie.webtools/WTP-R3_10_Integration/workspace/webtools.webservices.axis2 of /jobs/genie.webtools/WTP-R3_10_Integration/workspace/pom.xml does not exist @
[ERROR] Child module /jobs/genie.webtools/WTP-R3_10_Integration/workspace/webtools.webservices.jaxws of /jobs/genie.webtools/WTP-R3_10_Integration/workspace/pom.xml does not exist @
 @
[INFO] o.h.m.e.h.MavenExecutionResultHandler - Build failed with exception(s)
[INFO] o.h.m.e.h.MavenExecutionResultHandler - [1] org.apache.maven.project.ProjectBuildingException: Some problems were encountered while processing the POMs:
[FATAL] Non-resolvable parent POM for org.eclipse.webtools.javaee:org.eclipse.jst.enterprise_core.feature:3.9.0-SNAPSHOT: Could not find artifact org.eclipse.webtools.javaee:javaee.features:pom:3.6.0-SNAPSHOT and 'parent.relativePath' points at wrong local POM @ line 16, column 11
[FATAL] Non-resolvable parent POM for org.eclipse.webtools.javaee:org.eclipse.jst.web_tests.feature:3.6.1-SNAPSHOT: Could not find artifact org.eclipse.webtools.javaee:javaee.features:pom:3.6.0-SNAPSHOT and 'parent.relativePath' points at wrong local POM @ line 16, column 11
[FATAL] Non-resolvable parent POM for org.eclipse.webtools.javaee:org.eclipse.jst.doc.user.feature:1.6.0-SNAPSHOT: Could not find artifact org.eclipse.webtools.javaee:javaee.features:pom:3.6.0-SNAPSHOT and 'parent.relativePath' points at wrong local POM @ line 16, column 11
[FATAL] Non-resolvable parent POM for org.eclipse.webtools.javaee:org.eclipse.jst.enterprise_sdk.feature:3.8.1-SNAPSHOT: Could not find artifact org.eclipse.webtools.javaee:javaee.features:pom:3.6.0-SNAPSHOT and 'parent.relativePath' points at wrong local POM @ line 16, column 11
[FATAL] Non-resolvable parent POM for org.eclipse.webtools.javaee:org.eclipse.jst.enterprise_tests.feature:3.6.0-SNAPSHOT: Could not find artifact org.eclipse.webtools.javaee:javaee.features:pom:3.6.0-SNAPSHOT and 'parent.relativePath' points at wrong local POM @ line 16, column 11
[FATAL] Non-resolvable parent POM for org.eclipse.webtools.javaee:org.eclipse.jst.enterprise_ui.feature:3.9.2-SNAPSHOT: Could not find artifact org.eclipse.webtools.javaee:javaee.features:pom:3.6.0-SNAPSHOT and 'parent.relativePath' points at wrong local POM @ line 16, column 11
[FATAL] Non-resolvable parent POM for org.eclipse.webtools.javaee:org.eclipse.jst.enterprise_userdoc.feature:3.6.0-SNAPSHOT: Could not find artifact org.eclipse.webtools.javaee:javaee.features:pom:3.6.0-SNAPSHOT and 'parent.relativePath' points at wrong local POM @ line 16, column 11
[FATAL] Non-resolvable parent POM for org.eclipse.webtools.javaee:org.eclipse.jst.web_core.feature:3.9.1-SNAPSHOT: Could not find artifact org.eclipse.webtools.javaee:javaee.features:pom:3.6.0-SNAPSHOT and 'parent.relativePath' points at wrong local POM @ line 16, column 11
[FATAL] Non-resolvable parent POM for org.eclipse.webtools.javaee:org.eclipse.jst.web_sdk.feature:3.8.0-SNAPSHOT: Could not find artifact org.eclipse.webtools.javaee:javaee.features:pom:3.6.0-SNAPSHOT and 'parent.relativePath' points at wrong local POM @ line 16, column 11
[FATAL] Non-resolvable parent POM for org.eclipse.webtools.javaee:org.eclipse.jst.web_ui.feature:3.9.0-SNAPSHOT: Could not find artifact org.eclipse.webtools.javaee:javaee.features:pom:3.6.0-SNAPSHOT and 'parent.relativePath' points at wrong local POM @ line 16, column 11
[FATAL] Non-resolvable parent POM for org.eclipse.webtools.javaee:org.eclipse.jst.web_userdoc.feature:3.6.0-SNAPSHOT: Could not find artifact org.eclipse.webtools.javaee:javaee.features:pom:3.6.0-SNAPSHOT and 'parent.relativePath' points at wrong local POM @ line 16, column 11
[ERROR] Child module /jobs/genie.webtools/WTP-R3_10_Integration/workspace/webtools.webservices.axis2 of /jobs/genie.webtools/WTP-R3_10_Integration/workspace/pom.xml does not exist @
[ERROR] Child module /jobs/genie.webtools/WTP-R3_10_Integration/workspace/webtools.webservices.jaxws of /jobs/genie.webtools/WTP-R3_10_Integration/workspace/pom.xml does not exist @

[DEBUG] Closing connection to remote
[ERROR] The build could not read 12 projects -> [Help 1]
[ERROR]  
[ERROR]   The project org.eclipse.webtools.javaee:org.eclipse.jst.enterprise_core.feature:3.9.0-SNAPSHOT (/jobs/genie.webtools/WTP-R3_10_Integration/workspace/webtools.webservices/core/features/javaee-web/org.eclipse.jst.enterprise_core.feature/pom.xml) has 1 error
[ERROR]     Non-resolvable parent POM for org.eclipse.webtools.javaee:org.eclipse.jst.enterprise_core.feature:3.9.0-SNAPSHOT: Could not find artifact org.eclipse.webtools.javaee:javaee.features:pom:3.6.0-SNAPSHOT and 'parent.relativePath' points at wrong local POM @ line 16, column 11 -> [Help 2]
[ERROR]  
[ERROR]   The project org.eclipse.webtools.javaee:org.eclipse.jst.web_tests.feature:3.6.1-SNAPSHOT (/jobs/genie.webtools/WTP-R3_10_Integration/workspace/webtools.webservices/core/features/javaee-web/org.eclipse.jst.web_tests.feature/pom.xml) has 1 error
[ERROR]     Non-resolvable parent POM for org.eclipse.webtools.javaee:org.eclipse.jst.web_tests.feature:3.6.1-SNAPSHOT: Could not find artifact org.eclipse.webtools.javaee:javaee.features:pom:3.6.0-SNAPSHOT and 'parent.relativePath' points at wrong local POM @ line 16, column 11 -> [Help 2]
[ERROR]  
[ERROR]   The project org.eclipse.webtools.javaee:org.eclipse.jst.doc.user.feature:1.6.0-SNAPSHOT (/jobs/genie.webtools/WTP-R3_10_Integration/workspace/webtools.webservices/core/features/javaee-web/org.eclipse.jst.doc.user.feature/pom.xml) has 1 error
[ERROR]     Non-resolvable parent POM for org.eclipse.webtools.javaee:org.eclipse.jst.doc.user.feature:1.6.0-SNAPSHOT: Could not find artifact org.eclipse.webtools.javaee:javaee.features:pom:3.6.0-SNAPSHOT and 'parent.relativePath' points at wrong local POM @ line 16, column 11 -> [Help 2]
[ERROR]  
[ERROR]   The project org.eclipse.webtools.javaee:org.eclipse.jst.enterprise_sdk.feature:3.8.1-SNAPSHOT (/jobs/genie.webtools/WTP-R3_10_Integration/workspace/webtools.webservices/core/features/javaee-web/org.eclipse.jst.enterprise_sdk.feature/pom.xml) has 1 error
[ERROR]     Non-resolvable parent POM for org.eclipse.webtools.javaee:org.eclipse.jst.enterprise_sdk.feature:3.8.1-SNAPSHOT: Could not find artifact org.eclipse.webtools.javaee:javaee.features:pom:3.6.0-SNAPSHOT and 'parent.relativePath' points at wrong local POM @ line 16, column 11 -> [Help 2]
[ERROR]  
[ERROR]   The project org.eclipse.webtools.javaee:org.eclipse.jst.enterprise_tests.feature:3.6.0-SNAPSHOT (/jobs/genie.webtools/WTP-R3_10_Integration/workspace/webtools.webservices/core/features/javaee-web/org.eclipse.jst.enterprise_tests.feature/pom.xml) has 1 error
[ERROR]     Non-resolvable parent POM for org.eclipse.webtools.javaee:org.eclipse.jst.enterprise_tests.feature:3.6.0-SNAPSHOT: Could not find artifact org.eclipse.webtools.javaee:javaee.features:pom:3.6.0-SNAPSHOT and 'parent.relativePath' points at wrong local POM @ line 16, column 11 -> [Help 2]
[ERROR]  
[ERROR]   The project org.eclipse.webtools.javaee:org.eclipse.jst.enterprise_ui.feature:3.9.2-SNAPSHOT (/jobs/genie.webtools/WTP-R3_10_Integration/workspace/webtools.webservices/core/features/javaee-web/org.eclipse.jst.enterprise_ui.feature/pom.xml) has 1 error
[ERROR]     Non-resolvable parent POM for org.eclipse.webtools.javaee:org.eclipse.jst.enterprise_ui.feature:3.9.2-SNAPSHOT: Could not find artifact org.eclipse.webtools.javaee:javaee.features:pom:3.6.0-SNAPSHOT and 'parent.relativePath' points at wrong local POM @ line 16, column 11 -> [Help 2]
[ERROR]  
[ERROR]   The project org.eclipse.webtools.javaee:org.eclipse.jst.enterprise_userdoc.feature:3.6.0-SNAPSHOT (/jobs/genie.webtools/WTP-R3_10_Integration/workspace/webtools.webservices/core/features/javaee-web/org.eclipse.jst.enterprise_userdoc.feature/pom.xml) has 1 error
[ERROR]     Non-resolvable parent POM for org.eclipse.webtools.javaee:org.eclipse.jst.enterprise_userdoc.feature:3.6.0-SNAPSHOT: Could not find artifact org.eclipse.webtools.javaee:javaee.features:pom:3.6.0-SNAPSHOT and 'parent.relativePath' points at wrong local POM @ line 16, column 11 -> [Help 2]
[ERROR]  
[ERROR]   The project org.eclipse.webtools.javaee:org.eclipse.jst.web_core.feature:3.9.1-SNAPSHOT (/jobs/genie.webtools/WTP-R3_10_Integration/workspace/webtools.webservices/core/features/javaee-web/org.eclipse.jst.web_core.feature/pom.xml) has 1 error
[ERROR]     Non-resolvable parent POM for org.eclipse.webtools.javaee:org.eclipse.jst.web_core.feature:3.9.1-SNAPSHOT: Could not find artifact org.eclipse.webtools.javaee:javaee.features:pom:3.6.0-SNAPSHOT and 'parent.relativePath' points at wrong local POM @ line 16, column 11 -> [Help 2]
[ERROR]  
[ERROR]   The project org.eclipse.webtools.javaee:org.eclipse.jst.web_sdk.feature:3.8.0-SNAPSHOT (/jobs/genie.webtools/WTP-R3_10_Integration/workspace/webtools.webservices/core/features/javaee-web/org.eclipse.jst.web_sdk.feature/pom.xml) has 1 error
[ERROR]     Non-resolvable parent POM for org.eclipse.webtools.javaee:org.eclipse.jst.web_sdk.feature:3.8.0-SNAPSHOT: Could not find artifact org.eclipse.webtools.javaee:javaee.features:pom:3.6.0-SNAPSHOT and 'parent.relativePath' points at wrong local POM @ line 16, column 11 -> [Help 2]
[ERROR]  
[ERROR]   The project org.eclipse.webtools.javaee:org.eclipse.jst.web_ui.feature:3.9.0-SNAPSHOT (/jobs/genie.webtools/WTP-R3_10_Integration/workspace/webtools.webservices/core/features/javaee-web/org.eclipse.jst.web_ui.feature/pom.xml) has 1 error
[ERROR]     Non-resolvable parent POM for org.eclipse.webtools.javaee:org.eclipse.jst.web_ui.feature:3.9.0-SNAPSHOT: Could not find artifact org.eclipse.webtools.javaee:javaee.features:pom:3.6.0-SNAPSHOT and 'parent.relativePath' points at wrong local POM @ line 16, column 11 -> [Help 2]
[ERROR]  
[ERROR]   The project org.eclipse.webtools.javaee:org.eclipse.jst.web_userdoc.feature:3.6.0-SNAPSHOT (/jobs/genie.webtools/WTP-R3_10_Integration/workspace/webtools.webservices/core/features/javaee-web/org.eclipse.jst.web_userdoc.feature/pom.xml) has 1 error
[ERROR]     Non-resolvable parent POM for org.eclipse.webtools.javaee:org.eclipse.jst.web_userdoc.feature:3.6.0-SNAPSHOT: Could not find artifact org.eclipse.webtools.javaee:javaee.features:pom:3.6.0-SNAPSHOT and 'parent.relativePath' points at wrong local POM @ line 16, column 11 -> [Help 2]
[ERROR]  
[ERROR]   The project org.eclipse.wtp:wtp-aggregator:3.6.0-SNAPSHOT (/jobs/genie.webtools/WTP-R3_10_Integration/workspace/pom.xml) has 2 errors
[ERROR]     Child module /jobs/genie.webtools/WTP-R3_10_Integration/workspace/webtools.webservices.axis2 of /jobs/genie.webtools/WTP-R3_10_Integration/workspace/pom.xml does not exist
[ERROR]     Child module /jobs/genie.webtools/WTP-R3_10_Integration/workspace/webtools.webservices.jaxws of /jobs/genie.webtools/WTP-R3_10_Integration/workspace/pom.xml does not exist
[ERROR]
[ERROR] To see the full stack trace of the errors, re-run Maven with the -e switch.
[ERROR] Re-run Maven using the -X switch to enable full debug logging.
[ERROR]
[ERROR] For more information about the errors and possible solutions, please read the following articles:
[ERROR] [Help 1] http://cwiki.apache.org/confluence/display/MAVEN/ProjectBuildingException
[ERROR] [Help 2] http://cwiki.apache.org/confluence/display/MAVEN/UnresolvableModelException
[DEBUG] Waiting for process to finish
[DEBUG] Result: 1
Terminating xvnc.
Archiving artifacts

--
This message is automatically generated by Hudson.
For more information on Hudson, see: http://hudson-ci.org/
_______________________________________________
wtp-releng mailing list
[hidden email]
To change your delivery options, retrieve your password, or unsubscribe from this list, visit
https://dev.eclipse.org/mailman/listinfo/wtp-releng
Reply | Threaded
Open this post in threaded view
|

[Hudson] Build failed in Hudson: WTP-R3_10_Integration #248

hudsonbuild
See <https://hudson.eclipse.org/webtools/job/WTP-R3_10_Integration/248/>

------------------------------------------
Started by user [hidden email]
Cleaning the workspace because project is configured to clean the workspace before each build.
Checkout:workspace / <https://hudson.eclipse.org/webtools/job/WTP-R3_10_Integration/ws/> - hudson.remoting.LocalChannel@70d62f5f
Using strategy: Default
Git Exe: git
Last Built Revision: Revision c6880ef8091474303f3b22326f60f05fa6d1b001 (origin/master)
Checkout:workspace / <https://hudson.eclipse.org/webtools/job/WTP-R3_10_Integration/ws/> - hudson.remoting.LocalChannel@70d62f5f
Wiping out workspace first.
Cloning the remote Git repository
Cloning repository origin
Fetching upstream changes from git://git.eclipse.org/gitroot/webtools/webtools.releng.aggregator.git
Commencing build of Revision 7b65e977ced86f6f42c9c770075d4379a475be4a (origin/master)
Checking out Revision 7b65e977ced86f6f42c9c770075d4379a475be4a (origin/master)
The origin is non-bare.
Trying to fetch webtools.common into <https://hudson.eclipse.org/webtools/job/WTP-R3_10_Integration/ws/webtools.common>
Fetching upstream changes from git://git.eclipse.org/gitroot/webtools-common/webtools.common
Trying to fetch webtools.dali into <https://hudson.eclipse.org/webtools/job/WTP-R3_10_Integration/ws/webtools.dali>
Fetching upstream changes from git://git.eclipse.org/gitroot/dali/webtools.dali
Trying to fetch webtools.javaee into <https://hudson.eclipse.org/webtools/job/WTP-R3_10_Integration/ws/webtools.javaee>
Fetching upstream changes from git://git.eclipse.org/gitroot/jeetools/webtools.javaee
Trying to fetch webtools.jsdt into <https://hudson.eclipse.org/webtools/job/WTP-R3_10_Integration/ws/webtools.jsdt>
Fetching upstream changes from git://git.eclipse.org/gitroot/jsdt/webtools.jsdt
Trying to fetch webtools.jsf into <https://hudson.eclipse.org/webtools/job/WTP-R3_10_Integration/ws/webtools.jsf>
Fetching upstream changes from git://git.eclipse.org/gitroot/jsf/webtools.jsf
Trying to fetch webtools.releng into <https://hudson.eclipse.org/webtools/job/WTP-R3_10_Integration/ws/webtools.releng>
Fetching upstream changes from git://git.eclipse.org/gitroot/webtools/webtools.releng
Trying to fetch webtools.servertools into <https://hudson.eclipse.org/webtools/job/WTP-R3_10_Integration/ws/webtools.servertools>
Fetching upstream changes from git://git.eclipse.org/gitroot/servertools/webtools.servertools
Trying to fetch webtools.sourceediting into <https://hudson.eclipse.org/webtools/job/WTP-R3_10_Integration/ws/webtools.sourceediting>
Fetching upstream changes from git://git.eclipse.org/gitroot/sourceediting/webtools.sourceediting
Trying to fetch webtools.webservices into <https://hudson.eclipse.org/webtools/job/WTP-R3_10_Integration/ws/webtools.webservices>
Fetching upstream changes from git://git.eclipse.org/gitroot/webservices/webtools.webservices
The origin is non-bare.
FATAL: Error performing command: git submodule update
Command "git submodule update" returned status code 1: Cloning into 'webtools.common'...
Submodule path 'webtools.common': checked out 'b185b741e71451a93638c57e47615da3693b5696'
Cloning into 'webtools.dali'...
Submodule path 'webtools.dali': checked out '51fe2e9e217c5dbc19a51d8d0f2168e87e731462'
Cloning into 'webtools.javaee'...
Submodule path 'webtools.javaee': checked out '4e7cbc9358c4a9900b41a5f96d191c6478cb3c4d'
Cloning into 'webtools.jsdt'...
Submodule path 'webtools.jsdt': checked out 'd905e75a64925461bbbd2a41d2e8e53ff2f88916'
Cloning into 'webtools.jsf'...
Submodule path 'webtools.jsf': checked out '490184c2fccf601aed83446ef34ba5f1776e8874'
Cloning into 'webtools.releng'...
Submodule path 'webtools.releng': checked out '4982c8a2654013d7d27abec659e8d77c033c0a89'
Cloning into 'webtools.servertools'...
fatal: reference is not a tree: 7eedadd0a08b15e8c8519863d6080d59580cf8de
Cloning into 'webtools.sourceediting'...
fatal: reference is not a tree: 88653a4dd7423556cecdf4f705791d7dd63cce32
Cloning into 'webtools.webservices'...
Submodule path 'webtools.webservices': checked out 'bbef9be7c532e4aa99c6a88e1acfabe809f2b5ed'
Unable to checkout '7eedadd0a08b15e8c8519863d6080d59580cf8de' in submodule path 'webtools.servertools'
Unable to checkout '88653a4dd7423556cecdf4f705791d7dd63cce32' in submodule path 'webtools.sourceediting'

hudson.plugins.git.GitException: Error performing command: git submodule update
Command "git submodule update" returned status code 1: Cloning into 'webtools.common'...
Submodule path 'webtools.common': checked out 'b185b741e71451a93638c57e47615da3693b5696'
Cloning into 'webtools.dali'...
Submodule path 'webtools.dali': checked out '51fe2e9e217c5dbc19a51d8d0f2168e87e731462'
Cloning into 'webtools.javaee'...
Submodule path 'webtools.javaee': checked out '4e7cbc9358c4a9900b41a5f96d191c6478cb3c4d'
Cloning into 'webtools.jsdt'...
Submodule path 'webtools.jsdt': checked out 'd905e75a64925461bbbd2a41d2e8e53ff2f88916'
Cloning into 'webtools.jsf'...
Submodule path 'webtools.jsf': checked out '490184c2fccf601aed83446ef34ba5f1776e8874'
Cloning into 'webtools.releng'...
Submodule path 'webtools.releng': checked out '4982c8a2654013d7d27abec659e8d77c033c0a89'
Cloning into 'webtools.servertools'...
fatal: reference is not a tree: 7eedadd0a08b15e8c8519863d6080d59580cf8de
Cloning into 'webtools.sourceediting'...
fatal: reference is not a tree: 88653a4dd7423556cecdf4f705791d7dd63cce32
Cloning into 'webtools.webservices'...
Submodule path 'webtools.webservices': checked out 'bbef9be7c532e4aa99c6a88e1acfabe809f2b5ed'
Unable to checkout '7eedadd0a08b15e8c8519863d6080d59580cf8de' in submodule path 'webtools.servertools'
Unable to checkout '88653a4dd7423556cecdf4f705791d7dd63cce32' in submodule path 'webtools.sourceediting'

        at hudson.plugins.git.GitAPI.launchCommandIn(GitAPI.java:831)
        at hudson.plugins.git.GitAPI.launchCommand(GitAPI.java:793)
        at hudson.plugins.git.GitAPI.submoduleUpdate(GitAPI.java:450)
        at hudson.plugins.git.GitSCM$1.invoke(GitSCM.java:896)
        at hudson.plugins.git.GitSCM$1.invoke(GitSCM.java:856)
        at hudson.FilePath.act(FilePath.java:793)
        at hudson.FilePath.act(FilePath.java:775)
        at hudson.plugins.git.GitSCM.getBuildConfig(GitSCM.java:856)
        at hudson.plugins.git.GitSCM.checkout(GitSCM.java:817)
        at hudson.model.AbstractProject.checkout(AbstractProject.java:1550)
        at hudson.model.AbstractBuild$AbstractRunner.checkout(AbstractBuild.java:607)
        at hudson.model.AbstractBuild$AbstractRunner.run(AbstractBuild.java:518)
        at hudson.model.Run.run(Run.java:1493)
        at hudson.model.FreeStyleBuild.run(FreeStyleBuild.java:44)
        at hudson.model.ResourceController.execute(ResourceController.java:82)
        at hudson.model.Executor.run(Executor.java:137)
Caused by: hudson.plugins.git.GitException: Command "git submodule update" returned status code 1: Cloning into 'webtools.common'...
Submodule path 'webtools.common': checked out 'b185b741e71451a93638c57e47615da3693b5696'
Cloning into 'webtools.dali'...
Submodule path 'webtools.dali': checked out '51fe2e9e217c5dbc19a51d8d0f2168e87e731462'
Cloning into 'webtools.javaee'...
Submodule path 'webtools.javaee': checked out '4e7cbc9358c4a9900b41a5f96d191c6478cb3c4d'
Cloning into 'webtools.jsdt'...
Submodule path 'webtools.jsdt': checked out 'd905e75a64925461bbbd2a41d2e8e53ff2f88916'
Cloning into 'webtools.jsf'...
Submodule path 'webtools.jsf': checked out '490184c2fccf601aed83446ef34ba5f1776e8874'
Cloning into 'webtools.releng'...
Submodule path 'webtools.releng': checked out '4982c8a2654013d7d27abec659e8d77c033c0a89'
Cloning into 'webtools.servertools'...
fatal: reference is not a tree: 7eedadd0a08b15e8c8519863d6080d59580cf8de
Cloning into 'webtools.sourceediting'...
fatal: reference is not a tree: 88653a4dd7423556cecdf4f705791d7dd63cce32
Cloning into 'webtools.webservices'...
Submodule path 'webtools.webservices': checked out 'bbef9be7c532e4aa99c6a88e1acfabe809f2b5ed'
Unable to checkout '7eedadd0a08b15e8c8519863d6080d59580cf8de' in submodule path 'webtools.servertools'
Unable to checkout '88653a4dd7423556cecdf4f705791d7dd63cce32' in submodule path 'webtools.sourceediting'

        at hudson.plugins.git.GitAPI.launchCommandIn(GitAPI.java:824)
        ... 15 more

--
This message is automatically generated by Hudson.
For more information on Hudson, see: http://hudson-ci.org/
_______________________________________________
wtp-releng mailing list
[hidden email]
To change your delivery options, retrieve your password, or unsubscribe from this list, visit
https://dev.eclipse.org/mailman/listinfo/wtp-releng
Reply | Threaded
Open this post in threaded view
|

[Hudson] Build failed in Hudson: WTP-R3_10_Integration #249

hudsonbuild
See <https://hudson.eclipse.org/webtools/job/WTP-R3_10_Integration/249/changes>

Changes:

[nickboldt] repos merged so no longer need webtools.webservices.axis2 and jaxws repos

[nickboldt] revert to previous SHAs for webtools.servertools webtools.sourceediting

------------------------------------------
[...truncated 495 lines...]
Downloading from tycho: https://oss.sonatype.org/content/repositories/public/org/eclipse/tycho/tycho-p2-facade/1.0.0/tycho-p2-facade-1.0.0.pom
Downloaded from tycho: https://oss.sonatype.org/content/repositories/public/org/eclipse/tycho/tycho-p2-facade/1.0.0/tycho-p2-facade-1.0.0.pom (2.1 kB at 9.3 kB/s)
Downloading from tycho: https://oss.sonatype.org/content/repositories/public/org/eclipse/tycho/tycho-p2/1.0.0/tycho-p2-1.0.0.pom
Downloaded from tycho: https://oss.sonatype.org/content/repositories/public/org/eclipse/tycho/tycho-p2/1.0.0/tycho-p2-1.0.0.pom (1.1 kB at 5.7 kB/s)
Downloading from tycho: https://oss.sonatype.org/content/repositories/public/org/eclipse/tycho/org.eclipse.tycho.p2.resolver.shared/1.0.0/org.eclipse.tycho.p2.resolver.shared-1.0.0.pom
Downloaded from tycho: https://oss.sonatype.org/content/repositories/public/org/eclipse/tycho/org.eclipse.tycho.p2.resolver.shared/1.0.0/org.eclipse.tycho.p2.resolver.shared-1.0.0.pom (1.1 kB at 9.1 kB/s)
Downloading from tycho: https://oss.sonatype.org/content/repositories/public/org/eclipse/tycho/org.eclipse.tycho.p2.tools.shared/1.0.0/org.eclipse.tycho.p2.tools.shared-1.0.0.pom
Downloaded from tycho: https://oss.sonatype.org/content/repositories/public/org/eclipse/tycho/org.eclipse.tycho.p2.tools.shared/1.0.0/org.eclipse.tycho.p2.tools.shared-1.0.0.pom (1.1 kB at 5.6 kB/s)
Downloading from tycho: https://oss.sonatype.org/content/repositories/public/org/eclipse/tycho/tycho-maven-plugin/1.0.0/tycho-maven-plugin-1.0.0.jar
Downloading from tycho: https://oss.sonatype.org/content/repositories/public/org/eclipse/tycho/tycho-core/1.0.0/tycho-core-1.0.0.jar
Downloading from tycho: https://oss.sonatype.org/content/repositories/public/org/apache/maven/maven-core/3.0/maven-core-3.0.jar
Downloading from tycho: https://oss.sonatype.org/content/repositories/public/org/apache/maven/maven-model/3.0/maven-model-3.0.jar
Downloading from tycho: https://oss.sonatype.org/content/repositories/public/org/apache/maven/maven-settings/3.0/maven-settings-3.0.jar
Downloading from tycho: https://oss.sonatype.org/content/repositories/public/org/apache/maven/maven-settings-builder/3.0/maven-settings-builder-3.0.jar
Downloading from tycho: https://oss.sonatype.org/content/repositories/public/org/apache/maven/maven-repository-metadata/3.0/maven-repository-metadata-3.0.jar
Downloading from tycho: https://oss.sonatype.org/content/repositories/public/org/apache/maven/maven-artifact/3.0/maven-artifact-3.0.jar
Downloading from tycho: https://oss.sonatype.org/content/repositories/public/org/apache/maven/maven-model-builder/3.0/maven-model-builder-3.0.jar
Downloading from tycho: https://oss.sonatype.org/content/repositories/public/org/apache/maven/maven-aether-provider/3.0/maven-aether-provider-3.0.jar
Downloading from tycho: https://oss.sonatype.org/content/repositories/public/org/sonatype/aether/aether-impl/1.7/aether-impl-1.7.jar
Downloaded from tycho: https://oss.sonatype.org/content/repositories/public/org/eclipse/tycho/tycho-maven-plugin/1.0.0/tycho-maven-plugin-1.0.0.jar (5.5 kB at 15 kB/s)
Downloading from tycho: https://oss.sonatype.org/content/repositories/public/org/sonatype/aether/aether-spi/1.7/aether-spi-1.7.jar
Downloading from tycho: https://oss.sonatype.org/content/repositories/public/org/sonatype/aether/aether-api/1.7/aether-api-1.7.jar
Downloaded from tycho: https://oss.sonatype.org/content/repositories/public/org/eclipse/tycho/tycho-core/1.0.0/tycho-core-1.0.0.jar (196 kB at 530 kB/s)
Downloading from tycho: https://oss.sonatype.org/content/repositories/public/org/sonatype/aether/aether-util/1.7/aether-util-1.7.jar
Downloading from tycho: https://oss.sonatype.org/content/repositories/public/org/sonatype/sisu/sisu-inject-plexus/1.4.2/sisu-inject-plexus-1.4.2.jar
Downloading from tycho: https://oss.sonatype.org/content/repositories/public/org/sonatype/sisu/sisu-inject-bean/1.4.2/sisu-inject-bean-1.4.2.jar
Downloading from tycho: https://oss.sonatype.org/content/repositories/public/org/sonatype/sisu/sisu-guice/2.1.7/sisu-guice-2.1.7-noaop.jar
Downloading from tycho: https://oss.sonatype.org/content/repositories/public/org/codehaus/plexus/plexus-interpolation/1.14/plexus-interpolation-1.14.jar
Downloading from tycho: https://oss.sonatype.org/content/repositories/public/org/codehaus/plexus/plexus-classworlds/2.2.3/plexus-classworlds-2.2.3.jar
Downloading from tycho: https://oss.sonatype.org/content/repositories/public/org/sonatype/plexus/plexus-sec-dispatcher/1.3/plexus-sec-dispatcher-1.3.jar
Downloading from tycho: https://oss.sonatype.org/content/repositories/public/org/sonatype/plexus/plexus-cipher/1.7/plexus-cipher-1.7.jar
Downloading from tycho: https://oss.sonatype.org/content/repositories/public/org/apache/maven/maven-plugin-api/3.0/maven-plugin-api-3.0.jar
Downloading from tycho: https://oss.sonatype.org/content/repositories/public/org/codehaus/plexus/plexus-utils/3.0.7/plexus-utils-3.0.7.jar
Downloading from tycho: https://oss.sonatype.org/content/repositories/public/org/codehaus/plexus/plexus-archiver/2.9.1/plexus-archiver-2.9.1.jar
Downloading from tycho: https://oss.sonatype.org/content/repositories/public/org/codehaus/plexus/plexus-io/2.4.1/plexus-io-2.4.1.jar
Downloading from tycho: https://oss.sonatype.org/content/repositories/public/commons-io/commons-io/2.2/commons-io-2.2.jar
Downloading from tycho: https://oss.sonatype.org/content/repositories/public/org/apache/commons/commons-compress/1.9/commons-compress-1.9.jar
Downloading from tycho: https://oss.sonatype.org/content/repositories/public/org/eclipse/tycho/org.eclipse.osgi.compatibility.state/1.0.200.v20160504-1419/org.eclipse.osgi.compatibility.state-1.0.200.v20160504-1419.jar
Downloading from tycho: https://oss.sonatype.org/content/repositories/public/org/eclipse/tycho/sisu-equinox-embedder/1.0.0/sisu-equinox-embedder-1.0.0.jar
Downloading from tycho: https://oss.sonatype.org/content/repositories/public/org/eclipse/tycho/org.eclipse.osgi/3.11.2.v20161107-1947/org.eclipse.osgi-3.11.2.v20161107-1947.jar
Downloading from tycho: https://oss.sonatype.org/content/repositories/public/org/eclipse/tycho/sisu-equinox-api/1.0.0/sisu-equinox-api-1.0.0.jar
Downloading from tycho: https://oss.sonatype.org/content/repositories/public/org/eclipse/tycho/tycho-metadata-model/1.0.0/tycho-metadata-model-1.0.0.jar
Downloaded from tycho: https://oss.sonatype.org/content/repositories/public/org/eclipse/tycho/sisu-equinox-embedder/1.0.0/sisu-equinox-embedder-1.0.0.jar (13 kB at 12 kB/s)
Downloading from tycho: https://oss.sonatype.org/content/repositories/public/de/pdark/decentxml/1.3/decentxml-1.3.jar
Downloaded from tycho: https://oss.sonatype.org/content/repositories/public/org/eclipse/tycho/sisu-equinox-api/1.0.0/sisu-equinox-api-1.0.0.jar (3.1 kB at 2.6 kB/s)
Downloading from tycho: https://oss.sonatype.org/content/repositories/public/org/eclipse/tycho/tycho-embedder-api/1.0.0/tycho-embedder-api-1.0.0.jar
Downloaded from tycho: https://oss.sonatype.org/content/repositories/public/org/eclipse/tycho/tycho-metadata-model/1.0.0/tycho-metadata-model-1.0.0.jar (36 kB at 29 kB/s)
Downloading from tycho: https://oss.sonatype.org/content/repositories/public/org/eclipse/tycho/org.eclipse.tycho.embedder.shared/1.0.0/org.eclipse.tycho.embedder.shared-1.0.0.jar
Downloaded from tycho: https://oss.sonatype.org/content/repositories/public/org/eclipse/tycho/tycho-embedder-api/1.0.0/tycho-embedder-api-1.0.0.jar (7.0 kB at 5.3 kB/s)
Downloading from tycho: https://oss.sonatype.org/content/repositories/public/org/eclipse/tycho/org.eclipse.tycho.core.shared/1.0.0/org.eclipse.tycho.core.shared-1.0.0.jar
Downloaded from tycho: https://oss.sonatype.org/content/repositories/public/org/eclipse/tycho/org.eclipse.osgi.compatibility.state/1.0.200.v20160504-1419/org.eclipse.osgi.compatibility.state-1.0.200.v20160504-1419.jar (244 kB at 184 kB/s)
Downloading from tycho: https://oss.sonatype.org/content/repositories/public/org/apache/maven/maven-compat/3.0/maven-compat-3.0.jar
Downloaded from tycho: https://oss.sonatype.org/content/repositories/public/de/pdark/decentxml/1.3/decentxml-1.3.jar (112 kB at 83 kB/s)
Downloading from tycho: https://oss.sonatype.org/content/repositories/public/org/apache/maven/wagon/wagon-provider-api/1.0-beta-6/wagon-provider-api-1.0-beta-6.jar
Downloading from tycho: https://oss.sonatype.org/content/repositories/public/org/eclipse/tycho/tycho-p2-facade/1.0.0/tycho-p2-facade-1.0.0.jar
Downloaded from tycho: https://oss.sonatype.org/content/repositories/public/org/eclipse/tycho/org.eclipse.tycho.embedder.shared/1.0.0/org.eclipse.tycho.embedder.shared-1.0.0.jar (9.6 kB at 6.9 kB/s)
Downloading from tycho: https://oss.sonatype.org/content/repositories/public/org/codehaus/plexus/plexus-component-annotations/1.5.5/plexus-component-annotations-1.5.5.jar
Downloading from tycho: https://oss.sonatype.org/content/repositories/public/org/eclipse/tycho/org.eclipse.tycho.p2.resolver.shared/1.0.0/org.eclipse.tycho.p2.resolver.shared-1.0.0.jar
Downloaded from tycho: https://oss.sonatype.org/content/repositories/public/org/eclipse/tycho/org.eclipse.osgi/3.11.2.v20161107-1947/org.eclipse.osgi-3.11.2.v20161107-1947.jar (1.4 MB at 941 kB/s)
Downloading from tycho: https://oss.sonatype.org/content/repositories/public/org/eclipse/tycho/org.eclipse.tycho.p2.tools.shared/1.0.0/org.eclipse.tycho.p2.tools.shared-1.0.0.jar
Downloaded from tycho: https://oss.sonatype.org/content/repositories/public/org/eclipse/tycho/org.eclipse.tycho.core.shared/1.0.0/org.eclipse.tycho.core.shared-1.0.0.jar (38 kB at 26 kB/s)
Downloaded from tycho: https://oss.sonatype.org/content/repositories/public/org/eclipse/tycho/tycho-p2-facade/1.0.0/tycho-p2-facade-1.0.0.jar (34 kB at 23 kB/s)
Downloaded from tycho: https://oss.sonatype.org/content/repositories/public/org/eclipse/tycho/org.eclipse.tycho.p2.tools.shared/1.0.0/org.eclipse.tycho.p2.tools.shared-1.0.0.jar (21 kB at 13 kB/s)
Downloaded from tycho: https://oss.sonatype.org/content/repositories/public/org/eclipse/tycho/org.eclipse.tycho.p2.resolver.shared/1.0.0/org.eclipse.tycho.p2.resolver.shared-1.0.0.jar (27 kB at 16 kB/s)
Downloading from cbi-repo: https://repo.eclipse.org/content/repositories/cbi/org/apache/maven/maven-core/3.0/maven-core-3.0.jar
Downloading from cbi-repo: https://repo.eclipse.org/content/repositories/cbi/org/apache/maven/maven-model/3.0/maven-model-3.0.jar
Downloading from cbi-repo: https://repo.eclipse.org/content/repositories/cbi/org/apache/maven/maven-settings-builder/3.0/maven-settings-builder-3.0.jar
Downloading from cbi-repo: https://repo.eclipse.org/content/repositories/cbi/org/apache/maven/maven-settings/3.0/maven-settings-3.0.jar
Downloading from cbi-repo: https://repo.eclipse.org/content/repositories/cbi/org/apache/maven/maven-repository-metadata/3.0/maven-repository-metadata-3.0.jar
Downloading from cbi-repo: https://repo.eclipse.org/content/repositories/cbi/org/apache/maven/maven-artifact/3.0/maven-artifact-3.0.jar
Downloading from cbi-repo: https://repo.eclipse.org/content/repositories/cbi/org/apache/maven/maven-model-builder/3.0/maven-model-builder-3.0.jar
Downloading from cbi-repo: https://repo.eclipse.org/content/repositories/cbi/org/apache/maven/maven-aether-provider/3.0/maven-aether-provider-3.0.jar
Downloading from cbi-repo: https://repo.eclipse.org/content/repositories/cbi/org/sonatype/aether/aether-impl/1.7/aether-impl-1.7.jar
Downloading from cbi-repo: https://repo.eclipse.org/content/repositories/cbi/org/sonatype/aether/aether-spi/1.7/aether-spi-1.7.jar
Downloading from cbi-repo: https://repo.eclipse.org/content/repositories/cbi/org/sonatype/aether/aether-api/1.7/aether-api-1.7.jar
Downloading from cbi-repo: https://repo.eclipse.org/content/repositories/cbi/org/sonatype/sisu/sisu-inject-plexus/1.4.2/sisu-inject-plexus-1.4.2.jar
Downloading from cbi-repo: https://repo.eclipse.org/content/repositories/cbi/org/sonatype/aether/aether-util/1.7/aether-util-1.7.jar
Downloading from cbi-repo: https://repo.eclipse.org/content/repositories/cbi/org/sonatype/sisu/sisu-inject-bean/1.4.2/sisu-inject-bean-1.4.2.jar
Downloading from cbi-repo: https://repo.eclipse.org/content/repositories/cbi/org/sonatype/sisu/sisu-guice/2.1.7/sisu-guice-2.1.7-noaop.jar
Downloading from cbi-repo: https://repo.eclipse.org/content/repositories/cbi/org/codehaus/plexus/plexus-interpolation/1.14/plexus-interpolation-1.14.jar
Downloading from cbi-repo: https://repo.eclipse.org/content/repositories/cbi/org/sonatype/plexus/plexus-sec-dispatcher/1.3/plexus-sec-dispatcher-1.3.jar
Downloading from cbi-repo: https://repo.eclipse.org/content/repositories/cbi/org/codehaus/plexus/plexus-classworlds/2.2.3/plexus-classworlds-2.2.3.jar
Downloading from cbi-repo: https://repo.eclipse.org/content/repositories/cbi/org/sonatype/plexus/plexus-cipher/1.7/plexus-cipher-1.7.jar
Downloading from cbi-repo: https://repo.eclipse.org/content/repositories/cbi/org/apache/maven/maven-plugin-api/3.0/maven-plugin-api-3.0.jar
Downloading from cbi-repo: https://repo.eclipse.org/content/repositories/cbi/org/codehaus/plexus/plexus-utils/3.0.7/plexus-utils-3.0.7.jar
Downloading from cbi-repo: https://repo.eclipse.org/content/repositories/cbi/org/codehaus/plexus/plexus-archiver/2.9.1/plexus-archiver-2.9.1.jar
Downloading from cbi-repo: https://repo.eclipse.org/content/repositories/cbi/org/codehaus/plexus/plexus-io/2.4.1/plexus-io-2.4.1.jar
Downloading from cbi-repo: https://repo.eclipse.org/content/repositories/cbi/commons-io/commons-io/2.2/commons-io-2.2.jar
Downloading from cbi-repo: https://repo.eclipse.org/content/repositories/cbi/org/apache/commons/commons-compress/1.9/commons-compress-1.9.jar
Downloading from cbi-repo: https://repo.eclipse.org/content/repositories/cbi/org/apache/maven/maven-compat/3.0/maven-compat-3.0.jar
Downloading from cbi-repo: https://repo.eclipse.org/content/repositories/cbi/org/apache/maven/wagon/wagon-provider-api/1.0-beta-6/wagon-provider-api-1.0-beta-6.jar
Downloading from cbi-repo: https://repo.eclipse.org/content/repositories/cbi/org/codehaus/plexus/plexus-component-annotations/1.5.5/plexus-component-annotations-1.5.5.jar
Downloading from tycho-snapshot: https://repo.eclipse.org/content/repositories/tycho-snapshots/org/apache/maven/maven-core/3.0/maven-core-3.0.jar
Downloading from tycho-snapshot: https://repo.eclipse.org/content/repositories/tycho-snapshots/org/apache/maven/maven-model/3.0/maven-model-3.0.jar
Downloading from tycho-snapshot: https://repo.eclipse.org/content/repositories/tycho-snapshots/org/apache/maven/maven-settings/3.0/maven-settings-3.0.jar
Downloading from tycho-snapshot: https://repo.eclipse.org/content/repositories/tycho-snapshots/org/apache/maven/maven-settings-builder/3.0/maven-settings-builder-3.0.jar
Downloading from tycho-snapshot: https://repo.eclipse.org/content/repositories/tycho-snapshots/org/apache/maven/maven-repository-metadata/3.0/maven-repository-metadata-3.0.jar
Downloading from tycho-snapshot: https://repo.eclipse.org/content/repositories/tycho-snapshots/org/apache/maven/maven-artifact/3.0/maven-artifact-3.0.jar
Downloading from tycho-snapshot: https://repo.eclipse.org/content/repositories/tycho-snapshots/org/apache/maven/maven-model-builder/3.0/maven-model-builder-3.0.jar
Downloading from tycho-snapshot: https://repo.eclipse.org/content/repositories/tycho-snapshots/org/apache/maven/maven-aether-provider/3.0/maven-aether-provider-3.0.jar
Downloading from tycho-snapshot: https://repo.eclipse.org/content/repositories/tycho-snapshots/org/sonatype/aether/aether-impl/1.7/aether-impl-1.7.jar
Downloading from tycho-snapshot: https://repo.eclipse.org/content/repositories/tycho-snapshots/org/sonatype/aether/aether-spi/1.7/aether-spi-1.7.jar
Downloading from tycho-snapshot: https://repo.eclipse.org/content/repositories/tycho-snapshots/org/sonatype/aether/aether-api/1.7/aether-api-1.7.jar
Downloading from tycho-snapshot: https://repo.eclipse.org/content/repositories/tycho-snapshots/org/sonatype/aether/aether-util/1.7/aether-util-1.7.jar
Downloading from tycho-snapshot: https://repo.eclipse.org/content/repositories/tycho-snapshots/org/sonatype/sisu/sisu-inject-plexus/1.4.2/sisu-inject-plexus-1.4.2.jar
Downloading from tycho-snapshot: https://repo.eclipse.org/content/repositories/tycho-snapshots/org/sonatype/sisu/sisu-inject-bean/1.4.2/sisu-inject-bean-1.4.2.jar
Downloading from tycho-snapshot: https://repo.eclipse.org/content/repositories/tycho-snapshots/org/sonatype/sisu/sisu-guice/2.1.7/sisu-guice-2.1.7-noaop.jar
Downloading from tycho-snapshot: https://repo.eclipse.org/content/repositories/tycho-snapshots/org/codehaus/plexus/plexus-interpolation/1.14/plexus-interpolation-1.14.jar
Downloading from tycho-snapshot: https://repo.eclipse.org/content/repositories/tycho-snapshots/org/codehaus/plexus/plexus-classworlds/2.2.3/plexus-classworlds-2.2.3.jar
Downloading from tycho-snapshot: https://repo.eclipse.org/content/repositories/tycho-snapshots/org/sonatype/plexus/plexus-sec-dispatcher/1.3/plexus-sec-dispatcher-1.3.jar
Downloading from tycho-snapshot: https://repo.eclipse.org/content/repositories/tycho-snapshots/org/sonatype/plexus/plexus-cipher/1.7/plexus-cipher-1.7.jar
Downloading from tycho-snapshot: https://repo.eclipse.org/content/repositories/tycho-snapshots/org/apache/maven/maven-plugin-api/3.0/maven-plugin-api-3.0.jar
Downloading from tycho-snapshot: https://repo.eclipse.org/content/repositories/tycho-snapshots/org/codehaus/plexus/plexus-utils/3.0.7/plexus-utils-3.0.7.jar
Downloading from tycho-snapshot: https://repo.eclipse.org/content/repositories/tycho-snapshots/org/codehaus/plexus/plexus-archiver/2.9.1/plexus-archiver-2.9.1.jar
Downloading from tycho-snapshot: https://repo.eclipse.org/content/repositories/tycho-snapshots/org/codehaus/plexus/plexus-io/2.4.1/plexus-io-2.4.1.jar
Downloading from tycho-snapshot: https://repo.eclipse.org/content/repositories/tycho-snapshots/commons-io/commons-io/2.2/commons-io-2.2.jar
Downloading from tycho-snapshot: https://repo.eclipse.org/content/repositories/tycho-snapshots/org/apache/commons/commons-compress/1.9/commons-compress-1.9.jar
Downloading from tycho-snapshot: https://repo.eclipse.org/content/repositories/tycho-snapshots/org/apache/maven/maven-compat/3.0/maven-compat-3.0.jar
Downloading from tycho-snapshot: https://repo.eclipse.org/content/repositories/tycho-snapshots/org/apache/maven/wagon/wagon-provider-api/1.0-beta-6/wagon-provider-api-1.0-beta-6.jar
Downloading from tycho-snapshot: https://repo.eclipse.org/content/repositories/tycho-snapshots/org/codehaus/plexus/plexus-component-annotations/1.5.5/plexus-component-annotations-1.5.5.jar
Downloading from sonatype-public-grid: https://repository.sonatype.org/content/groups/sonatype-public-grid/org/apache/maven/maven-core/3.0/maven-core-3.0.jar
Downloading from sonatype-public-grid: https://repository.sonatype.org/content/groups/sonatype-public-grid/org/apache/maven/maven-settings/3.0/maven-settings-3.0.jar
Downloading from sonatype-public-grid: https://repository.sonatype.org/content/groups/sonatype-public-grid/org/apache/maven/maven-model/3.0/maven-model-3.0.jar
Downloading from sonatype-public-grid: https://repository.sonatype.org/content/groups/sonatype-public-grid/org/apache/maven/maven-settings-builder/3.0/maven-settings-builder-3.0.jar
Downloading from sonatype-public-grid: https://repository.sonatype.org/content/groups/sonatype-public-grid/org/apache/maven/maven-repository-metadata/3.0/maven-repository-metadata-3.0.jar
Downloaded from sonatype-public-grid: https://repository.sonatype.org/content/groups/sonatype-public-grid/org/apache/maven/maven-repository-metadata/3.0/maven-repository-metadata-3.0.jar (30 kB at 111 kB/s)
Downloading from sonatype-public-grid: https://repository.sonatype.org/content/groups/sonatype-public-grid/org/apache/maven/maven-artifact/3.0/maven-artifact-3.0.jar
Downloaded from sonatype-public-grid: https://repository.sonatype.org/content/groups/sonatype-public-grid/org/apache/maven/maven-settings-builder/3.0/maven-settings-builder-3.0.jar (38 kB at 131 kB/s)
Downloading from sonatype-public-grid: https://repository.sonatype.org/content/groups/sonatype-public-grid/org/apache/maven/maven-model-builder/3.0/maven-model-builder-3.0.jar
Downloaded from sonatype-public-grid: https://repository.sonatype.org/content/groups/sonatype-public-grid/org/apache/maven/maven-settings/3.0/maven-settings-3.0.jar (47 kB at 140 kB/s)
Downloading from sonatype-public-grid: https://repository.sonatype.org/content/groups/sonatype-public-grid/org/apache/maven/maven-aether-provider/3.0/maven-aether-provider-3.0.jar
Downloaded from sonatype-public-grid: https://repository.sonatype.org/content/groups/sonatype-public-grid/org/apache/maven/maven-model/3.0/maven-model-3.0.jar (165 kB at 406 kB/s)
Downloading from sonatype-public-grid: https://repository.sonatype.org/content/groups/sonatype-public-grid/org/sonatype/aether/aether-impl/1.7/aether-impl-1.7.jar
Downloaded from sonatype-public-grid: https://repository.sonatype.org/content/groups/sonatype-public-grid/org/apache/maven/maven-aether-provider/3.0/maven-aether-provider-3.0.jar (51 kB at 113 kB/s)
Downloading from sonatype-public-grid: https://repository.sonatype.org/content/groups/sonatype-public-grid/org/sonatype/aether/aether-spi/1.7/aether-spi-1.7.jar
Downloaded from sonatype-public-grid: https://repository.sonatype.org/content/groups/sonatype-public-grid/org/apache/maven/maven-model-builder/3.0/maven-model-builder-3.0.jar (148 kB at 291 kB/s)
Downloading from sonatype-public-grid: https://repository.sonatype.org/content/groups/sonatype-public-grid/org/sonatype/aether/aether-api/1.7/aether-api-1.7.jar
Downloaded from sonatype-public-grid: https://repository.sonatype.org/content/groups/sonatype-public-grid/org/apache/maven/maven-artifact/3.0/maven-artifact-3.0.jar (52 kB at 99 kB/s)
Downloading from sonatype-public-grid: https://repository.sonatype.org/content/groups/sonatype-public-grid/org/sonatype/aether/aether-util/1.7/aether-util-1.7.jar
Downloaded from sonatype-public-grid: https://repository.sonatype.org/content/groups/sonatype-public-grid/org/sonatype/aether/aether-spi/1.7/aether-spi-1.7.jar (14 kB at 25 kB/s)
Downloading from sonatype-public-grid: https://repository.sonatype.org/content/groups/sonatype-public-grid/org/sonatype/sisu/sisu-inject-plexus/1.4.2/sisu-inject-plexus-1.4.2.jar
Downloaded from sonatype-public-grid: https://repository.sonatype.org/content/groups/sonatype-public-grid/org/sonatype/aether/aether-impl/1.7/aether-impl-1.7.jar (106 kB at 187 kB/s)
Downloading from sonatype-public-grid: https://repository.sonatype.org/content/groups/sonatype-public-grid/org/sonatype/sisu/sisu-inject-bean/1.4.2/sisu-inject-bean-1.4.2.jar
Downloaded from sonatype-public-grid: https://repository.sonatype.org/content/groups/sonatype-public-grid/org/apache/maven/maven-core/3.0/maven-core-3.0.jar (527 kB at 917 kB/s)
Downloading from sonatype-public-grid: https://repository.sonatype.org/content/groups/sonatype-public-grid/org/sonatype/sisu/sisu-guice/2.1.7/sisu-guice-2.1.7-noaop.jar
Downloaded from sonatype-public-grid: https://repository.sonatype.org/content/groups/sonatype-public-grid/org/sonatype/aether/aether-api/1.7/aether-api-1.7.jar (74 kB at 119 kB/s)
Downloading from sonatype-public-grid: https://repository.sonatype.org/content/groups/sonatype-public-grid/org/codehaus/plexus/plexus-interpolation/1.14/plexus-interpolation-1.14.jar
Downloaded from sonatype-public-grid: https://repository.sonatype.org/content/groups/sonatype-public-grid/org/codehaus/plexus/plexus-interpolation/1.14/plexus-interpolation-1.14.jar (61 kB at 84 kB/s)
Downloading from sonatype-public-grid: https://repository.sonatype.org/content/groups/sonatype-public-grid/org/codehaus/plexus/plexus-classworlds/2.2.3/plexus-classworlds-2.2.3.jar
Downloaded from sonatype-public-grid: https://repository.sonatype.org/content/groups/sonatype-public-grid/org/sonatype/aether/aether-util/1.7/aether-util-1.7.jar (108 kB at 148 kB/s)
Downloading from sonatype-public-grid: https://repository.sonatype.org/content/groups/sonatype-public-grid/org/sonatype/plexus/plexus-sec-dispatcher/1.3/plexus-sec-dispatcher-1.3.jar
Downloaded from sonatype-public-grid: https://repository.sonatype.org/content/groups/sonatype-public-grid/org/sonatype/sisu/sisu-inject-bean/1.4.2/sisu-inject-bean-1.4.2.jar (153 kB at 204 kB/s)
Downloading from sonatype-public-grid: https://repository.sonatype.org/content/groups/sonatype-public-grid/org/sonatype/plexus/plexus-cipher/1.7/plexus-cipher-1.7.jar
Downloaded from sonatype-public-grid: https://repository.sonatype.org/content/groups/sonatype-public-grid/org/sonatype/sisu/sisu-inject-plexus/1.4.2/sisu-inject-plexus-1.4.2.jar (202 kB at 268 kB/s)
Downloading from sonatype-public-grid: https://repository.sonatype.org/content/groups/sonatype-public-grid/org/apache/maven/maven-plugin-api/3.0/maven-plugin-api-3.0.jar
Downloaded from sonatype-public-grid: https://repository.sonatype.org/content/groups/sonatype-public-grid/org/sonatype/sisu/sisu-guice/2.1.7/sisu-guice-2.1.7-noaop.jar (472 kB at 623 kB/s)
Downloading from sonatype-public-grid: https://repository.sonatype.org/content/groups/sonatype-public-grid/org/codehaus/plexus/plexus-utils/3.0.7/plexus-utils-3.0.7.jar
Downloaded from sonatype-public-grid: https://repository.sonatype.org/content/groups/sonatype-public-grid/org/sonatype/plexus/plexus-sec-dispatcher/1.3/plexus-sec-dispatcher-1.3.jar (29 kB at 35 kB/s)
Downloading from sonatype-public-grid: https://repository.sonatype.org/content/groups/sonatype-public-grid/org/codehaus/plexus/plexus-archiver/2.9.1/plexus-archiver-2.9.1.jar
Downloaded from sonatype-public-grid: https://repository.sonatype.org/content/groups/sonatype-public-grid/org/sonatype/plexus/plexus-cipher/1.7/plexus-cipher-1.7.jar (13 kB at 16 kB/s)
Downloading from sonatype-public-grid: https://repository.sonatype.org/content/groups/sonatype-public-grid/org/codehaus/plexus/plexus-io/2.4.1/plexus-io-2.4.1.jar
Downloaded from sonatype-public-grid: https://repository.sonatype.org/content/groups/sonatype-public-grid/org/apache/maven/maven-plugin-api/3.0/maven-plugin-api-3.0.jar (49 kB at 58 kB/s)
Downloading from sonatype-public-grid: https://repository.sonatype.org/content/groups/sonatype-public-grid/commons-io/commons-io/2.2/commons-io-2.2.jar
Downloaded from sonatype-public-grid: https://repository.sonatype.org/content/groups/sonatype-public-grid/org/codehaus/plexus/plexus-classworlds/2.2.3/plexus-classworlds-2.2.3.jar (46 kB at 54 kB/s)
Downloading from sonatype-public-grid: https://repository.sonatype.org/content/groups/sonatype-public-grid/org/apache/commons/commons-compress/1.9/commons-compress-1.9.jar
Downloaded from sonatype-public-grid: https://repository.sonatype.org/content/groups/sonatype-public-grid/org/codehaus/plexus/plexus-utils/3.0.7/plexus-utils-3.0.7.jar (230 kB at 266 kB/s)
Downloading from sonatype-public-grid: https://repository.sonatype.org/content/groups/sonatype-public-grid/org/apache/maven/maven-compat/3.0/maven-compat-3.0.jar
Downloaded from sonatype-public-grid: https://repository.sonatype.org/content/groups/sonatype-public-grid/commons-io/commons-io/2.2/commons-io-2.2.jar (174 kB at 174 kB/s)
Downloading from sonatype-public-grid: https://repository.sonatype.org/content/groups/sonatype-public-grid/org/apache/maven/wagon/wagon-provider-api/1.0-beta-6/wagon-provider-api-1.0-beta-6.jar
Downloaded from sonatype-public-grid: https://repository.sonatype.org/content/groups/sonatype-public-grid/org/codehaus/plexus/plexus-io/2.4.1/plexus-io-2.4.1.jar (82 kB at 81 kB/s)
Downloading from sonatype-public-grid: https://repository.sonatype.org/content/groups/sonatype-public-grid/org/codehaus/plexus/plexus-component-annotations/1.5.5/plexus-component-annotations-1.5.5.jar
Downloaded from sonatype-public-grid: https://repository.sonatype.org/content/groups/sonatype-public-grid/org/codehaus/plexus/plexus-archiver/2.9.1/plexus-archiver-2.9.1.jar (145 kB at 142 kB/s)
Downloaded from sonatype-public-grid: https://repository.sonatype.org/content/groups/sonatype-public-grid/org/apache/maven/maven-compat/3.0/maven-compat-3.0.jar (285 kB at 267 kB/s)
Downloaded from sonatype-public-grid: https://repository.sonatype.org/content/groups/sonatype-public-grid/org/apache/commons/commons-compress/1.9/commons-compress-1.9.jar (378 kB at 354 kB/s)
Downloaded from sonatype-public-grid: https://repository.sonatype.org/content/groups/sonatype-public-grid/org/codehaus/plexus/plexus-component-annotations/1.5.5/plexus-component-annotations-1.5.5.jar (4.2 kB at 3.9 kB/s)
Downloaded from sonatype-public-grid: https://repository.sonatype.org/content/groups/sonatype-public-grid/org/apache/maven/wagon/wagon-provider-api/1.0-beta-6/wagon-provider-api-1.0-beta-6.jar (53 kB at 49 kB/s)
[ERROR] [ERROR] Some problems were encountered while processing the POMs:
[FATAL] Non-resolvable parent POM for org.eclipse.webtools.javaee:org.eclipse.jst.enterprise_core.feature:3.9.0-SNAPSHOT: Could not find artifact org.eclipse.webtools.javaee:javaee.features:pom:3.6.0-SNAPSHOT and 'parent.relativePath' points at wrong local POM @ line 16, column 11
[FATAL] Non-resolvable parent POM for org.eclipse.webtools.javaee:org.eclipse.jst.web_tests.feature:3.6.1-SNAPSHOT: Could not find artifact org.eclipse.webtools.javaee:javaee.features:pom:3.6.0-SNAPSHOT and 'parent.relativePath' points at wrong local POM @ line 16, column 11
[FATAL] Non-resolvable parent POM for org.eclipse.webtools.javaee:org.eclipse.jst.doc.user.feature:1.6.0-SNAPSHOT: Could not find artifact org.eclipse.webtools.javaee:javaee.features:pom:3.6.0-SNAPSHOT and 'parent.relativePath' points at wrong local POM @ line 16, column 11
[FATAL] Non-resolvable parent POM for org.eclipse.webtools.javaee:org.eclipse.jst.enterprise_sdk.feature:3.8.1-SNAPSHOT: Could not find artifact org.eclipse.webtools.javaee:javaee.features:pom:3.6.0-SNAPSHOT and 'parent.relativePath' points at wrong local POM @ line 16, column 11
[FATAL] Non-resolvable parent POM for org.eclipse.webtools.javaee:org.eclipse.jst.enterprise_tests.feature:3.6.0-SNAPSHOT: Could not find artifact org.eclipse.webtools.javaee:javaee.features:pom:3.6.0-SNAPSHOT and 'parent.relativePath' points at wrong local POM @ line 16, column 11
[FATAL] Non-resolvable parent POM for org.eclipse.webtools.javaee:org.eclipse.jst.enterprise_ui.feature:3.9.2-SNAPSHOT: Could not find artifact org.eclipse.webtools.javaee:javaee.features:pom:3.6.0-SNAPSHOT and 'parent.relativePath' points at wrong local POM @ line 16, column 11
[FATAL] Non-resolvable parent POM for org.eclipse.webtools.javaee:org.eclipse.jst.enterprise_userdoc.feature:3.6.0-SNAPSHOT: Could not find artifact org.eclipse.webtools.javaee:javaee.features:pom:3.6.0-SNAPSHOT and 'parent.relativePath' points at wrong local POM @ line 16, column 11
[FATAL] Non-resolvable parent POM for org.eclipse.webtools.javaee:org.eclipse.jst.web_core.feature:3.9.1-SNAPSHOT: Could not find artifact org.eclipse.webtools.javaee:javaee.features:pom:3.6.0-SNAPSHOT and 'parent.relativePath' points at wrong local POM @ line 16, column 11
[FATAL] Non-resolvable parent POM for org.eclipse.webtools.javaee:org.eclipse.jst.web_sdk.feature:3.8.0-SNAPSHOT: Could not find artifact org.eclipse.webtools.javaee:javaee.features:pom:3.6.0-SNAPSHOT and 'parent.relativePath' points at wrong local POM @ line 16, column 11
[FATAL] Non-resolvable parent POM for org.eclipse.webtools.javaee:org.eclipse.jst.web_ui.feature:3.9.0-SNAPSHOT: Could not find artifact org.eclipse.webtools.javaee:javaee.features:pom:3.6.0-SNAPSHOT and 'parent.relativePath' points at wrong local POM @ line 16, column 11
[FATAL] Non-resolvable parent POM for org.eclipse.webtools.javaee:org.eclipse.jst.web_userdoc.feature:3.6.0-SNAPSHOT: Could not find artifact org.eclipse.webtools.javaee:javaee.features:pom:3.6.0-SNAPSHOT and 'parent.relativePath' points at wrong local POM @ line 16, column 11
 @
[INFO] o.h.m.e.h.MavenExecutionResultHandler - Build failed with exception(s)
[INFO] o.h.m.e.h.MavenExecutionResultHandler - [1] org.apache.maven.project.ProjectBuildingException: Some problems were encountered while processing the POMs:
[FATAL] Non-resolvable parent POM for org.eclipse.webtools.javaee:org.eclipse.jst.enterprise_core.feature:3.9.0-SNAPSHOT: Could not find artifact org.eclipse.webtools.javaee:javaee.features:pom:3.6.0-SNAPSHOT and 'parent.relativePath' points at wrong local POM @ line 16, column 11
[FATAL] Non-resolvable parent POM for org.eclipse.webtools.javaee:org.eclipse.jst.web_tests.feature:3.6.1-SNAPSHOT: Could not find artifact org.eclipse.webtools.javaee:javaee.features:pom:3.6.0-SNAPSHOT and 'parent.relativePath' points at wrong local POM @ line 16, column 11
[FATAL] Non-resolvable parent POM for org.eclipse.webtools.javaee:org.eclipse.jst.doc.user.feature:1.6.0-SNAPSHOT: Could not find artifact org.eclipse.webtools.javaee:javaee.features:pom:3.6.0-SNAPSHOT and 'parent.relativePath' points at wrong local POM @ line 16, column 11
[FATAL] Non-resolvable parent POM for org.eclipse.webtools.javaee:org.eclipse.jst.enterprise_sdk.feature:3.8.1-SNAPSHOT: Could not find artifact org.eclipse.webtools.javaee:javaee.features:pom:3.6.0-SNAPSHOT and 'parent.relativePath' points at wrong local POM @ line 16, column 11
[FATAL] Non-resolvable parent POM for org.eclipse.webtools.javaee:org.eclipse.jst.enterprise_tests.feature:3.6.0-SNAPSHOT: Could not find artifact org.eclipse.webtools.javaee:javaee.features:pom:3.6.0-SNAPSHOT and 'parent.relativePath' points at wrong local POM @ line 16, column 11
[FATAL] Non-resolvable parent POM for org.eclipse.webtools.javaee:org.eclipse.jst.enterprise_ui.feature:3.9.2-SNAPSHOT: Could not find artifact org.eclipse.webtools.javaee:javaee.features:pom:3.6.0-SNAPSHOT and 'parent.relativePath' points at wrong local POM @ line 16, column 11
[FATAL] Non-resolvable parent POM for org.eclipse.webtools.javaee:org.eclipse.jst.enterprise_userdoc.feature:3.6.0-SNAPSHOT: Could not find artifact org.eclipse.webtools.javaee:javaee.features:pom:3.6.0-SNAPSHOT and 'parent.relativePath' points at wrong local POM @ line 16, column 11
[FATAL] Non-resolvable parent POM for org.eclipse.webtools.javaee:org.eclipse.jst.web_core.feature:3.9.1-SNAPSHOT: Could not find artifact org.eclipse.webtools.javaee:javaee.features:pom:3.6.0-SNAPSHOT and 'parent.relativePath' points at wrong local POM @ line 16, column 11
[FATAL] Non-resolvable parent POM for org.eclipse.webtools.javaee:org.eclipse.jst.web_sdk.feature:3.8.0-SNAPSHOT: Could not find artifact org.eclipse.webtools.javaee:javaee.features:pom:3.6.0-SNAPSHOT and 'parent.relativePath' points at wrong local POM @ line 16, column 11
[FATAL] Non-resolvable parent POM for org.eclipse.webtools.javaee:org.eclipse.jst.web_ui.feature:3.9.0-SNAPSHOT: Could not find artifact org.eclipse.webtools.javaee:javaee.features:pom:3.6.0-SNAPSHOT and 'parent.relativePath' points at wrong local POM @ line 16, column 11
[FATAL] Non-resolvable parent POM for org.eclipse.webtools.javaee:org.eclipse.jst.web_userdoc.feature:3.6.0-SNAPSHOT: Could not find artifact org.eclipse.webtools.javaee:javaee.features:pom:3.6.0-SNAPSHOT and 'parent.relativePath' points at wrong local POM @ line 16, column 11

[DEBUG] Closing connection to remote
[ERROR] The build could not read 11 projects -> [Help 1]
[ERROR]  
[ERROR]   The project org.eclipse.webtools.javaee:org.eclipse.jst.enterprise_core.feature:3.9.0-SNAPSHOT (/jobs/genie.webtools/WTP-R3_10_Integration/workspace/webtools.webservices/core/features/javaee-web/org.eclipse.jst.enterprise_core.feature/pom.xml) has 1 error
[ERROR]     Non-resolvable parent POM for org.eclipse.webtools.javaee:org.eclipse.jst.enterprise_core.feature:3.9.0-SNAPSHOT: Could not find artifact org.eclipse.webtools.javaee:javaee.features:pom:3.6.0-SNAPSHOT and 'parent.relativePath' points at wrong local POM @ line 16, column 11 -> [Help 2]
[ERROR]  
[ERROR]   The project org.eclipse.webtools.javaee:org.eclipse.jst.web_tests.feature:3.6.1-SNAPSHOT (/jobs/genie.webtools/WTP-R3_10_Integration/workspace/webtools.webservices/core/features/javaee-web/org.eclipse.jst.web_tests.feature/pom.xml) has 1 error
[ERROR]     Non-resolvable parent POM for org.eclipse.webtools.javaee:org.eclipse.jst.web_tests.feature:3.6.1-SNAPSHOT: Could not find artifact org.eclipse.webtools.javaee:javaee.features:pom:3.6.0-SNAPSHOT and 'parent.relativePath' points at wrong local POM @ line 16, column 11 -> [Help 2]
[ERROR]  
[ERROR]   The project org.eclipse.webtools.javaee:org.eclipse.jst.doc.user.feature:1.6.0-SNAPSHOT (/jobs/genie.webtools/WTP-R3_10_Integration/workspace/webtools.webservices/core/features/javaee-web/org.eclipse.jst.doc.user.feature/pom.xml) has 1 error
[ERROR]     Non-resolvable parent POM for org.eclipse.webtools.javaee:org.eclipse.jst.doc.user.feature:1.6.0-SNAPSHOT: Could not find artifact org.eclipse.webtools.javaee:javaee.features:pom:3.6.0-SNAPSHOT and 'parent.relativePath' points at wrong local POM @ line 16, column 11 -> [Help 2]
[ERROR]  
[ERROR]   The project org.eclipse.webtools.javaee:org.eclipse.jst.enterprise_sdk.feature:3.8.1-SNAPSHOT (/jobs/genie.webtools/WTP-R3_10_Integration/workspace/webtools.webservices/core/features/javaee-web/org.eclipse.jst.enterprise_sdk.feature/pom.xml) has 1 error
[ERROR]     Non-resolvable parent POM for org.eclipse.webtools.javaee:org.eclipse.jst.enterprise_sdk.feature:3.8.1-SNAPSHOT: Could not find artifact org.eclipse.webtools.javaee:javaee.features:pom:3.6.0-SNAPSHOT and 'parent.relativePath' points at wrong local POM @ line 16, column 11 -> [Help 2]
[ERROR]  
[ERROR]   The project org.eclipse.webtools.javaee:org.eclipse.jst.enterprise_tests.feature:3.6.0-SNAPSHOT (/jobs/genie.webtools/WTP-R3_10_Integration/workspace/webtools.webservices/core/features/javaee-web/org.eclipse.jst.enterprise_tests.feature/pom.xml) has 1 error
[ERROR]     Non-resolvable parent POM for org.eclipse.webtools.javaee:org.eclipse.jst.enterprise_tests.feature:3.6.0-SNAPSHOT: Could not find artifact org.eclipse.webtools.javaee:javaee.features:pom:3.6.0-SNAPSHOT and 'parent.relativePath' points at wrong local POM @ line 16, column 11 -> [Help 2]
[ERROR]  
[ERROR]   The project org.eclipse.webtools.javaee:org.eclipse.jst.enterprise_ui.feature:3.9.2-SNAPSHOT (/jobs/genie.webtools/WTP-R3_10_Integration/workspace/webtools.webservices/core/features/javaee-web/org.eclipse.jst.enterprise_ui.feature/pom.xml) has 1 error
[ERROR]     Non-resolvable parent POM for org.eclipse.webtools.javaee:org.eclipse.jst.enterprise_ui.feature:3.9.2-SNAPSHOT: Could not find artifact org.eclipse.webtools.javaee:javaee.features:pom:3.6.0-SNAPSHOT and 'parent.relativePath' points at wrong local POM @ line 16, column 11 -> [Help 2]
[ERROR]  
[ERROR]   The project org.eclipse.webtools.javaee:org.eclipse.jst.enterprise_userdoc.feature:3.6.0-SNAPSHOT (/jobs/genie.webtools/WTP-R3_10_Integration/workspace/webtools.webservices/core/features/javaee-web/org.eclipse.jst.enterprise_userdoc.feature/pom.xml) has 1 error
[ERROR]     Non-resolvable parent POM for org.eclipse.webtools.javaee:org.eclipse.jst.enterprise_userdoc.feature:3.6.0-SNAPSHOT: Could not find artifact org.eclipse.webtools.javaee:javaee.features:pom:3.6.0-SNAPSHOT and 'parent.relativePath' points at wrong local POM @ line 16, column 11 -> [Help 2]
[ERROR]  
[ERROR]   The project org.eclipse.webtools.javaee:org.eclipse.jst.web_core.feature:3.9.1-SNAPSHOT (/jobs/genie.webtools/WTP-R3_10_Integration/workspace/webtools.webservices/core/features/javaee-web/org.eclipse.jst.web_core.feature/pom.xml) has 1 error
[ERROR]     Non-resolvable parent POM for org.eclipse.webtools.javaee:org.eclipse.jst.web_core.feature:3.9.1-SNAPSHOT: Could not find artifact org.eclipse.webtools.javaee:javaee.features:pom:3.6.0-SNAPSHOT and 'parent.relativePath' points at wrong local POM @ line 16, column 11 -> [Help 2]
[ERROR]  
[ERROR]   The project org.eclipse.webtools.javaee:org.eclipse.jst.web_sdk.feature:3.8.0-SNAPSHOT (/jobs/genie.webtools/WTP-R3_10_Integration/workspace/webtools.webservices/core/features/javaee-web/org.eclipse.jst.web_sdk.feature/pom.xml) has 1 error
[ERROR]     Non-resolvable parent POM for org.eclipse.webtools.javaee:org.eclipse.jst.web_sdk.feature:3.8.0-SNAPSHOT: Could not find artifact org.eclipse.webtools.javaee:javaee.features:pom:3.6.0-SNAPSHOT and 'parent.relativePath' points at wrong local POM @ line 16, column 11 -> [Help 2]
[ERROR]  
[ERROR]   The project org.eclipse.webtools.javaee:org.eclipse.jst.web_ui.feature:3.9.0-SNAPSHOT (/jobs/genie.webtools/WTP-R3_10_Integration/workspace/webtools.webservices/core/features/javaee-web/org.eclipse.jst.web_ui.feature/pom.xml) has 1 error
[ERROR]     Non-resolvable parent POM for org.eclipse.webtools.javaee:org.eclipse.jst.web_ui.feature:3.9.0-SNAPSHOT: Could not find artifact org.eclipse.webtools.javaee:javaee.features:pom:3.6.0-SNAPSHOT and 'parent.relativePath' points at wrong local POM @ line 16, column 11 -> [Help 2]
[ERROR]  
[ERROR]   The project org.eclipse.webtools.javaee:org.eclipse.jst.web_userdoc.feature:3.6.0-SNAPSHOT (/jobs/genie.webtools/WTP-R3_10_Integration/workspace/webtools.webservices/core/features/javaee-web/org.eclipse.jst.web_userdoc.feature/pom.xml) has 1 error
[ERROR]     Non-resolvable parent POM for org.eclipse.webtools.javaee:org.eclipse.jst.web_userdoc.feature:3.6.0-SNAPSHOT: Could not find artifact org.eclipse.webtools.javaee:javaee.features:pom:3.6.0-SNAPSHOT and 'parent.relativePath' points at wrong local POM @ line 16, column 11 -> [Help 2]
[ERROR]
[ERROR] To see the full stack trace of the errors, re-run Maven with the -e switch.
[ERROR] Re-run Maven using the -X switch to enable full debug logging.
[ERROR]
[ERROR] For more information about the errors and possible solutions, please read the following articles:
[ERROR] [Help 1] http://cwiki.apache.org/confluence/display/MAVEN/ProjectBuildingException
[ERROR] [Help 2] http://cwiki.apache.org/confluence/display/MAVEN/UnresolvableModelException
[DEBUG] Waiting for process to finish
[DEBUG] Result: 1
Terminating xvnc.
Archiving artifacts

--
This message is automatically generated by Hudson.
For more information on Hudson, see: http://hudson-ci.org/
_______________________________________________
wtp-releng mailing list
[hidden email]
To change your delivery options, retrieve your password, or unsubscribe from this list, visit
https://dev.eclipse.org/mailman/listinfo/wtp-releng
Reply | Threaded
Open this post in threaded view
|

[Hudson] Build failed in Hudson: WTP-R3_10_Integration #250

hudsonbuild
See <https://hudson.eclipse.org/webtools/job/WTP-R3_10_Integration/250/>

------------------------------------------
[...truncated 544518 lines...]
[INFO] --- build-helper-maven-plugin:3.0.0:regex-property (regex-property) @ dali4x.tests ---
[INFO]
[INFO] --- maven-clean-plugin:2.5:clean (default-clean-1) @ dali4x.tests ---
[INFO]
[INFO] --- maven-resources-plugin:2.4.3:resources (default-resources) @ dali4x.tests ---
[WARNING] Using platform encoding (UTF-8 actually) to copy filtered resources, i.e. build is platform dependent!
[INFO] skip non existing resourceDirectory /jobs/genie.webtools/WTP-R3_10_Integration/workspace/webtools.repositories/dali4x.tests/src/main/resources
[INFO]
[INFO] --- tycho-source-plugin:1.0.0:plugin-source (plugin-source) @ dali4x.tests ---
[INFO]
[INFO] --- target-platform-configuration:1.0.0:target-platform (default-target-platform) @ dali4x.tests ---
[INFO]
[INFO] --- tycho-p2-publisher-plugin:1.0.0:publish-products (default-publish-products) @ dali4x.tests ---
[INFO]
[INFO] --- tycho-p2-publisher-plugin:1.0.0:publish-categories (default-publish-categories) @ dali4x.tests ---
[INFO]
[INFO] --- tycho-p2-publisher-plugin:1.0.0:attach-artifacts (default-attach-artifacts) @ dali4x.tests ---
[INFO]
[INFO] --- tycho-p2-repository-plugin:1.0.0:assemble-repository (default-assemble-repository) @ dali4x.tests ---
[INFO]
[INFO] --- tycho-p2-repository-plugin:1.0.0:archive-repository (default-archive-repository) @ dali4x.tests ---
[INFO] Building zip: /jobs/genie.webtools/WTP-R3_10_Integration/workspace/webtools.repositories/dali4x.tests/target/dali4x.tests-3.6.0-v201712072320.zip
[INFO]
[INFO] --- tycho-pack200a-plugin:1.0.0:normalize (pack200-normalize) @ dali4x.tests ---
[INFO]
[INFO] --- eclipse-jarsigner-plugin:1.1.4:sign (sign) @ dali4x.tests ---
[INFO]
[INFO] --- tycho-pack200b-plugin:1.0.0:pack (pack200-pack) @ dali4x.tests ---
[INFO]
[INFO] --- tycho-p2-plugin:1.0.0:p2-metadata (p2-metadata) @ dali4x.tests ---
[INFO]
[INFO] --- maven-install-plugin:2.3.1:install (default-install) @ dali4x.tests ---
[INFO] Installing /jobs/genie.webtools/WTP-R3_10_Integration/workspace/webtools.repositories/dali4x.tests/target/dali4x.tests-3.6.0-v201712072320.zip to <https://hudson.eclipse.org/webtools/job/WTP-R3_10_Integration/ws/.maven/repo/org/eclipse/webtools/dali4x.tests/3.6.0-SNAPSHOT/dali4x.tests-3.6.0-SNAPSHOT.zip>
[INFO] Installing /jobs/genie.webtools/WTP-R3_10_Integration/workspace/webtools.repositories/dali4x.tests/pom.xml to <https://hudson.eclipse.org/webtools/job/WTP-R3_10_Integration/ws/.maven/repo/org/eclipse/webtools/dali4x.tests/3.6.0-SNAPSHOT/dali4x.tests-3.6.0-SNAPSHOT.pom>
[INFO] Installing /jobs/genie.webtools/WTP-R3_10_Integration/workspace/webtools.repositories/dali4x.tests/target/p2content.xml to <https://hudson.eclipse.org/webtools/job/WTP-R3_10_Integration/ws/.maven/repo/org/eclipse/webtools/dali4x.tests/3.6.0-SNAPSHOT/dali4x.tests-3.6.0-SNAPSHOT-p2metadata.xml>
[INFO] Installing /jobs/genie.webtools/WTP-R3_10_Integration/workspace/webtools.repositories/dali4x.tests/target/p2artifacts.xml to <https://hudson.eclipse.org/webtools/job/WTP-R3_10_Integration/ws/.maven/repo/org/eclipse/webtools/dali4x.tests/3.6.0-SNAPSHOT/dali4x.tests-3.6.0-SNAPSHOT-p2artifacts.xml>
[INFO]
[INFO] --- tycho-p2-plugin:1.0.0:update-local-index (default-update-local-index) @ dali4x.tests ---
[INFO]
[INFO] ------------------------------------------------------------------------
[INFO] Building jst4x-sdk 3.6.0-SNAPSHOT
[INFO] ------------------------------------------------------------------------
[INFO]
[INFO] --- maven-clean-plugin:2.5:clean (default-clean) @ jst4x-sdk ---
[INFO]
[INFO] --- tycho-packaging-plugin:1.0.0:build-qualifier-aggregator (default-build-qualifier-aggregator) @ jst4x-sdk ---
[INFO] The project's OSGi version is 3.6.0.v201801251811
[INFO]
[INFO] --- build-helper-maven-plugin:3.0.0:regex-property (regex-property) @ jst4x-sdk ---
[INFO]
[INFO] --- maven-clean-plugin:2.5:clean (default-clean-1) @ jst4x-sdk ---
[INFO]
[INFO] --- maven-resources-plugin:2.4.3:resources (default-resources) @ jst4x-sdk ---
[WARNING] Using platform encoding (UTF-8 actually) to copy filtered resources, i.e. build is platform dependent!
[INFO] skip non existing resourceDirectory /jobs/genie.webtools/WTP-R3_10_Integration/workspace/webtools.repositories/jst4x-sdk/src/main/resources
[INFO]
[INFO] --- tycho-source-plugin:1.0.0:plugin-source (plugin-source) @ jst4x-sdk ---
[INFO]
[INFO] --- target-platform-configuration:1.0.0:target-platform (default-target-platform) @ jst4x-sdk ---
[INFO]
[INFO] --- tycho-p2-publisher-plugin:1.0.0:publish-products (default-publish-products) @ jst4x-sdk ---
[INFO]
[INFO] --- tycho-p2-publisher-plugin:1.0.0:publish-categories (default-publish-categories) @ jst4x-sdk ---
[INFO]
[INFO] --- tycho-p2-publisher-plugin:1.0.0:attach-artifacts (default-attach-artifacts) @ jst4x-sdk ---
[INFO]
[INFO] --- tycho-p2-repository-plugin:1.0.0:assemble-repository (default-assemble-repository) @ jst4x-sdk ---
[INFO]
[INFO] --- tycho-p2-repository-plugin:1.0.0:archive-repository (default-archive-repository) @ jst4x-sdk ---
[INFO] Building zip: /jobs/genie.webtools/WTP-R3_10_Integration/workspace/webtools.repositories/jst4x-sdk/target/jst4x-sdk-3.6.0-v201801251811.zip
[INFO]
[INFO] --- tycho-pack200a-plugin:1.0.0:normalize (pack200-normalize) @ jst4x-sdk ---
[INFO]
[INFO] --- eclipse-jarsigner-plugin:1.1.4:sign (sign) @ jst4x-sdk ---
[INFO]
[INFO] --- tycho-pack200b-plugin:1.0.0:pack (pack200-pack) @ jst4x-sdk ---
[INFO]
[INFO] --- tycho-p2-plugin:1.0.0:p2-metadata (p2-metadata) @ jst4x-sdk ---
[INFO]
[INFO] --- maven-install-plugin:2.3.1:install (default-install) @ jst4x-sdk ---
[INFO] Installing /jobs/genie.webtools/WTP-R3_10_Integration/workspace/webtools.repositories/jst4x-sdk/target/jst4x-sdk-3.6.0-v201801251811.zip to <https://hudson.eclipse.org/webtools/job/WTP-R3_10_Integration/ws/.maven/repo/org/eclipse/webtools/jst4x-sdk/3.6.0-SNAPSHOT/jst4x-sdk-3.6.0-SNAPSHOT.zip>
[INFO] Installing /jobs/genie.webtools/WTP-R3_10_Integration/workspace/webtools.repositories/jst4x-sdk/pom.xml to <https://hudson.eclipse.org/webtools/job/WTP-R3_10_Integration/ws/.maven/repo/org/eclipse/webtools/jst4x-sdk/3.6.0-SNAPSHOT/jst4x-sdk-3.6.0-SNAPSHOT.pom>
[INFO] Installing /jobs/genie.webtools/WTP-R3_10_Integration/workspace/webtools.repositories/jst4x-sdk/target/p2content.xml to <https://hudson.eclipse.org/webtools/job/WTP-R3_10_Integration/ws/.maven/repo/org/eclipse/webtools/jst4x-sdk/3.6.0-SNAPSHOT/jst4x-sdk-3.6.0-SNAPSHOT-p2metadata.xml>
[INFO] Installing /jobs/genie.webtools/WTP-R3_10_Integration/workspace/webtools.repositories/jst4x-sdk/target/p2artifacts.xml to <https://hudson.eclipse.org/webtools/job/WTP-R3_10_Integration/ws/.maven/repo/org/eclipse/webtools/jst4x-sdk/3.6.0-SNAPSHOT/jst4x-sdk-3.6.0-SNAPSHOT-p2artifacts.xml>
[INFO]
[INFO] --- tycho-p2-plugin:1.0.0:update-local-index (default-update-local-index) @ jst4x-sdk ---
[INFO]
[INFO] ------------------------------------------------------------------------
[INFO] Building jst4x.tests 3.6.0-SNAPSHOT
[INFO] ------------------------------------------------------------------------
[INFO]
[INFO] --- maven-clean-plugin:2.5:clean (default-clean) @ jst4x.tests ---
[INFO]
[INFO] --- tycho-packaging-plugin:1.0.0:build-qualifier-aggregator (default-build-qualifier-aggregator) @ jst4x.tests ---
[INFO] The project's OSGi version is 3.6.0.v201801251811
[INFO]
[INFO] --- build-helper-maven-plugin:3.0.0:regex-property (regex-property) @ jst4x.tests ---
[INFO]
[INFO] --- maven-clean-plugin:2.5:clean (default-clean-1) @ jst4x.tests ---
[INFO]
[INFO] --- maven-resources-plugin:2.4.3:resources (default-resources) @ jst4x.tests ---
[WARNING] Using platform encoding (UTF-8 actually) to copy filtered resources, i.e. build is platform dependent!
[INFO] skip non existing resourceDirectory /jobs/genie.webtools/WTP-R3_10_Integration/workspace/webtools.repositories/jst4x.tests/src/main/resources
[INFO]
[INFO] --- tycho-source-plugin:1.0.0:plugin-source (plugin-source) @ jst4x.tests ---
[INFO]
[INFO] --- target-platform-configuration:1.0.0:target-platform (default-target-platform) @ jst4x.tests ---
[INFO]
[INFO] --- tycho-p2-publisher-plugin:1.0.0:publish-products (default-publish-products) @ jst4x.tests ---
[INFO]
[INFO] --- tycho-p2-publisher-plugin:1.0.0:publish-categories (default-publish-categories) @ jst4x.tests ---
[INFO]
[INFO] --- tycho-p2-publisher-plugin:1.0.0:attach-artifacts (default-attach-artifacts) @ jst4x.tests ---
[INFO]
[INFO] --- tycho-p2-repository-plugin:1.0.0:assemble-repository (default-assemble-repository) @ jst4x.tests ---
[INFO]
[INFO] --- tycho-p2-repository-plugin:1.0.0:archive-repository (default-archive-repository) @ jst4x.tests ---
[INFO] Building zip: /jobs/genie.webtools/WTP-R3_10_Integration/workspace/webtools.repositories/jst4x.tests/target/jst4x.tests-3.6.0-v201801251811.zip
[INFO]
[INFO] --- tycho-pack200a-plugin:1.0.0:normalize (pack200-normalize) @ jst4x.tests ---
[INFO]
[INFO] --- eclipse-jarsigner-plugin:1.1.4:sign (sign) @ jst4x.tests ---
[INFO]
[INFO] --- tycho-pack200b-plugin:1.0.0:pack (pack200-pack) @ jst4x.tests ---
[INFO]
[INFO] --- tycho-p2-plugin:1.0.0:p2-metadata (p2-metadata) @ jst4x.tests ---
[INFO]
[INFO] --- maven-install-plugin:2.3.1:install (default-install) @ jst4x.tests ---
[INFO] Installing /jobs/genie.webtools/WTP-R3_10_Integration/workspace/webtools.repositories/jst4x.tests/target/jst4x.tests-3.6.0-v201801251811.zip to <https://hudson.eclipse.org/webtools/job/WTP-R3_10_Integration/ws/.maven/repo/org/eclipse/webtools/jst4x.tests/3.6.0-SNAPSHOT/jst4x.tests-3.6.0-SNAPSHOT.zip>
[INFO] Installing /jobs/genie.webtools/WTP-R3_10_Integration/workspace/webtools.repositories/jst4x.tests/pom.xml to <https://hudson.eclipse.org/webtools/job/WTP-R3_10_Integration/ws/.maven/repo/org/eclipse/webtools/jst4x.tests/3.6.0-SNAPSHOT/jst4x.tests-3.6.0-SNAPSHOT.pom>
[INFO] Installing /jobs/genie.webtools/WTP-R3_10_Integration/workspace/webtools.repositories/jst4x.tests/target/p2content.xml to <https://hudson.eclipse.org/webtools/job/WTP-R3_10_Integration/ws/.maven/repo/org/eclipse/webtools/jst4x.tests/3.6.0-SNAPSHOT/jst4x.tests-3.6.0-SNAPSHOT-p2metadata.xml>
[INFO] Installing /jobs/genie.webtools/WTP-R3_10_Integration/workspace/webtools.repositories/jst4x.tests/target/p2artifacts.xml to <https://hudson.eclipse.org/webtools/job/WTP-R3_10_Integration/ws/.maven/repo/org/eclipse/webtools/jst4x.tests/3.6.0-SNAPSHOT/jst4x.tests-3.6.0-SNAPSHOT-p2artifacts.xml>
[INFO]
[INFO] --- tycho-p2-plugin:1.0.0:update-local-index (default-update-local-index) @ jst4x.tests ---
[INFO]
[INFO] ------------------------------------------------------------------------
[INFO] Building org.eclipse.wst.jsdt.chromium_sdk.feature 0.6.0-SNAPSHOT
[INFO] ------------------------------------------------------------------------
[INFO]
[INFO] --- maven-clean-plugin:2.5:clean (default-clean) @ org.eclipse.wst.jsdt.chromium_sdk.feature ---
[INFO]
[INFO] --- tycho-packaging-plugin:1.0.0:build-qualifier-aggregator (default-build-qualifier-aggregator) @ org.eclipse.wst.jsdt.chromium_sdk.feature ---
[INFO] The project's OSGi version is 0.6.0.v201705091354
[INFO]
[INFO] --- tycho-packaging-plugin:1.0.0:validate-id (default-validate-id) @ org.eclipse.wst.jsdt.chromium_sdk.feature ---
[INFO]
[INFO] --- tycho-packaging-plugin:1.0.0:validate-version (default-validate-version) @ org.eclipse.wst.jsdt.chromium_sdk.feature ---
[INFO]
[INFO] --- build-helper-maven-plugin:3.0.0:regex-property (regex-property) @ org.eclipse.wst.jsdt.chromium_sdk.feature ---
[INFO]
[INFO] --- tycho-source-plugin:1.0.0:plugin-source (plugin-source) @ org.eclipse.wst.jsdt.chromium_sdk.feature ---
[INFO]
[INFO] --- target-platform-configuration:1.0.0:target-platform (default-target-platform) @ org.eclipse.wst.jsdt.chromium_sdk.feature ---
[INFO]
[INFO] --- tycho-packaging-plugin:1.0.0:package-feature (default-package-feature) @ org.eclipse.wst.jsdt.chromium_sdk.feature ---
[INFO] Building jar: /jobs/genie.webtools/WTP-R3_10_Integration/workspace/webtools.jsdt/features/org.eclipse.wst.jsdt.chromium_sdk.feature/target/org.eclipse.wst.jsdt.chromium_sdk.feature-0.6.0-SNAPSHOT.jar
[INFO]
[INFO] --- tycho-p2-plugin:1.0.0:p2-metadata-default (default-p2-metadata-default) @ org.eclipse.wst.jsdt.chromium_sdk.feature ---
[INFO]
[INFO] --- tycho-p2-plugin:1.0.0:feature-p2-metadata (default-feature-p2-metadata) @ org.eclipse.wst.jsdt.chromium_sdk.feature ---
[INFO]
[INFO] --- tycho-pack200a-plugin:1.0.0:normalize (pack200-normalize) @ org.eclipse.wst.jsdt.chromium_sdk.feature ---
[INFO]
[INFO] --- eclipse-jarsigner-plugin:1.1.4:sign (sign) @ org.eclipse.wst.jsdt.chromium_sdk.feature ---
[INFO] Signing jar: /jobs/genie.webtools/WTP-R3_10_Integration/workspace/webtools.jsdt/features/org.eclipse.wst.jsdt.chromium_sdk.feature/target/org.eclipse.wst.jsdt.chromium_sdk.feature-0.6.0-SNAPSHOT.jar
[INFO]
[INFO] --- tycho-pack200b-plugin:1.0.0:pack (pack200-pack) @ org.eclipse.wst.jsdt.chromium_sdk.feature ---
[INFO]
[INFO] --- tycho-p2-plugin:1.0.0:p2-metadata (p2-metadata) @ org.eclipse.wst.jsdt.chromium_sdk.feature ---
[INFO] No baseline version MavenProject: org.eclipse.webtools.jsdt.features:org.eclipse.wst.jsdt.chromium_sdk.feature:0.6.0-SNAPSHOT @ /jobs/genie.webtools/WTP-R3_10_Integration/workspace/webtools.jsdt/features/org.eclipse.wst.jsdt.chromium_sdk.feature/pom.xml
[INFO]
[INFO] --- maven-install-plugin:2.3.1:install (default-install) @ org.eclipse.wst.jsdt.chromium_sdk.feature ---
[INFO] Installing /jobs/genie.webtools/WTP-R3_10_Integration/workspace/webtools.jsdt/features/org.eclipse.wst.jsdt.chromium_sdk.feature/target/org.eclipse.wst.jsdt.chromium_sdk.feature-0.6.0-SNAPSHOT.jar to <https://hudson.eclipse.org/webtools/job/WTP-R3_10_Integration/ws/.maven/repo/org/eclipse/webtools/jsdt/features/org.eclipse.wst.jsdt.chromium_sdk.feature/0.6.0-SNAPSHOT/org.eclipse.wst.jsdt.chromium_sdk.feature-0.6.0-SNAPSHOT.jar>
[INFO] Installing /jobs/genie.webtools/WTP-R3_10_Integration/workspace/webtools.jsdt/features/org.eclipse.wst.jsdt.chromium_sdk.feature/pom.xml to <https://hudson.eclipse.org/webtools/job/WTP-R3_10_Integration/ws/.maven/repo/org/eclipse/webtools/jsdt/features/org.eclipse.wst.jsdt.chromium_sdk.feature/0.6.0-SNAPSHOT/org.eclipse.wst.jsdt.chromium_sdk.feature-0.6.0-SNAPSHOT.pom>
[INFO] Installing /jobs/genie.webtools/WTP-R3_10_Integration/workspace/webtools.jsdt/features/org.eclipse.wst.jsdt.chromium_sdk.feature/target/p2content.xml to <https://hudson.eclipse.org/webtools/job/WTP-R3_10_Integration/ws/.maven/repo/org/eclipse/webtools/jsdt/features/org.eclipse.wst.jsdt.chromium_sdk.feature/0.6.0-SNAPSHOT/org.eclipse.wst.jsdt.chromium_sdk.feature-0.6.0-SNAPSHOT-p2metadata.xml>
[INFO] Installing /jobs/genie.webtools/WTP-R3_10_Integration/workspace/webtools.jsdt/features/org.eclipse.wst.jsdt.chromium_sdk.feature/target/p2artifacts.xml to <https://hudson.eclipse.org/webtools/job/WTP-R3_10_Integration/ws/.maven/repo/org/eclipse/webtools/jsdt/features/org.eclipse.wst.jsdt.chromium_sdk.feature/0.6.0-SNAPSHOT/org.eclipse.wst.jsdt.chromium_sdk.feature-0.6.0-SNAPSHOT-p2artifacts.xml>
[INFO]
[INFO] --- tycho-p2-plugin:1.0.0:update-local-index (default-update-local-index) @ org.eclipse.wst.jsdt.chromium_sdk.feature ---
[INFO]
[INFO] ------------------------------------------------------------------------
[INFO] Building wst4x-sdk 3.6.0-SNAPSHOT
[INFO] ------------------------------------------------------------------------
[INFO]
[INFO] --- maven-clean-plugin:2.5:clean (default-clean) @ wst4x-sdk ---
[INFO]
[INFO] --- tycho-packaging-plugin:1.0.0:build-qualifier-aggregator (default-build-qualifier-aggregator) @ wst4x-sdk ---
[INFO] The project's OSGi version is 3.6.0.v201801292111
[INFO]
[INFO] --- build-helper-maven-plugin:3.0.0:regex-property (regex-property) @ wst4x-sdk ---
[INFO]
[INFO] --- maven-clean-plugin:2.5:clean (default-clean-1) @ wst4x-sdk ---
[INFO]
[INFO] --- maven-resources-plugin:2.4.3:resources (default-resources) @ wst4x-sdk ---
[WARNING] Using platform encoding (UTF-8 actually) to copy filtered resources, i.e. build is platform dependent!
[INFO] skip non existing resourceDirectory /jobs/genie.webtools/WTP-R3_10_Integration/workspace/webtools.repositories/wst4x-sdk/src/main/resources
[INFO]
[INFO] --- tycho-source-plugin:1.0.0:plugin-source (plugin-source) @ wst4x-sdk ---
[INFO]
[INFO] --- target-platform-configuration:1.0.0:target-platform (default-target-platform) @ wst4x-sdk ---
[INFO]
[INFO] --- tycho-p2-publisher-plugin:1.0.0:publish-products (default-publish-products) @ wst4x-sdk ---
[INFO]
[INFO] --- tycho-p2-publisher-plugin:1.0.0:publish-categories (default-publish-categories) @ wst4x-sdk ---
[INFO]
[INFO] --- tycho-p2-publisher-plugin:1.0.0:attach-artifacts (default-attach-artifacts) @ wst4x-sdk ---
[INFO]
[INFO] --- tycho-p2-repository-plugin:1.0.0:assemble-repository (default-assemble-repository) @ wst4x-sdk ---
[WARNING] Mirror tool: Problems resolving provisioning plan.: [Unable to satisfy dependency from v201801292111.Jetty 1.0.0.B49EA1cLWBU-EVmD7k-N8rY to org.eclipse.jetty.http [9.4.8.v20171121].; Unable to satisfy dependency from v201801292111.Jetty 1.0.0.B49EA1cLWBU-EVmD7k-N8rY to org.eclipse.jetty.webapp [9.4.5.v20170502].; Unable to satisfy dependency from v201801292111.Jetty 1.0.0.B49EA1cLWBU-EVmD7k-N8rY to org.eclipse.jetty.security [9.4.8.v20171121].; Unable to satisfy dependency from v201801292111.Jetty 1.0.0.B49EA1cLWBU-EVmD7k-N8rY to org.eclipse.jetty.xml [9.4.5.v20170502].; Unable to satisfy dependency from v201801292111.Jetty 1.0.0.B49EA1cLWBU-EVmD7k-N8rY to org.eclipse.jetty.servlet [9.4.8.v20171121].; Unable to satisfy dependency from v201801292111.Jetty 1.0.0.B49EA1cLWBU-EVmD7k-N8rY to org.eclipse.jetty.continuation [9.4.7.v20170914].; Unable to satisfy dependency from v201801292111.Jetty 1.0.0.B49EA1cLWBU-EVmD7k-N8rY to org.eclipse.jetty.util [9.4.8.v20171121].; Unable to
  satisfy dependency from v201801292111.Jetty 1.0.0.B49EA1cLWBU-EVmD7k-N8rY to org.eclipse.jetty.server [9.4.8.v20171121].; Unable to satisfy dependency from v201801292111.Jetty 1.0.0.B49EA1cLWBU-EVmD7k-N8rY to org.eclipse.jetty.io [9.4.8.v20171121].]
[WARNING] More information on the preceding warning(s) can be found here:
[WARNING] - http://wiki.eclipse.org/Tycho_Messages_Explained#Mirror_tool
[WARNING] Mirror tool: Problems resolving provisioning plan.: [Unable to satisfy dependency from v201801292111.Jetty 1.0.0.B49EA1cLWBU-EVmD7k-N8rY to org.eclipse.jetty.http [9.4.8.v20171121].; Unable to satisfy dependency from v201801292111.Jetty 1.0.0.B49EA1cLWBU-EVmD7k-N8rY to org.eclipse.jetty.webapp [9.4.5.v20170502].; Unable to satisfy dependency from v201801292111.Jetty 1.0.0.B49EA1cLWBU-EVmD7k-N8rY to org.eclipse.jetty.security [9.4.8.v20171121].; Unable to satisfy dependency from v201801292111.Jetty 1.0.0.B49EA1cLWBU-EVmD7k-N8rY to org.eclipse.jetty.xml [9.4.5.v20170502].; Unable to satisfy dependency from v201801292111.Jetty 1.0.0.B49EA1cLWBU-EVmD7k-N8rY to org.eclipse.jetty.servlet [9.4.8.v20171121].; Unable to satisfy dependency from v201801292111.Jetty 1.0.0.B49EA1cLWBU-EVmD7k-N8rY to org.eclipse.jetty.continuation [9.4.7.v20170914].; Unable to satisfy dependency from v201801292111.Jetty 1.0.0.B49EA1cLWBU-EVmD7k-N8rY to org.eclipse.jetty.util [9.4.8.v20171121].; Unable to
  satisfy dependency from v201801292111.Jetty 1.0.0.B49EA1cLWBU-EVmD7k-N8rY to org.eclipse.jetty.server [9.4.8.v20171121].; Unable to satisfy dependency from v201801292111.Jetty 1.0.0.B49EA1cLWBU-EVmD7k-N8rY to org.eclipse.jetty.io [9.4.8.v20171121].]
[WARNING] More information on the preceding warning(s) can be found here:
[WARNING] - http://wiki.eclipse.org/Tycho_Messages_Explained#Mirror_tool
[WARNING] Mirror tool: Problems resolving provisioning plan.: [Unable to satisfy dependency from v201801292111.Jetty 1.0.0.B49EA1cLWBU-EVmD7k-N8rY to org.eclipse.jetty.http [9.4.8.v20171121].; Unable to satisfy dependency from v201801292111.Jetty 1.0.0.B49EA1cLWBU-EVmD7k-N8rY to org.eclipse.jetty.webapp [9.4.5.v20170502].; Unable to satisfy dependency from v201801292111.Jetty 1.0.0.B49EA1cLWBU-EVmD7k-N8rY to org.eclipse.jetty.security [9.4.8.v20171121].; Unable to satisfy dependency from v201801292111.Jetty 1.0.0.B49EA1cLWBU-EVmD7k-N8rY to org.eclipse.jetty.xml [9.4.5.v20170502].; Unable to satisfy dependency from v201801292111.Jetty 1.0.0.B49EA1cLWBU-EVmD7k-N8rY to org.eclipse.jetty.servlet [9.4.8.v20171121].; Unable to satisfy dependency from v201801292111.Jetty 1.0.0.B49EA1cLWBU-EVmD7k-N8rY to org.eclipse.jetty.continuation [9.4.7.v20170914].; Unable to satisfy dependency from v201801292111.Jetty 1.0.0.B49EA1cLWBU-EVmD7k-N8rY to org.eclipse.jetty.util [9.4.8.v20171121].; Unable to
  satisfy dependency from v201801292111.Jetty 1.0.0.B49EA1cLWBU-EVmD7k-N8rY to org.eclipse.jetty.server [9.4.8.v20171121].; Unable to satisfy dependency from v201801292111.Jetty 1.0.0.B49EA1cLWBU-EVmD7k-N8rY to org.eclipse.jetty.io [9.4.8.v20171121].]
[WARNING] More information on the preceding warning(s) can be found here:
[WARNING] - http://wiki.eclipse.org/Tycho_Messages_Explained#Mirror_tool
[ERROR] Failure: hudson.remoting.RequestAbortedException: hudson.remoting.RequestAbortedException: java.io.IOException: Unexpected termination of the channel
Terminating xvnc.
FATAL: hudson.remoting.RequestAbortedException: hudson.remoting.RequestAbortedException: java.io.IOException: Unexpected termination of the channel
org.hudsonci.utils.tasks.OperationFailure: hudson.remoting.RequestAbortedException: hudson.remoting.RequestAbortedException: java.io.IOException: Unexpected termination of the channel
        at org.hudsonci.utils.tasks.PerformOperation.execute(PerformOperation.java:64)
        at org.hudsonci.maven.plugin.builder.MavenBuilder.perform(MavenBuilder.java:169)
        at hudson.tasks.BuildStepMonitor$1.perform(BuildStepMonitor.java:34)
        at hudson.model.AbstractBuild$AbstractRunner.perform(AbstractBuild.java:736)
        at hudson.model.Build$RunnerImpl.build(Build.java:181)
        at hudson.model.Build$RunnerImpl.doRun(Build.java:136)
        at hudson.model.AbstractBuild$AbstractRunner.run(AbstractBuild.java:524)
        at hudson.model.Run.run(Run.java:1493)
        at hudson.model.FreeStyleBuild.run(FreeStyleBuild.java:44)
        at hudson.model.ResourceController.execute(ResourceController.java:82)
        at hudson.model.Executor.run(Executor.java:137)
Caused by: hudson.remoting.RequestAbortedException: hudson.remoting.RequestAbortedException: java.io.IOException: Unexpected termination of the channel
        at hudson.remoting.Request.call(Request.java:142)
        at hudson.remoting.Channel.call(Channel.java:643)
        at org.hudsonci.maven.plugin.builder.internal.PerformBuild.doExecute(PerformBuild.java:198)
        at org.hudsonci.utils.tasks.PerformOperation.execute(PerformOperation.java:50)
        ... 10 more
Caused by: hudson.remoting.RequestAbortedException: java.io.IOException: Unexpected termination of the channel
        at hudson.remoting.Request.abort(Request.java:262)
        at hudson.remoting.Channel.terminate(Channel.java:743)
        at hudson.slaves.Channels$1.terminate(Channels.java:71)
        at hudson.remoting.Channel$ReaderThread.run(Channel.java:1042)
Caused by: java.io.IOException: Unexpected termination of the channel
        at hudson.remoting.Channel$ReaderThread.run(Channel.java:1023)
Caused by: java.io.EOFException
        at java.io.ObjectInputStream$BlockDataInputStream.peekByte(ObjectInputStream.java:2598)
        at java.io.ObjectInputStream.readObject0(ObjectInputStream.java:1318)
        at java.io.ObjectInputStream.readObject(ObjectInputStream.java:370)
        at hudson.remoting.Channel$ReaderThread.run(Channel.java:1017)

--
This message is automatically generated by Hudson.
For more information on Hudson, see: http://hudson-ci.org/
_______________________________________________
wtp-releng mailing list
[hidden email]
To change your delivery options, retrieve your password, or unsubscribe from this list, visit
https://dev.eclipse.org/mailman/listinfo/wtp-releng
Reply | Threaded
Open this post in threaded view
|

[Hudson] Hudson build is back to normal : WTP-R3_10_Integration #251

hudsonbuild
See <https://hudson.eclipse.org/webtools/job/WTP-R3_10_Integration/251/>


--
This message is automatically generated by Hudson.
For more information on Hudson, see: http://hudson-ci.org/
_______________________________________________
wtp-releng mailing list
[hidden email]
To change your delivery options, retrieve your password, or unsubscribe from this list, visit
https://dev.eclipse.org/mailman/listinfo/wtp-releng