[Hudson] Build failed in Hudson: WTP-R3_8_x_Maintenance #169

classic Classic list List threaded Threaded
4 messages Options
Reply | Threaded
Open this post in threaded view
|  
Report Content as Inappropriate

[Hudson] Build failed in Hudson: WTP-R3_8_x_Maintenance #169

hudsonbuild
See <https://hudson.eclipse.org/webtools/job/WTP-R3_8_x_Maintenance/169/>

------------------------------------------
[...truncated 81 lines...]
Initializing built-in extension XC-MISC
Initializing built-in extension XFIXES
Initializing built-in extension RENDER
Initializing built-in extension RANDR
Initializing built-in extension COMPOSITE
Initializing built-in extension DAMAGE
Initializing built-in extension MIT-SCREEN-SAVER
Initializing built-in extension DOUBLE-BUFFER
Initializing built-in extension RECORD
Initializing built-in extension DPMS
Initializing built-in extension Present
Initializing built-in extension X-Resource
Initializing built-in extension XVideo
Initializing built-in extension XVideo-MotionCompensation
Initializing built-in extension GLX

Mon Mar  6 00:54:53 2017
 vncext:      VNC extension running!
 vncext:      Listening for VNC connections on all interface(s), port 6359
 vncext:      created VNC server for screen 0
[dix] Could not init font path element /usr/share/fonts/TTF/, removing from list!
[dix] Could not init font path element /usr/share/fonts/OTF/, removing from list!
Entering 'webtools.common'
Entering 'webtools.common.fproj'
Entering 'webtools.common.snippets'
Entering 'webtools.common.tests'
Entering 'webtools.dali'
Entering 'webtools.ejb'
Entering 'webtools.javaee'
Entering 'webtools.javaee.tests'
Entering 'webtools.jsdt'
Entering 'webtools.jsf'
Entering 'webtools.jsf.docs'
Entering 'webtools.jsf.tests'
Entering 'webtools.releng'
Entering 'webtools.servertools'
Entering 'webtools.servertools.docs'
Entering 'webtools.servertools.tests'
Entering 'webtools.sourceediting'
Entering 'webtools.sourceediting.xpath'
Entering 'webtools.sourceediting.xpath.tests'
Entering 'webtools.sourceediting.xsl'
Entering 'webtools.sourceediting.xsl.tests'
Entering 'webtools.webservices'
Entering 'webtools.webservices.axis2'
Entering 'webtools.webservices.jaxws'
Entering 'webtools.common'
HEAD is now at 520aa3f [437564] Can't remove external jar from the Deployment Assembly page
Entering 'webtools.common.fproj'
HEAD is now at 36aefaf [443834] Version updates needed for WTP 3.6.1
Entering 'webtools.common.snippets'
HEAD is now at e157752 [431850] [CBI] NullPointerException when running junit tests for
Entering 'webtools.common.tests'
HEAD is now at c007d65 [433907] Update the license features to 1.0.1 for Luna
Entering 'webtools.dali'
HEAD is now at fc93cf9 [443848] Update version numbers for 3.6.1 / 3.4.1.
Entering 'webtools.ejb'
HEAD is now at c3649f7 [435958] [CBI] Set Eclipse-SourceReferences for EJB
Entering 'webtools.javaee'
HEAD is now at 9075e61 [443842] Version updates needed for WTP 3.6.1
Entering 'webtools.javaee.tests'
HEAD is now at 2948020 [443842] Version updates needed for WTP 3.6.1
Entering 'webtools.jsdt'
HEAD is now at edcaa82 [443837] Component requires version increase
Entering 'webtools.jsf'
HEAD is now at 1650337 Bug 443835 - JSF Components that require version increase
Entering 'webtools.jsf.docs'
HEAD is now at 6866cf1 Bug 243674 - [hotbug] Default configuration for JSF EL validation is too
Entering 'webtools.jsf.tests'
HEAD is now at 79f858e Bug 443835 - JSF Components that require version increase
Entering 'webtools.releng'
HEAD is now at ebf4c91 Rollback to 3.6.0
Entering 'webtools.servertools'
HEAD is now at ad2cd05 [433885] [CBI] org.eclipse.wst.server.ui.tests test failures
Entering 'webtools.servertools.docs'
HEAD is now at 338eee7 [435966] [CBI] Set Eclipse-SourceReferences for servertools
Entering 'webtools.servertools.tests'
HEAD is now at 2d70da7 [442420] org.eclipse.jst.server.core.tests is not completed due to a
Entering 'webtools.sourceediting'
HEAD is now at 360e004 [443836] Source Editing Components that require version increase
Entering 'webtools.sourceediting.xpath'
HEAD is now at de85043 [443836] Source Editing Components that require version increase
Entering 'webtools.sourceediting.xpath.tests'
HEAD is now at 74e7562 [435968] [CBI] Set Eclipse-SourceReferences for sourceediting.xpath
Entering 'webtools.sourceediting.xsl'
HEAD is now at d657949 [443836] Source Editing Components that require version increase
Entering 'webtools.sourceediting.xsl.tests'
HEAD is now at 0cde4f7 [443836] Source Editing Components that require version increase
Entering 'webtools.webservices'
HEAD is now at 68a2057 [443846] Version updates needed for WTP 3.6.1
Entering 'webtools.webservices.axis2'
HEAD is now at eeeafe4 [433929] Update the Web Services license features to 1.0.1 for Luna
Entering 'webtools.webservices.jaxws'
HEAD is now at 5ea598f [443846] Version updates needed for WTP 3.6.1
Removing .Xauthority-8901075385195132606
HEAD is now at 24b664a [512829] Update prereqs for WTP 3.8.3
/jobs/genie.webtools/WTP-R3_8_x_Maintenance/workspace/webtools.common /jobs/genie.webtools/WTP-R3_8_x_Maintenance/workspace
Previous HEAD position was 520aa3f... [437564] Can't remove external jar from the Deployment Assembly page
Switched to a new branch 'R3_8_maintenance'
Branch R3_8_maintenance set up to track remote branch R3_8_maintenance from origin.
Already up-to-date.
/jobs/genie.webtools/WTP-R3_8_x_Maintenance/workspace
/jobs/genie.webtools/WTP-R3_8_x_Maintenance/workspace/webtools.common.fproj /jobs/genie.webtools/WTP-R3_8_x_Maintenance/workspace
Previous HEAD position was 36aefaf... [443834] Version updates needed for WTP 3.6.1
Switched to branch 'master'
Your branch is up-to-date with 'origin/master'.
Already up-to-date.
/jobs/genie.webtools/WTP-R3_8_x_Maintenance/workspace
/jobs/genie.webtools/WTP-R3_8_x_Maintenance/workspace/webtools.common.snippets /jobs/genie.webtools/WTP-R3_8_x_Maintenance/workspace
Previous HEAD position was e157752... [431850] [CBI] NullPointerException when running junit tests for org.eclipse.wst.common.snippets.tests
Switched to branch 'master'
Your branch is up-to-date with 'origin/master'.
Already up-to-date.
/jobs/genie.webtools/WTP-R3_8_x_Maintenance/workspace
/jobs/genie.webtools/WTP-R3_8_x_Maintenance/workspace/webtools.common.tests /jobs/genie.webtools/WTP-R3_8_x_Maintenance/workspace
Previous HEAD position was c007d65... [433907] Update the license features to 1.0.1 for Luna
Switched to branch 'master'
Your branch is up-to-date with 'origin/master'.
Already up-to-date.
/jobs/genie.webtools/WTP-R3_8_x_Maintenance/workspace
/jobs/genie.webtools/WTP-R3_8_x_Maintenance/workspace/webtools.dali /jobs/genie.webtools/WTP-R3_8_x_Maintenance/workspace
Previous HEAD position was fc93cf9... [443848] Update version numbers for 3.6.1 / 3.4.1.
Switched to a new branch 'R3_6_maintenance'
Branch R3_6_maintenance set up to track remote branch R3_6_maintenance from origin.
Already up-to-date.
/jobs/genie.webtools/WTP-R3_8_x_Maintenance/workspace
/jobs/genie.webtools/WTP-R3_8_x_Maintenance/workspace/webtools.ejb /jobs/genie.webtools/WTP-R3_8_x_Maintenance/workspace
Previous HEAD position was c3649f7... [435958] [CBI] Set Eclipse-SourceReferences for EJB
Switched to branch 'master'
Your branch is up-to-date with 'origin/master'.
Already up-to-date.
/jobs/genie.webtools/WTP-R3_8_x_Maintenance/workspace
/jobs/genie.webtools/WTP-R3_8_x_Maintenance/workspace/webtools.javaee /jobs/genie.webtools/WTP-R3_8_x_Maintenance/workspace
Previous HEAD position was 9075e61... [443842] Version updates needed for WTP 3.6.1
Switched to a new branch 'R3_8_maintenance'
Branch R3_8_maintenance set up to track remote branch R3_8_maintenance from origin.
Already up-to-date.
/jobs/genie.webtools/WTP-R3_8_x_Maintenance/workspace
/jobs/genie.webtools/WTP-R3_8_x_Maintenance/workspace/webtools.javaee.tests /jobs/genie.webtools/WTP-R3_8_x_Maintenance/workspace
Previous HEAD position was 2948020... [443842] Version updates needed for WTP 3.6.1
Switched to branch 'master'
Your branch is up-to-date with 'origin/master'.
Already up-to-date.
/jobs/genie.webtools/WTP-R3_8_x_Maintenance/workspace
/jobs/genie.webtools/WTP-R3_8_x_Maintenance/workspace/webtools.jsdt /jobs/genie.webtools/WTP-R3_8_x_Maintenance/workspace
Previous HEAD position was edcaa82... [443837] Component requires version increase
Switched to a new branch 'R3_8_maintenance'
Branch R3_8_maintenance set up to track remote branch R3_8_maintenance from origin.
Already up-to-date.
/jobs/genie.webtools/WTP-R3_8_x_Maintenance/workspace
/jobs/genie.webtools/WTP-R3_8_x_Maintenance/workspace/webtools.jsf /jobs/genie.webtools/WTP-R3_8_x_Maintenance/workspace
Previous HEAD position was 1650337... Bug 443835 - JSF Components that require version increase
Switched to a new branch 'R3_8_maintenance'
Branch R3_8_maintenance set up to track remote branch R3_8_maintenance from origin.
Already up-to-date.
/jobs/genie.webtools/WTP-R3_8_x_Maintenance/workspace
/jobs/genie.webtools/WTP-R3_8_x_Maintenance/workspace/webtools.jsf.docs /jobs/genie.webtools/WTP-R3_8_x_Maintenance/workspace
Previous HEAD position was 6866cf1... Bug 243674 - [hotbug] Default configuration for JSF EL validation is too strict
Switched to branch 'master'
Your branch is up-to-date with 'origin/master'.
Already up-to-date.
/jobs/genie.webtools/WTP-R3_8_x_Maintenance/workspace
/jobs/genie.webtools/WTP-R3_8_x_Maintenance/workspace/webtools.jsf.tests /jobs/genie.webtools/WTP-R3_8_x_Maintenance/workspace
Previous HEAD position was 79f858e... Bug 443835 - JSF Components that require version increase
Switched to a new branch 'R3_8_maintenance'
Branch R3_8_maintenance set up to track remote branch R3_8_maintenance from origin.
Already up-to-date.
/jobs/genie.webtools/WTP-R3_8_x_Maintenance/workspace
/jobs/genie.webtools/WTP-R3_8_x_Maintenance/workspace/webtools.releng /jobs/genie.webtools/WTP-R3_8_x_Maintenance/workspace
Previous HEAD position was ebf4c91... Rollback to 3.6.0
Switched to branch 'master'
Your branch is up-to-date with 'origin/master'.
Already up-to-date.
/jobs/genie.webtools/WTP-R3_8_x_Maintenance/workspace
/jobs/genie.webtools/WTP-R3_8_x_Maintenance/workspace/webtools.servertools /jobs/genie.webtools/WTP-R3_8_x_Maintenance/workspace
Previous HEAD position was ad2cd05... [433885] [CBI] org.eclipse.wst.server.ui.tests test failures
Switched to a new branch 'R3_8_maintenance'
Branch R3_8_maintenance set up to track remote branch R3_8_maintenance from origin.
Already up-to-date.
/jobs/genie.webtools/WTP-R3_8_x_Maintenance/workspace
/jobs/genie.webtools/WTP-R3_8_x_Maintenance/workspace/webtools.servertools.docs /jobs/genie.webtools/WTP-R3_8_x_Maintenance/workspace
Switched to a new branch 'R3_8_maintenance'
Branch R3_8_maintenance set up to track remote branch R3_8_maintenance from origin.
Already up-to-date.
/jobs/genie.webtools/WTP-R3_8_x_Maintenance/workspace
/jobs/genie.webtools/WTP-R3_8_x_Maintenance/workspace/webtools.servertools.tests /jobs/genie.webtools/WTP-R3_8_x_Maintenance/workspace
Previous HEAD position was 2d70da7... [442420] org.eclipse.jst.server.core.tests is not completed due to a timeout
Switched to a new branch 'R3_8_maintenance'
Branch R3_8_maintenance set up to track remote branch R3_8_maintenance from origin.
Already up-to-date.
/jobs/genie.webtools/WTP-R3_8_x_Maintenance/workspace
/jobs/genie.webtools/WTP-R3_8_x_Maintenance/workspace/webtools.sourceediting /jobs/genie.webtools/WTP-R3_8_x_Maintenance/workspace
Previous HEAD position was 360e004... [443836] Source Editing Components that require version increase
Switched to a new branch 'R3_8_maintenance'
Branch R3_8_maintenance set up to track remote branch R3_8_maintenance from origin.
Already up-to-date.
/jobs/genie.webtools/WTP-R3_8_x_Maintenance/workspace
/jobs/genie.webtools/WTP-R3_8_x_Maintenance/workspace/webtools.sourceediting.xpath /jobs/genie.webtools/WTP-R3_8_x_Maintenance/workspace
Previous HEAD position was de85043... [443836] Source Editing Components that require version increase
Switched to branch 'master'
Your branch is up-to-date with 'origin/master'.
Already up-to-date.
/jobs/genie.webtools/WTP-R3_8_x_Maintenance/workspace
/jobs/genie.webtools/WTP-R3_8_x_Maintenance/workspace/webtools.sourceediting.xpath.tests /jobs/genie.webtools/WTP-R3_8_x_Maintenance/workspace
Previous HEAD position was 74e7562... [435968] [CBI] Set Eclipse-SourceReferences for sourceediting.xpath
Switched to branch 'master'
Your branch is up-to-date with 'origin/master'.
Already up-to-date.
/jobs/genie.webtools/WTP-R3_8_x_Maintenance/workspace
/jobs/genie.webtools/WTP-R3_8_x_Maintenance/workspace/webtools.sourceediting.xsl /jobs/genie.webtools/WTP-R3_8_x_Maintenance/workspace
Switched to branch 'master'
Your branch is up-to-date with 'origin/master'.
Already up-to-date.
/jobs/genie.webtools/WTP-R3_8_x_Maintenance/workspace
/jobs/genie.webtools/WTP-R3_8_x_Maintenance/workspace/webtools.sourceediting.xsl.tests /jobs/genie.webtools/WTP-R3_8_x_Maintenance/workspace
Switched to branch 'master'
Your branch is up-to-date with 'origin/master'.
Already up-to-date.
/jobs/genie.webtools/WTP-R3_8_x_Maintenance/workspace
/jobs/genie.webtools/WTP-R3_8_x_Maintenance/workspace/webtools.webservices /jobs/genie.webtools/WTP-R3_8_x_Maintenance/workspace
Previous HEAD position was 68a2057... [443846] Version updates needed for WTP 3.6.1
Switched to branch 'master'
Your branch is up-to-date with 'origin/master'.
Already up-to-date.
/jobs/genie.webtools/WTP-R3_8_x_Maintenance/workspace
/jobs/genie.webtools/WTP-R3_8_x_Maintenance/workspace/webtools.webservices.axis2 /jobs/genie.webtools/WTP-R3_8_x_Maintenance/workspace
Previous HEAD position was eeeafe4... [433929] Update the Web Services license features to 1.0.1 for Luna
Switched to branch 'master'
Your branch is up-to-date with 'origin/master'.
Already up-to-date.
/jobs/genie.webtools/WTP-R3_8_x_Maintenance/workspace
/jobs/genie.webtools/WTP-R3_8_x_Maintenance/workspace/webtools.webservices.jaxws /jobs/genie.webtools/WTP-R3_8_x_Maintenance/workspace
Previous HEAD position was 5ea598f... [443846] Version updates needed for WTP 3.6.1
Switched to branch 'master'
Your branch is up-to-date with 'origin/master'.
Already up-to-date.
/jobs/genie.webtools/WTP-R3_8_x_Maintenance/workspace
[INFO] Using Maven 3 installation: Maven 3.2.5
[INFO] Checking Maven 3 installation environment
[workspace] $ /shared/common/apache-maven-3.2.5/bin/mvn --help
[INFO] Checking Maven 3 installation version
[INFO] Detected Maven 3 installation version: 3.2.5
[workspace] $ /shared/common/apache-maven-3.2.5/bin/mvn clean install -V -B -Dmaven.test.skip=true -Dmaven.test.failure.ignore=true -Dmaven.test.error.ignore=true -Dsurefire.timeout=1800 -DskipWithIssues=false -Dmaven.ext.class.path=/home/hudson/genie.webtools/.hudson/maven/slavebundle/resources:/home/hudson/genie.webtools/.hudson/maven/slavebundle/lib/maven3-eventspy-3.1.jar:/home/hudson/genie.webtools/.hudson/war/webapp/WEB-INF/lib/hudson-remoting-3.0.3.jar -Dhudson.eventspy.port=38732 -Dmaven.repo.local=<https://hudson.eclipse.org/webtools/job/WTP-R3_8_x_Maintenance/ws/.maven/repo> -f pom.xml -P bree-libs -P eclipse-sign -ff
[DEBUG] Waiting for connection on port: 38732
[ERROR] Process did not initiate connection and is still alive; killing it
[ERROR] Failure: hudson.AbortException: Process failed to connect; exit code: 143
Terminating xvnc.
ERROR: Process failed to connect; exit code: 143
Archiving artifacts

--
This message is automatically generated by Hudson.
For more information on Hudson, see: http://hudson-ci.org/
_______________________________________________
wtp-releng mailing list
[hidden email]
To change your delivery options, retrieve your password, or unsubscribe from this list, visit
https://dev.eclipse.org/mailman/listinfo/wtp-releng
Reply | Threaded
Open this post in threaded view
|  
Report Content as Inappropriate

[Hudson] Build failed in Hudson: WTP-R3_8_x_Maintenance #170

hudsonbuild
See <https://hudson.eclipse.org/webtools/job/WTP-R3_8_x_Maintenance/170/>

------------------------------------------
[...truncated 822 lines...]
Downloading: https://oss.sonatype.org/content/repositories/public/org/ow2/ow2/1.3/ow2-1.3.pom
Downloading: https://repo.eclipse.org/content/repositories/cbi/org/ow2/ow2/1.3/ow2-1.3.pom
Downloading: https://repo.eclipse.org/content/repositories/tycho-snapshots/org/ow2/ow2/1.3/ow2-1.3.pom
Downloading: https://repo.eclipse.org/content/repositories/maven_central/org/ow2/ow2/1.3/ow2-1.3.pom
Downloaded: https://repo.eclipse.org/content/repositories/maven_central/org/ow2/ow2/1.3/ow2-1.3.pom (10 KB at 343.9 KB/sec)
Downloading: https://oss.sonatype.org/content/repositories/public/org/eclipse/tycho/sisu-equinox-launching/0.21.0/sisu-equinox-launching-0.21.0.jar
Downloading: https://oss.sonatype.org/content/repositories/public/org/apache/commons/commons-exec/1.2/commons-exec-1.2.jar
Downloading: https://oss.sonatype.org/content/repositories/public/org/eclipse/tycho/tycho-artifactcomparator/0.21.0/tycho-artifactcomparator-0.21.0.jar
Downloading: https://oss.sonatype.org/content/repositories/public/org/ow2/asm/asm-debug-all/4.0/asm-debug-all-4.0.jar
Downloaded: https://oss.sonatype.org/content/repositories/public/org/eclipse/tycho/sisu-equinox-launching/0.21.0/sisu-equinox-launching-0.21.0.jar (26 KB at 118.7 KB/sec)
Downloaded: https://oss.sonatype.org/content/repositories/public/org/eclipse/tycho/tycho-artifactcomparator/0.21.0/tycho-artifactcomparator-0.21.0.jar (19 KB at 64.2 KB/sec)
Downloading: https://repo.eclipse.org/content/repositories/cbi/org/apache/commons/commons-exec/1.2/commons-exec-1.2.jar
Downloading: https://repo.eclipse.org/content/repositories/cbi/org/ow2/asm/asm-debug-all/4.0/asm-debug-all-4.0.jar
Downloading: https://repo.eclipse.org/content/repositories/tycho-snapshots/org/apache/commons/commons-exec/1.2/commons-exec-1.2.jar
Downloading: https://repo.eclipse.org/content/repositories/tycho-snapshots/org/ow2/asm/asm-debug-all/4.0/asm-debug-all-4.0.jar
Downloading: https://repo.eclipse.org/content/repositories/maven_central/org/apache/commons/commons-exec/1.2/commons-exec-1.2.jar
Downloading: https://repo.eclipse.org/content/repositories/maven_central/org/ow2/asm/asm-debug-all/4.0/asm-debug-all-4.0.jar
Downloaded: https://repo.eclipse.org/content/repositories/maven_central/org/apache/commons/commons-exec/1.2/commons-exec-1.2.jar (53 KB at 994.0 KB/sec)
Downloaded: https://repo.eclipse.org/content/repositories/maven_central/org/ow2/asm/asm-debug-all/4.0/asm-debug-all-4.0.jar (314 KB at 4070.7 KB/sec)
Downloading: https://oss.sonatype.org/content/repositories/public/org/apache/maven/plugins/maven-clean-plugin/2.5/maven-clean-plugin-2.5.pom
Downloading: https://repo.eclipse.org/content/repositories/cbi/org/apache/maven/plugins/maven-clean-plugin/2.5/maven-clean-plugin-2.5.pom
Downloading: https://repo.eclipse.org/content/repositories/tycho-snapshots/org/apache/maven/plugins/maven-clean-plugin/2.5/maven-clean-plugin-2.5.pom
Downloading: https://repo.eclipse.org/content/repositories/maven_central/org/apache/maven/plugins/maven-clean-plugin/2.5/maven-clean-plugin-2.5.pom
Downloaded: https://repo.eclipse.org/content/repositories/maven_central/org/apache/maven/plugins/maven-clean-plugin/2.5/maven-clean-plugin-2.5.pom (4 KB at 147.2 KB/sec)
Downloading: https://oss.sonatype.org/content/repositories/public/org/apache/maven/plugins/maven-plugins/22/maven-plugins-22.pom
Downloading: https://repo.eclipse.org/content/repositories/cbi/org/apache/maven/plugins/maven-plugins/22/maven-plugins-22.pom
Downloading: https://repo.eclipse.org/content/repositories/tycho-snapshots/org/apache/maven/plugins/maven-plugins/22/maven-plugins-22.pom
Downloading: https://repo.eclipse.org/content/repositories/maven_central/org/apache/maven/plugins/maven-plugins/22/maven-plugins-22.pom
Downloaded: https://repo.eclipse.org/content/repositories/maven_central/org/apache/maven/plugins/maven-plugins/22/maven-plugins-22.pom (13 KB at 424.4 KB/sec)
Downloading: https://oss.sonatype.org/content/repositories/public/org/apache/maven/plugins/maven-clean-plugin/2.5/maven-clean-plugin-2.5.jar
Downloading: https://repo.eclipse.org/content/repositories/cbi/org/apache/maven/plugins/maven-clean-plugin/2.5/maven-clean-plugin-2.5.jar
Downloading: https://repo.eclipse.org/content/repositories/tycho-snapshots/org/apache/maven/plugins/maven-clean-plugin/2.5/maven-clean-plugin-2.5.jar
Downloading: https://repo.eclipse.org/content/repositories/maven_central/org/apache/maven/plugins/maven-clean-plugin/2.5/maven-clean-plugin-2.5.jar
Downloaded: https://repo.eclipse.org/content/repositories/maven_central/org/apache/maven/plugins/maven-clean-plugin/2.5/maven-clean-plugin-2.5.jar (25 KB at 962.2 KB/sec)
Downloading: https://oss.sonatype.org/content/repositories/public/org/apache/maven/plugins/maven-resources-plugin/2.4.3/maven-resources-plugin-2.4.3.pom
Downloading: https://repo.eclipse.org/content/repositories/cbi/org/apache/maven/plugins/maven-resources-plugin/2.4.3/maven-resources-plugin-2.4.3.pom
Downloading: https://repo.eclipse.org/content/repositories/tycho-snapshots/org/apache/maven/plugins/maven-resources-plugin/2.4.3/maven-resources-plugin-2.4.3.pom
Downloading: https://repo.eclipse.org/content/repositories/maven_central/org/apache/maven/plugins/maven-resources-plugin/2.4.3/maven-resources-plugin-2.4.3.pom
Downloaded: https://repo.eclipse.org/content/repositories/maven_central/org/apache/maven/plugins/maven-resources-plugin/2.4.3/maven-resources-plugin-2.4.3.pom (6 KB at 138.4 KB/sec)
Downloading: https://oss.sonatype.org/content/repositories/public/org/apache/maven/plugins/maven-plugins/18/maven-plugins-18.pom
Downloading: https://repo.eclipse.org/content/repositories/cbi/org/apache/maven/plugins/maven-plugins/18/maven-plugins-18.pom
Downloading: https://repo.eclipse.org/content/repositories/tycho-snapshots/org/apache/maven/plugins/maven-plugins/18/maven-plugins-18.pom
Downloading: https://repo.eclipse.org/content/repositories/maven_central/org/apache/maven/plugins/maven-plugins/18/maven-plugins-18.pom
Downloaded: https://repo.eclipse.org/content/repositories/maven_central/org/apache/maven/plugins/maven-plugins/18/maven-plugins-18.pom (13 KB at 362.8 KB/sec)
Downloading: https://oss.sonatype.org/content/repositories/public/org/apache/maven/maven-parent/16/maven-parent-16.pom
Downloading: https://repo.eclipse.org/content/repositories/cbi/org/apache/maven/maven-parent/16/maven-parent-16.pom
Downloading: https://repo.eclipse.org/content/repositories/tycho-snapshots/org/apache/maven/maven-parent/16/maven-parent-16.pom
Downloading: https://repo.eclipse.org/content/repositories/maven_central/org/apache/maven/maven-parent/16/maven-parent-16.pom
Downloaded: https://repo.eclipse.org/content/repositories/maven_central/org/apache/maven/maven-parent/16/maven-parent-16.pom (23 KB at 811.7 KB/sec)
Downloading: https://oss.sonatype.org/content/repositories/public/org/apache/apache/7/apache-7.pom
Downloading: https://repo.eclipse.org/content/repositories/cbi/org/apache/apache/7/apache-7.pom
Downloading: https://repo.eclipse.org/content/repositories/tycho-snapshots/org/apache/apache/7/apache-7.pom
Downloading: https://repo.eclipse.org/content/repositories/maven_central/org/apache/apache/7/apache-7.pom
Downloaded: https://repo.eclipse.org/content/repositories/maven_central/org/apache/apache/7/apache-7.pom (15 KB at 454.6 KB/sec)
Downloading: https://oss.sonatype.org/content/repositories/public/org/apache/maven/plugins/maven-resources-plugin/2.4.3/maven-resources-plugin-2.4.3.jar
Downloading: https://repo.eclipse.org/content/repositories/cbi/org/apache/maven/plugins/maven-resources-plugin/2.4.3/maven-resources-plugin-2.4.3.jar
Downloading: https://repo.eclipse.org/content/repositories/tycho-snapshots/org/apache/maven/plugins/maven-resources-plugin/2.4.3/maven-resources-plugin-2.4.3.jar
Downloading: https://repo.eclipse.org/content/repositories/maven_central/org/apache/maven/plugins/maven-resources-plugin/2.4.3/maven-resources-plugin-2.4.3.jar
Downloaded: https://repo.eclipse.org/content/repositories/maven_central/org/apache/maven/plugins/maven-resources-plugin/2.4.3/maven-resources-plugin-2.4.3.jar (24 KB at 795.1 KB/sec)
Downloading: https://oss.sonatype.org/content/repositories/public/org/eclipse/tycho/tycho-compiler-plugin/0.21.0/tycho-compiler-plugin-0.21.0.pom
Downloaded: https://oss.sonatype.org/content/repositories/public/org/eclipse/tycho/tycho-compiler-plugin/0.21.0/tycho-compiler-plugin-0.21.0.pom (3 KB at 10.3 KB/sec)
Downloading: https://oss.sonatype.org/content/repositories/public/org/eclipse/tycho/tycho-compiler-plugin/0.21.0/tycho-compiler-plugin-0.21.0.jar
Downloaded: https://oss.sonatype.org/content/repositories/public/org/eclipse/tycho/tycho-compiler-plugin/0.21.0/tycho-compiler-plugin-0.21.0.jar (31 KB at 160.0 KB/sec)
Downloading: https://oss.sonatype.org/content/repositories/public/org/apache/maven/plugins/maven-install-plugin/2.3.1/maven-install-plugin-2.3.1.pom
Downloading: https://repo.eclipse.org/content/repositories/cbi/org/apache/maven/plugins/maven-install-plugin/2.3.1/maven-install-plugin-2.3.1.pom
Downloading: https://repo.eclipse.org/content/repositories/tycho-snapshots/org/apache/maven/plugins/maven-install-plugin/2.3.1/maven-install-plugin-2.3.1.pom
Downloading: https://repo.eclipse.org/content/repositories/maven_central/org/apache/maven/plugins/maven-install-plugin/2.3.1/maven-install-plugin-2.3.1.pom
Downloaded: https://repo.eclipse.org/content/repositories/maven_central/org/apache/maven/plugins/maven-install-plugin/2.3.1/maven-install-plugin-2.3.1.pom (5 KB at 108.4 KB/sec)
Downloading: https://oss.sonatype.org/content/repositories/public/org/apache/maven/plugins/maven-install-plugin/2.3.1/maven-install-plugin-2.3.1.jar
Downloading: https://repo.eclipse.org/content/repositories/cbi/org/apache/maven/plugins/maven-install-plugin/2.3.1/maven-install-plugin-2.3.1.jar
Downloading: https://repo.eclipse.org/content/repositories/tycho-snapshots/org/apache/maven/plugins/maven-install-plugin/2.3.1/maven-install-plugin-2.3.1.jar
Downloading: https://repo.eclipse.org/content/repositories/maven_central/org/apache/maven/plugins/maven-install-plugin/2.3.1/maven-install-plugin-2.3.1.jar
Downloaded: https://repo.eclipse.org/content/repositories/maven_central/org/apache/maven/plugins/maven-install-plugin/2.3.1/maven-install-plugin-2.3.1.jar (23 KB at 673.5 KB/sec)
Downloading: https://oss.sonatype.org/content/repositories/public/org/apache/maven/plugins/maven-deploy-plugin/2.5/maven-deploy-plugin-2.5.pom
Downloading: https://repo.eclipse.org/content/repositories/cbi/org/apache/maven/plugins/maven-deploy-plugin/2.5/maven-deploy-plugin-2.5.pom
Downloading: https://repo.eclipse.org/content/repositories/tycho-snapshots/org/apache/maven/plugins/maven-deploy-plugin/2.5/maven-deploy-plugin-2.5.pom
Downloading: https://repo.eclipse.org/content/repositories/maven_central/org/apache/maven/plugins/maven-deploy-plugin/2.5/maven-deploy-plugin-2.5.pom
Downloaded: https://repo.eclipse.org/content/repositories/maven_central/org/apache/maven/plugins/maven-deploy-plugin/2.5/maven-deploy-plugin-2.5.pom (6 KB at 206.4 KB/sec)
Downloading: https://oss.sonatype.org/content/repositories/public/org/apache/maven/plugins/maven-plugins/16/maven-plugins-16.pom
Downloading: https://repo.eclipse.org/content/repositories/cbi/org/apache/maven/plugins/maven-plugins/16/maven-plugins-16.pom
Downloading: https://repo.eclipse.org/content/repositories/tycho-snapshots/org/apache/maven/plugins/maven-plugins/16/maven-plugins-16.pom
Downloading: https://repo.eclipse.org/content/repositories/maven_central/org/apache/maven/plugins/maven-plugins/16/maven-plugins-16.pom
Downloaded: https://repo.eclipse.org/content/repositories/maven_central/org/apache/maven/plugins/maven-plugins/16/maven-plugins-16.pom (13 KB at 486.4 KB/sec)
Downloading: https://oss.sonatype.org/content/repositories/public/org/apache/maven/plugins/maven-deploy-plugin/2.5/maven-deploy-plugin-2.5.jar
Downloading: https://repo.eclipse.org/content/repositories/cbi/org/apache/maven/plugins/maven-deploy-plugin/2.5/maven-deploy-plugin-2.5.jar
Downloading: https://repo.eclipse.org/content/repositories/tycho-snapshots/org/apache/maven/plugins/maven-deploy-plugin/2.5/maven-deploy-plugin-2.5.jar
Downloading: https://repo.eclipse.org/content/repositories/maven_central/org/apache/maven/plugins/maven-deploy-plugin/2.5/maven-deploy-plugin-2.5.jar
Downloaded: https://repo.eclipse.org/content/repositories/maven_central/org/apache/maven/plugins/maven-deploy-plugin/2.5/maven-deploy-plugin-2.5.jar (23 KB at 704.7 KB/sec)
Downloading: https://oss.sonatype.org/content/repositories/public/org/apache/maven/plugins/maven-site-plugin/3.3/maven-site-plugin-3.3.pom
Downloading: https://repo.eclipse.org/content/repositories/cbi/org/apache/maven/plugins/maven-site-plugin/3.3/maven-site-plugin-3.3.pom
Downloading: https://repo.eclipse.org/content/repositories/tycho-snapshots/org/apache/maven/plugins/maven-site-plugin/3.3/maven-site-plugin-3.3.pom
Downloading: https://repo.eclipse.org/content/repositories/maven_central/org/apache/maven/plugins/maven-site-plugin/3.3/maven-site-plugin-3.3.pom
Downloaded: https://repo.eclipse.org/content/repositories/maven_central/org/apache/maven/plugins/maven-site-plugin/3.3/maven-site-plugin-3.3.pom (21 KB at 655.7 KB/sec)
Downloading: https://oss.sonatype.org/content/repositories/public/org/apache/maven/plugins/maven-plugins/24/maven-plugins-24.pom
Downloading: https://repo.eclipse.org/content/repositories/cbi/org/apache/maven/plugins/maven-plugins/24/maven-plugins-24.pom
Downloading: https://repo.eclipse.org/content/repositories/tycho-snapshots/org/apache/maven/plugins/maven-plugins/24/maven-plugins-24.pom
Downloading: https://repo.eclipse.org/content/repositories/maven_central/org/apache/maven/plugins/maven-plugins/24/maven-plugins-24.pom
Downloaded: https://repo.eclipse.org/content/repositories/maven_central/org/apache/maven/plugins/maven-plugins/24/maven-plugins-24.pom (11 KB at 270.6 KB/sec)
Downloading: https://oss.sonatype.org/content/repositories/public/org/apache/maven/maven-parent/23/maven-parent-23.pom
Downloading: https://repo.eclipse.org/content/repositories/cbi/org/apache/maven/maven-parent/23/maven-parent-23.pom
Downloading: https://repo.eclipse.org/content/repositories/tycho-snapshots/org/apache/maven/maven-parent/23/maven-parent-23.pom
Downloading: https://repo.eclipse.org/content/repositories/maven_central/org/apache/maven/maven-parent/23/maven-parent-23.pom
Downloaded: https://repo.eclipse.org/content/repositories/maven_central/org/apache/maven/maven-parent/23/maven-parent-23.pom (32 KB at 964.3 KB/sec)
Downloading: https://oss.sonatype.org/content/repositories/public/org/apache/maven/plugins/maven-site-plugin/3.3/maven-site-plugin-3.3.jar
Downloading: https://repo.eclipse.org/content/repositories/cbi/org/apache/maven/plugins/maven-site-plugin/3.3/maven-site-plugin-3.3.jar
Downloading: https://repo.eclipse.org/content/repositories/tycho-snapshots/org/apache/maven/plugins/maven-site-plugin/3.3/maven-site-plugin-3.3.jar
Downloading: https://repo.eclipse.org/content/repositories/maven_central/org/apache/maven/plugins/maven-site-plugin/3.3/maven-site-plugin-3.3.jar
Downloaded: https://repo.eclipse.org/content/repositories/maven_central/org/apache/maven/plugins/maven-site-plugin/3.3/maven-site-plugin-3.3.jar (122 KB at 388.0 KB/sec)
Downloading: https://oss.sonatype.org/content/repositories/public/org/eclipse/tycho/tycho-p2-repository-plugin/0.21.0/tycho-p2-repository-plugin-0.21.0.pom
Downloaded: https://oss.sonatype.org/content/repositories/public/org/eclipse/tycho/tycho-p2-repository-plugin/0.21.0/tycho-p2-repository-plugin-0.21.0.pom (2 KB at 6.4 KB/sec)
Downloading: https://oss.sonatype.org/content/repositories/public/org/eclipse/tycho/tycho-p2-repository-plugin/0.21.0/tycho-p2-repository-plugin-0.21.0.jar
Downloaded: https://oss.sonatype.org/content/repositories/public/org/eclipse/tycho/tycho-p2-repository-plugin/0.21.0/tycho-p2-repository-plugin-0.21.0.jar (13 KB at 108.1 KB/sec)
Downloading: https://oss.sonatype.org/content/repositories/public/org/eclipse/tycho/tycho-p2-publisher-plugin/0.21.0/tycho-p2-publisher-plugin-0.21.0.pom
Downloaded: https://oss.sonatype.org/content/repositories/public/org/eclipse/tycho/tycho-p2-publisher-plugin/0.21.0/tycho-p2-publisher-plugin-0.21.0.pom (2 KB at 2.7 KB/sec)
Downloading: https://oss.sonatype.org/content/repositories/public/org/eclipse/tycho/tycho-p2-publisher-plugin/0.21.0/tycho-p2-publisher-plugin-0.21.0.jar
Downloaded: https://oss.sonatype.org/content/repositories/public/org/eclipse/tycho/tycho-p2-publisher-plugin/0.21.0/tycho-p2-publisher-plugin-0.21.0.jar (23 KB at 151.1 KB/sec)
Downloading: https://oss.sonatype.org/content/repositories/public/org/eclipse/tycho/extras/tycho-p2-extras-plugin/0.21.0/tycho-p2-extras-plugin-0.21.0.pom
Downloaded: https://oss.sonatype.org/content/repositories/public/org/eclipse/tycho/extras/tycho-p2-extras-plugin/0.21.0/tycho-p2-extras-plugin-0.21.0.pom (5 KB at 2.0 KB/sec)
Downloading: https://oss.sonatype.org/content/repositories/public/org/eclipse/tycho/extras/tycho-p2-extras-plugin/0.21.0/tycho-p2-extras-plugin-0.21.0.jar
Downloaded: https://oss.sonatype.org/content/repositories/public/org/eclipse/tycho/extras/tycho-p2-extras-plugin/0.21.0/tycho-p2-extras-plugin-0.21.0.jar (19 KB at 72.7 KB/sec)
Downloading: https://oss.sonatype.org/content/repositories/public/org/codehaus/plexus/plexus-utils/2.0.4/plexus-utils-2.0.4.pom
Downloading: https://repo.eclipse.org/content/repositories/cbi/org/codehaus/plexus/plexus-utils/2.0.4/plexus-utils-2.0.4.pom
Downloading: https://repo.eclipse.org/content/repositories/tycho-snapshots/org/codehaus/plexus/plexus-utils/2.0.4/plexus-utils-2.0.4.pom
Downloading: https://repo.eclipse.org/content/repositories/maven_central/org/codehaus/plexus/plexus-utils/2.0.4/plexus-utils-2.0.4.pom
Downloaded: https://repo.eclipse.org/content/repositories/maven_central/org/codehaus/plexus/plexus-utils/2.0.4/plexus-utils-2.0.4.pom (4 KB at 93.0 KB/sec)
Downloading: https://oss.sonatype.org/content/repositories/public/org/codehaus/plexus/plexus-utils/1.5.5/plexus-utils-1.5.5.pom
Downloading: https://repo.eclipse.org/content/repositories/cbi/org/codehaus/plexus/plexus-utils/1.5.5/plexus-utils-1.5.5.pom
Downloading: https://repo.eclipse.org/content/repositories/tycho-snapshots/org/codehaus/plexus/plexus-utils/1.5.5/plexus-utils-1.5.5.pom
Downloading: https://repo.eclipse.org/content/repositories/maven_central/org/codehaus/plexus/plexus-utils/1.5.5/plexus-utils-1.5.5.pom
Downloaded: https://repo.eclipse.org/content/repositories/maven_central/org/codehaus/plexus/plexus-utils/1.5.5/plexus-utils-1.5.5.pom (6 KB at 139.6 KB/sec)
Downloading: https://oss.sonatype.org/content/repositories/public/org/codehaus/plexus/plexus/1.0.11/plexus-1.0.11.pom
Downloading: https://repo.eclipse.org/content/repositories/cbi/org/codehaus/plexus/plexus/1.0.11/plexus-1.0.11.pom
Downloading: https://repo.eclipse.org/content/repositories/tycho-snapshots/org/codehaus/plexus/plexus/1.0.11/plexus-1.0.11.pom
Downloading: https://repo.eclipse.org/content/repositories/maven_central/org/codehaus/plexus/plexus/1.0.11/plexus-1.0.11.pom
Downloaded: https://repo.eclipse.org/content/repositories/maven_central/org/codehaus/plexus/plexus/1.0.11/plexus-1.0.11.pom (9 KB at 230.5 KB/sec)
Downloading: https://oss.sonatype.org/content/repositories/public/org/sonatype/plexus/plexus-cipher/1.4/plexus-cipher-1.4.pom
Downloading: https://repo.eclipse.org/content/repositories/cbi/org/sonatype/plexus/plexus-cipher/1.4/plexus-cipher-1.4.pom
Downloading: https://repo.eclipse.org/content/repositories/tycho-snapshots/org/sonatype/plexus/plexus-cipher/1.4/plexus-cipher-1.4.pom
Downloading: https://repo.eclipse.org/content/repositories/maven_central/org/sonatype/plexus/plexus-cipher/1.4/plexus-cipher-1.4.pom
Downloaded: https://repo.eclipse.org/content/repositories/maven_central/org/sonatype/plexus/plexus-cipher/1.4/plexus-cipher-1.4.pom (3 KB at 57.6 KB/sec)
Downloading: https://oss.sonatype.org/content/repositories/public/org/codehaus/plexus/plexus-component-annotations/1.5.4/plexus-component-annotations-1.5.4.pom
Downloading: https://repo.eclipse.org/content/repositories/cbi/org/codehaus/plexus/plexus-component-annotations/1.5.4/plexus-component-annotations-1.5.4.pom
Downloading: https://repo.eclipse.org/content/repositories/tycho-snapshots/org/codehaus/plexus/plexus-component-annotations/1.5.4/plexus-component-annotations-1.5.4.pom
Downloading: https://repo.eclipse.org/content/repositories/maven_central/org/codehaus/plexus/plexus-component-annotations/1.5.4/plexus-component-annotations-1.5.4.pom
Downloaded: https://repo.eclipse.org/content/repositories/maven_central/org/codehaus/plexus/plexus-component-annotations/1.5.4/plexus-component-annotations-1.5.4.pom (815 B at 29.5 KB/sec)
Downloading: https://oss.sonatype.org/content/repositories/public/org/codehaus/plexus/plexus-containers/1.5.4/plexus-containers-1.5.4.pom
Downloading: https://repo.eclipse.org/content/repositories/cbi/org/codehaus/plexus/plexus-containers/1.5.4/plexus-containers-1.5.4.pom
Downloading: https://repo.eclipse.org/content/repositories/tycho-snapshots/org/codehaus/plexus/plexus-containers/1.5.4/plexus-containers-1.5.4.pom
Downloading: https://repo.eclipse.org/content/repositories/maven_central/org/codehaus/plexus/plexus-containers/1.5.4/plexus-containers-1.5.4.pom
Downloaded: https://repo.eclipse.org/content/repositories/maven_central/org/codehaus/plexus/plexus-containers/1.5.4/plexus-containers-1.5.4.pom (5 KB at 111.9 KB/sec)
Downloading: https://oss.sonatype.org/content/repositories/public/org/codehaus/plexus/plexus/2.0.5/plexus-2.0.5.pom
Downloading: https://repo.eclipse.org/content/repositories/cbi/org/codehaus/plexus/plexus/2.0.5/plexus-2.0.5.pom
Downloading: https://repo.eclipse.org/content/repositories/tycho-snapshots/org/codehaus/plexus/plexus/2.0.5/plexus-2.0.5.pom
Downloading: https://repo.eclipse.org/content/repositories/maven_central/org/codehaus/plexus/plexus/2.0.5/plexus-2.0.5.pom
Downloaded: https://repo.eclipse.org/content/repositories/maven_central/org/codehaus/plexus/plexus/2.0.5/plexus-2.0.5.pom (17 KB at 651.6 KB/sec)
Downloading: https://oss.sonatype.org/content/repositories/public/org/codehaus/plexus/plexus-utils/2.0.5/plexus-utils-2.0.5.pom
Downloading: https://repo.eclipse.org/content/repositories/cbi/org/codehaus/plexus/plexus-utils/2.0.5/plexus-utils-2.0.5.pom
Downloading: https://repo.eclipse.org/content/repositories/tycho-snapshots/org/codehaus/plexus/plexus-utils/2.0.5/plexus-utils-2.0.5.pom
Downloading: https://repo.eclipse.org/content/repositories/maven_central/org/codehaus/plexus/plexus-utils/2.0.5/plexus-utils-2.0.5.pom
Downloaded: https://repo.eclipse.org/content/repositories/maven_central/org/codehaus/plexus/plexus-utils/2.0.5/plexus-utils-2.0.5.pom (4 KB at 75.7 KB/sec)
Downloading: https://oss.sonatype.org/content/repositories/public/org/codehaus/plexus/plexus-io/2.0.4/plexus-io-2.0.4.pom
Downloading: https://repo.eclipse.org/content/repositories/cbi/org/codehaus/plexus/plexus-io/2.0.4/plexus-io-2.0.4.pom
Downloading: https://repo.eclipse.org/content/repositories/tycho-snapshots/org/codehaus/plexus/plexus-io/2.0.4/plexus-io-2.0.4.pom
Downloading: https://repo.eclipse.org/content/repositories/maven_central/org/codehaus/plexus/plexus-io/2.0.4/plexus-io-2.0.4.pom
Downloaded: https://repo.eclipse.org/content/repositories/maven_central/org/codehaus/plexus/plexus-io/2.0.4/plexus-io-2.0.4.pom (2 KB at 47.0 KB/sec)
Downloading: https://oss.sonatype.org/content/repositories/public/org/codehaus/plexus/plexus-components/1.1.19/plexus-components-1.1.19.pom
Downloading: https://repo.eclipse.org/content/repositories/cbi/org/codehaus/plexus/plexus-components/1.1.19/plexus-components-1.1.19.pom
Downloading: https://repo.eclipse.org/content/repositories/tycho-snapshots/org/codehaus/plexus/plexus-components/1.1.19/plexus-components-1.1.19.pom
Downloading: https://repo.eclipse.org/content/repositories/maven_central/org/codehaus/plexus/plexus-components/1.1.19/plexus-components-1.1.19.pom
Downloaded: https://repo.eclipse.org/content/repositories/maven_central/org/codehaus/plexus/plexus-components/1.1.19/plexus-components-1.1.19.pom (3 KB at 94.1 KB/sec)
Downloading: https://oss.sonatype.org/content/repositories/public/org/codehaus/plexus/plexus-utils/3.0/plexus-utils-3.0.pom
Downloading: https://repo.eclipse.org/content/repositories/cbi/org/codehaus/plexus/plexus-utils/3.0/plexus-utils-3.0.pom
Downloading: https://repo.eclipse.org/content/repositories/tycho-snapshots/org/codehaus/plexus/plexus-utils/3.0/plexus-utils-3.0.pom
Downloading: https://repo.eclipse.org/content/repositories/maven_central/org/codehaus/plexus/plexus-utils/3.0/plexus-utils-3.0.pom
Downloaded: https://repo.eclipse.org/content/repositories/maven_central/org/codehaus/plexus/plexus-utils/3.0/plexus-utils-3.0.pom (4 KB at 124.1 KB/sec)
Downloading: https://oss.sonatype.org/content/repositories/public/org/sonatype/spice/spice-parent/16/spice-parent-16.pom
Downloading: https://repo.eclipse.org/content/repositories/cbi/org/sonatype/spice/spice-parent/16/spice-parent-16.pom
Downloading: https://repo.eclipse.org/content/repositories/tycho-snapshots/org/sonatype/spice/spice-parent/16/spice-parent-16.pom
Downloading: https://repo.eclipse.org/content/repositories/maven_central/org/sonatype/spice/spice-parent/16/spice-parent-16.pom
Downloaded: https://repo.eclipse.org/content/repositories/maven_central/org/sonatype/spice/spice-parent/16/spice-parent-16.pom (9 KB at 189.8 KB/sec)
Downloading: https://oss.sonatype.org/content/repositories/public/org/sonatype/plexus/plexus-cipher/1.4/plexus-cipher-1.4.jar
Downloading: https://oss.sonatype.org/content/repositories/public/org/codehaus/plexus/plexus-io/2.0.4/plexus-io-2.0.4.jar
Downloading: https://repo.eclipse.org/content/repositories/cbi/org/sonatype/plexus/plexus-cipher/1.4/plexus-cipher-1.4.jar
Downloading: https://repo.eclipse.org/content/repositories/cbi/org/codehaus/plexus/plexus-io/2.0.4/plexus-io-2.0.4.jar
Downloading: https://repo.eclipse.org/content/repositories/tycho-snapshots/org/sonatype/plexus/plexus-cipher/1.4/plexus-cipher-1.4.jar
Downloading: https://repo.eclipse.org/content/repositories/tycho-snapshots/org/codehaus/plexus/plexus-io/2.0.4/plexus-io-2.0.4.jar
Downloading: https://repo.eclipse.org/content/repositories/maven_central/org/sonatype/plexus/plexus-cipher/1.4/plexus-cipher-1.4.jar
Downloading: https://repo.eclipse.org/content/repositories/maven_central/org/codehaus/plexus/plexus-io/2.0.4/plexus-io-2.0.4.jar
Downloaded: https://repo.eclipse.org/content/repositories/maven_central/org/codehaus/plexus/plexus-io/2.0.4/plexus-io-2.0.4.jar (57 KB at 2107.9 KB/sec)
[INFO] o.h.m.e.h.MavenExecutionResultHandler - Build failed with exception(s)
[INFO] o.h.m.e.h.MavenExecutionResultHandler - [1] org.apache.maven.InternalErrorException: Internal error: java.lang.RuntimeException: org.apache.maven.MavenExecutionException: Could not setup plugin ClassRealm
[DEBUG] Closing connection to remote
[ERROR] Internal error: java.lang.RuntimeException: org.apache.maven.MavenExecutionException: Could not setup plugin ClassRealm: Plugin org.eclipse.tycho.extras:tycho-p2-extras-plugin:0.21.0 or one of its dependencies could not be resolved: Could not find artifact org.sonatype.plexus:plexus-cipher:jar:1.4 in tycho (https://oss.sonatype.org/content/repositories/public/) -> [Help 1]
org.apache.maven.InternalErrorException: Internal error: java.lang.RuntimeException: org.apache.maven.MavenExecutionException: Could not setup plugin ClassRealm
        at org.apache.maven.DefaultMaven.execute(DefaultMaven.java:167)
        at org.apache.maven.cli.MavenCli.execute(MavenCli.java:584)
        at org.apache.maven.cli.MavenCli.doMain(MavenCli.java:216)
        at org.apache.maven.cli.MavenCli.main(MavenCli.java:160)
        at sun.reflect.NativeMethodAccessorImpl.invoke0(Native Method)
        at sun.reflect.NativeMethodAccessorImpl.invoke(NativeMethodAccessorImpl.java:62)
        at sun.reflect.DelegatingMethodAccessorImpl.invoke(DelegatingMethodAccessorImpl.java:43)
        at java.lang.reflect.Method.invoke(Method.java:498)
        at org.codehaus.plexus.classworlds.launcher.Launcher.launchEnhanced(Launcher.java:289)
        at org.codehaus.plexus.classworlds.launcher.Launcher.launch(Launcher.java:229)
        at org.codehaus.plexus.classworlds.launcher.Launcher.mainWithExitCode(Launcher.java:415)
        at org.codehaus.plexus.classworlds.launcher.Launcher.main(Launcher.java:356)
Caused by: java.lang.RuntimeException: org.apache.maven.MavenExecutionException: Could not setup plugin ClassRealm
        at org.eclipse.tycho.p2.resolver.P2DependencyResolver.getDependencyMetadata(P2DependencyResolver.java:168)
        at org.eclipse.tycho.p2.resolver.P2DependencyResolver.setupProjects(P2DependencyResolver.java:126)
        at org.eclipse.tycho.core.resolver.DefaultTychoResolver.setupProject(DefaultTychoResolver.java:87)
        at org.eclipse.tycho.core.maven.TychoMavenLifecycleParticipant.afterProjectsRead(TychoMavenLifecycleParticipant.java:70)
        at org.apache.maven.DefaultMaven.doExecute(DefaultMaven.java:318)
        at org.apache.maven.DefaultMaven.execute(DefaultMaven.java:155)
        ... 11 more
Caused by: org.apache.maven.MavenExecutionException: Could not setup plugin ClassRealm
        at org.eclipse.tycho.core.maven.utils.PluginRealmHelper.newMavenExecutionException(PluginRealmHelper.java:143)
        at org.eclipse.tycho.core.maven.utils.PluginRealmHelper.execute(PluginRealmHelper.java:130)
        at org.eclipse.tycho.p2.resolver.P2DependencyResolver.getDependencyMetadata(P2DependencyResolver.java:148)
        ... 16 more
Caused by: org.apache.maven.plugin.PluginResolutionException: Plugin org.eclipse.tycho.extras:tycho-p2-extras-plugin:0.21.0 or one of its dependencies could not be resolved: Could not find artifact org.sonatype.plexus:plexus-cipher:jar:1.4 in tycho (https://oss.sonatype.org/content/repositories/public/)
        at org.apache.maven.plugin.internal.DefaultPluginDependenciesResolver.resolve(DefaultPluginDependenciesResolver.java:208)
        at org.apache.maven.plugin.internal.DefaultMavenPluginManager.createPluginRealm(DefaultMavenPluginManager.java:361)
        at org.apache.maven.plugin.internal.DefaultMavenPluginManager.setupPluginRealm(DefaultMavenPluginManager.java:329)
        at org.apache.maven.plugin.DefaultBuildPluginManager.getPluginRealm(DefaultBuildPluginManager.java:229)
        at org.eclipse.tycho.core.maven.utils.PluginRealmHelper.execute(PluginRealmHelper.java:112)
        ... 17 more
Caused by: org.eclipse.aether.resolution.ArtifactResolutionException: Could not find artifact org.sonatype.plexus:plexus-cipher:jar:1.4 in tycho (https://oss.sonatype.org/content/repositories/public/)
        at org.eclipse.aether.internal.impl.DefaultArtifactResolver.resolve(DefaultArtifactResolver.java:444)
        at org.eclipse.aether.internal.impl.DefaultArtifactResolver.resolveArtifacts(DefaultArtifactResolver.java:246)
        at org.eclipse.aether.internal.impl.DefaultRepositorySystem.resolveDependencies(DefaultRepositorySystem.java:367)
        at org.apache.maven.plugin.internal.DefaultPluginDependenciesResolver.resolve(DefaultPluginDependenciesResolver.java:200)
        ... 21 more
Caused by: org.eclipse.aether.transfer.ArtifactNotFoundException: Could not find artifact org.sonatype.plexus:plexus-cipher:jar:1.4 in tycho (https://oss.sonatype.org/content/repositories/public/)
        at org.eclipse.aether.connector.basic.ArtifactTransportListener.transferFailed(ArtifactTransportListener.java:39)
        at org.eclipse.aether.connector.basic.BasicRepositoryConnector$TaskRunner.run(BasicRepositoryConnector.java:355)
        at org.eclipse.aether.util.concurrency.RunnableErrorForwarder$1.run(RunnableErrorForwarder.java:67)
        at java.util.concurrent.ThreadPoolExecutor.runWorker(ThreadPoolExecutor.java:1142)
        at java.util.concurrent.ThreadPoolExecutor$Worker.run(ThreadPoolExecutor.java:617)
        at java.lang.Thread.run(Thread.java:745)
[ERROR]
[ERROR] To see the full stack trace of the errors, re-run Maven with the -e switch.
[ERROR] Re-run Maven using the -X switch to enable full debug logging.
[ERROR]
[ERROR] For more information about the errors and possible solutions, please read the following articles:
[ERROR] [Help 1] http://cwiki.apache.org/confluence/display/MAVEN/InternalErrorException
[DEBUG] Waiting for process to finish
[DEBUG] Result: 1
Terminating xvnc.
Archiving artifacts

--
This message is automatically generated by Hudson.
For more information on Hudson, see: http://hudson-ci.org/
_______________________________________________
wtp-releng mailing list
[hidden email]
To change your delivery options, retrieve your password, or unsubscribe from this list, visit
https://dev.eclipse.org/mailman/listinfo/wtp-releng
Reply | Threaded
Open this post in threaded view
|  
Report Content as Inappropriate

[Hudson] Build failed in Hudson: WTP-R3_8_x_Maintenance #171

hudsonbuild
See <https://hudson.eclipse.org/webtools/job/WTP-R3_8_x_Maintenance/171/>

------------------------------------------
[...truncated 822 lines...]
Downloading: https://oss.sonatype.org/content/repositories/public/org/ow2/ow2/1.3/ow2-1.3.pom
Downloading: https://repo.eclipse.org/content/repositories/cbi/org/ow2/ow2/1.3/ow2-1.3.pom
Downloading: https://repo.eclipse.org/content/repositories/tycho-snapshots/org/ow2/ow2/1.3/ow2-1.3.pom
Downloading: https://repo.eclipse.org/content/repositories/maven_central/org/ow2/ow2/1.3/ow2-1.3.pom
Downloaded: https://repo.eclipse.org/content/repositories/maven_central/org/ow2/ow2/1.3/ow2-1.3.pom (10 KB at 343.9 KB/sec)
Downloading: https://oss.sonatype.org/content/repositories/public/org/eclipse/tycho/sisu-equinox-launching/0.21.0/sisu-equinox-launching-0.21.0.jar
Downloading: https://oss.sonatype.org/content/repositories/public/org/apache/commons/commons-exec/1.2/commons-exec-1.2.jar
Downloading: https://oss.sonatype.org/content/repositories/public/org/eclipse/tycho/tycho-artifactcomparator/0.21.0/tycho-artifactcomparator-0.21.0.jar
Downloading: https://oss.sonatype.org/content/repositories/public/org/ow2/asm/asm-debug-all/4.0/asm-debug-all-4.0.jar
Downloaded: https://oss.sonatype.org/content/repositories/public/org/eclipse/tycho/tycho-artifactcomparator/0.21.0/tycho-artifactcomparator-0.21.0.jar (19 KB at 64.2 KB/sec)
Downloaded: https://oss.sonatype.org/content/repositories/public/org/eclipse/tycho/sisu-equinox-launching/0.21.0/sisu-equinox-launching-0.21.0.jar (26 KB at 89.9 KB/sec)
Downloading: https://repo.eclipse.org/content/repositories/cbi/org/apache/commons/commons-exec/1.2/commons-exec-1.2.jar
Downloading: https://repo.eclipse.org/content/repositories/cbi/org/ow2/asm/asm-debug-all/4.0/asm-debug-all-4.0.jar
Downloading: https://repo.eclipse.org/content/repositories/tycho-snapshots/org/apache/commons/commons-exec/1.2/commons-exec-1.2.jar
Downloading: https://repo.eclipse.org/content/repositories/tycho-snapshots/org/ow2/asm/asm-debug-all/4.0/asm-debug-all-4.0.jar
Downloading: https://repo.eclipse.org/content/repositories/maven_central/org/apache/commons/commons-exec/1.2/commons-exec-1.2.jar
Downloading: https://repo.eclipse.org/content/repositories/maven_central/org/ow2/asm/asm-debug-all/4.0/asm-debug-all-4.0.jar
Downloaded: https://repo.eclipse.org/content/repositories/maven_central/org/apache/commons/commons-exec/1.2/commons-exec-1.2.jar (53 KB at 1033.0 KB/sec)
Downloaded: https://repo.eclipse.org/content/repositories/maven_central/org/ow2/asm/asm-debug-all/4.0/asm-debug-all-4.0.jar (314 KB at 4678.3 KB/sec)
Downloading: https://oss.sonatype.org/content/repositories/public/org/apache/maven/plugins/maven-clean-plugin/2.5/maven-clean-plugin-2.5.pom
Downloading: https://repo.eclipse.org/content/repositories/cbi/org/apache/maven/plugins/maven-clean-plugin/2.5/maven-clean-plugin-2.5.pom
Downloading: https://repo.eclipse.org/content/repositories/tycho-snapshots/org/apache/maven/plugins/maven-clean-plugin/2.5/maven-clean-plugin-2.5.pom
Downloading: https://repo.eclipse.org/content/repositories/maven_central/org/apache/maven/plugins/maven-clean-plugin/2.5/maven-clean-plugin-2.5.pom
Downloaded: https://repo.eclipse.org/content/repositories/maven_central/org/apache/maven/plugins/maven-clean-plugin/2.5/maven-clean-plugin-2.5.pom (4 KB at 106.3 KB/sec)
Downloading: https://oss.sonatype.org/content/repositories/public/org/apache/maven/plugins/maven-plugins/22/maven-plugins-22.pom
Downloading: https://repo.eclipse.org/content/repositories/cbi/org/apache/maven/plugins/maven-plugins/22/maven-plugins-22.pom
Downloading: https://repo.eclipse.org/content/repositories/tycho-snapshots/org/apache/maven/plugins/maven-plugins/22/maven-plugins-22.pom
Downloading: https://repo.eclipse.org/content/repositories/maven_central/org/apache/maven/plugins/maven-plugins/22/maven-plugins-22.pom
Downloaded: https://repo.eclipse.org/content/repositories/maven_central/org/apache/maven/plugins/maven-plugins/22/maven-plugins-22.pom (13 KB at 12.4 KB/sec)
Downloading: https://oss.sonatype.org/content/repositories/public/org/apache/maven/plugins/maven-clean-plugin/2.5/maven-clean-plugin-2.5.jar
Downloading: https://repo.eclipse.org/content/repositories/cbi/org/apache/maven/plugins/maven-clean-plugin/2.5/maven-clean-plugin-2.5.jar
Downloading: https://repo.eclipse.org/content/repositories/tycho-snapshots/org/apache/maven/plugins/maven-clean-plugin/2.5/maven-clean-plugin-2.5.jar
Downloading: https://repo.eclipse.org/content/repositories/maven_central/org/apache/maven/plugins/maven-clean-plugin/2.5/maven-clean-plugin-2.5.jar
Downloaded: https://repo.eclipse.org/content/repositories/maven_central/org/apache/maven/plugins/maven-clean-plugin/2.5/maven-clean-plugin-2.5.jar (25 KB at 891.0 KB/sec)
Downloading: https://oss.sonatype.org/content/repositories/public/org/apache/maven/plugins/maven-resources-plugin/2.4.3/maven-resources-plugin-2.4.3.pom
Downloading: https://repo.eclipse.org/content/repositories/cbi/org/apache/maven/plugins/maven-resources-plugin/2.4.3/maven-resources-plugin-2.4.3.pom
Downloading: https://repo.eclipse.org/content/repositories/tycho-snapshots/org/apache/maven/plugins/maven-resources-plugin/2.4.3/maven-resources-plugin-2.4.3.pom
Downloading: https://repo.eclipse.org/content/repositories/maven_central/org/apache/maven/plugins/maven-resources-plugin/2.4.3/maven-resources-plugin-2.4.3.pom
Downloaded: https://repo.eclipse.org/content/repositories/maven_central/org/apache/maven/plugins/maven-resources-plugin/2.4.3/maven-resources-plugin-2.4.3.pom (6 KB at 200.4 KB/sec)
Downloading: https://oss.sonatype.org/content/repositories/public/org/apache/maven/plugins/maven-plugins/18/maven-plugins-18.pom
Downloading: https://repo.eclipse.org/content/repositories/cbi/org/apache/maven/plugins/maven-plugins/18/maven-plugins-18.pom
Downloading: https://repo.eclipse.org/content/repositories/tycho-snapshots/org/apache/maven/plugins/maven-plugins/18/maven-plugins-18.pom
Downloading: https://repo.eclipse.org/content/repositories/maven_central/org/apache/maven/plugins/maven-plugins/18/maven-plugins-18.pom
Downloaded: https://repo.eclipse.org/content/repositories/maven_central/org/apache/maven/plugins/maven-plugins/18/maven-plugins-18.pom (13 KB at 507.9 KB/sec)
Downloading: https://oss.sonatype.org/content/repositories/public/org/apache/maven/maven-parent/16/maven-parent-16.pom
Downloading: https://repo.eclipse.org/content/repositories/cbi/org/apache/maven/maven-parent/16/maven-parent-16.pom
Downloading: https://repo.eclipse.org/content/repositories/tycho-snapshots/org/apache/maven/maven-parent/16/maven-parent-16.pom
Downloading: https://repo.eclipse.org/content/repositories/maven_central/org/apache/maven/maven-parent/16/maven-parent-16.pom
Downloaded: https://repo.eclipse.org/content/repositories/maven_central/org/apache/maven/maven-parent/16/maven-parent-16.pom (23 KB at 1136.3 KB/sec)
Downloading: https://oss.sonatype.org/content/repositories/public/org/apache/apache/7/apache-7.pom
Downloading: https://repo.eclipse.org/content/repositories/cbi/org/apache/apache/7/apache-7.pom
Downloading: https://repo.eclipse.org/content/repositories/tycho-snapshots/org/apache/apache/7/apache-7.pom
Downloading: https://repo.eclipse.org/content/repositories/maven_central/org/apache/apache/7/apache-7.pom
Downloaded: https://repo.eclipse.org/content/repositories/maven_central/org/apache/apache/7/apache-7.pom (15 KB at 454.6 KB/sec)
Downloading: https://oss.sonatype.org/content/repositories/public/org/apache/maven/plugins/maven-resources-plugin/2.4.3/maven-resources-plugin-2.4.3.jar
Downloading: https://repo.eclipse.org/content/repositories/cbi/org/apache/maven/plugins/maven-resources-plugin/2.4.3/maven-resources-plugin-2.4.3.jar
Downloading: https://repo.eclipse.org/content/repositories/tycho-snapshots/org/apache/maven/plugins/maven-resources-plugin/2.4.3/maven-resources-plugin-2.4.3.jar
Downloading: https://repo.eclipse.org/content/repositories/maven_central/org/apache/maven/plugins/maven-resources-plugin/2.4.3/maven-resources-plugin-2.4.3.jar
Downloaded: https://repo.eclipse.org/content/repositories/maven_central/org/apache/maven/plugins/maven-resources-plugin/2.4.3/maven-resources-plugin-2.4.3.jar (24 KB at 1192.7 KB/sec)
Downloading: https://oss.sonatype.org/content/repositories/public/org/eclipse/tycho/tycho-compiler-plugin/0.21.0/tycho-compiler-plugin-0.21.0.pom
Downloaded: https://oss.sonatype.org/content/repositories/public/org/eclipse/tycho/tycho-compiler-plugin/0.21.0/tycho-compiler-plugin-0.21.0.pom (3 KB at 13.7 KB/sec)
Downloading: https://oss.sonatype.org/content/repositories/public/org/eclipse/tycho/tycho-compiler-plugin/0.21.0/tycho-compiler-plugin-0.21.0.jar
Downloaded: https://oss.sonatype.org/content/repositories/public/org/eclipse/tycho/tycho-compiler-plugin/0.21.0/tycho-compiler-plugin-0.21.0.jar (31 KB at 224.2 KB/sec)
Downloading: https://oss.sonatype.org/content/repositories/public/org/apache/maven/plugins/maven-install-plugin/2.3.1/maven-install-plugin-2.3.1.pom
Downloading: https://repo.eclipse.org/content/repositories/cbi/org/apache/maven/plugins/maven-install-plugin/2.3.1/maven-install-plugin-2.3.1.pom
Downloading: https://repo.eclipse.org/content/repositories/tycho-snapshots/org/apache/maven/plugins/maven-install-plugin/2.3.1/maven-install-plugin-2.3.1.pom
Downloading: https://repo.eclipse.org/content/repositories/maven_central/org/apache/maven/plugins/maven-install-plugin/2.3.1/maven-install-plugin-2.3.1.pom
Downloaded: https://repo.eclipse.org/content/repositories/maven_central/org/apache/maven/plugins/maven-install-plugin/2.3.1/maven-install-plugin-2.3.1.pom (5 KB at 183.4 KB/sec)
Downloading: https://oss.sonatype.org/content/repositories/public/org/apache/maven/plugins/maven-install-plugin/2.3.1/maven-install-plugin-2.3.1.jar
Downloading: https://repo.eclipse.org/content/repositories/cbi/org/apache/maven/plugins/maven-install-plugin/2.3.1/maven-install-plugin-2.3.1.jar
Downloading: https://repo.eclipse.org/content/repositories/tycho-snapshots/org/apache/maven/plugins/maven-install-plugin/2.3.1/maven-install-plugin-2.3.1.jar
Downloading: https://repo.eclipse.org/content/repositories/maven_central/org/apache/maven/plugins/maven-install-plugin/2.3.1/maven-install-plugin-2.3.1.jar
Downloaded: https://repo.eclipse.org/content/repositories/maven_central/org/apache/maven/plugins/maven-install-plugin/2.3.1/maven-install-plugin-2.3.1.jar (23 KB at 889.1 KB/sec)
Downloading: https://oss.sonatype.org/content/repositories/public/org/apache/maven/plugins/maven-deploy-plugin/2.5/maven-deploy-plugin-2.5.pom
Downloading: https://repo.eclipse.org/content/repositories/cbi/org/apache/maven/plugins/maven-deploy-plugin/2.5/maven-deploy-plugin-2.5.pom
Downloading: https://repo.eclipse.org/content/repositories/tycho-snapshots/org/apache/maven/plugins/maven-deploy-plugin/2.5/maven-deploy-plugin-2.5.pom
Downloading: https://repo.eclipse.org/content/repositories/maven_central/org/apache/maven/plugins/maven-deploy-plugin/2.5/maven-deploy-plugin-2.5.pom
Downloaded: https://repo.eclipse.org/content/repositories/maven_central/org/apache/maven/plugins/maven-deploy-plugin/2.5/maven-deploy-plugin-2.5.pom (6 KB at 242.3 KB/sec)
Downloading: https://oss.sonatype.org/content/repositories/public/org/apache/maven/plugins/maven-plugins/16/maven-plugins-16.pom
Downloading: https://repo.eclipse.org/content/repositories/cbi/org/apache/maven/plugins/maven-plugins/16/maven-plugins-16.pom
Downloading: https://repo.eclipse.org/content/repositories/tycho-snapshots/org/apache/maven/plugins/maven-plugins/16/maven-plugins-16.pom
Downloading: https://repo.eclipse.org/content/repositories/maven_central/org/apache/maven/plugins/maven-plugins/16/maven-plugins-16.pom
Downloaded: https://repo.eclipse.org/content/repositories/maven_central/org/apache/maven/plugins/maven-plugins/16/maven-plugins-16.pom (13 KB at 632.3 KB/sec)
Downloading: https://oss.sonatype.org/content/repositories/public/org/apache/maven/plugins/maven-deploy-plugin/2.5/maven-deploy-plugin-2.5.jar
Downloading: https://repo.eclipse.org/content/repositories/cbi/org/apache/maven/plugins/maven-deploy-plugin/2.5/maven-deploy-plugin-2.5.jar
Downloading: https://repo.eclipse.org/content/repositories/tycho-snapshots/org/apache/maven/plugins/maven-deploy-plugin/2.5/maven-deploy-plugin-2.5.jar
Downloading: https://repo.eclipse.org/content/repositories/maven_central/org/apache/maven/plugins/maven-deploy-plugin/2.5/maven-deploy-plugin-2.5.jar
Downloaded: https://repo.eclipse.org/content/repositories/maven_central/org/apache/maven/plugins/maven-deploy-plugin/2.5/maven-deploy-plugin-2.5.jar (23 KB at 980.4 KB/sec)
Downloading: https://oss.sonatype.org/content/repositories/public/org/apache/maven/plugins/maven-site-plugin/3.3/maven-site-plugin-3.3.pom
Downloading: https://repo.eclipse.org/content/repositories/cbi/org/apache/maven/plugins/maven-site-plugin/3.3/maven-site-plugin-3.3.pom
Downloading: https://repo.eclipse.org/content/repositories/tycho-snapshots/org/apache/maven/plugins/maven-site-plugin/3.3/maven-site-plugin-3.3.pom
Downloading: https://repo.eclipse.org/content/repositories/maven_central/org/apache/maven/plugins/maven-site-plugin/3.3/maven-site-plugin-3.3.pom
Downloaded: https://repo.eclipse.org/content/repositories/maven_central/org/apache/maven/plugins/maven-site-plugin/3.3/maven-site-plugin-3.3.pom (21 KB at 923.9 KB/sec)
Downloading: https://oss.sonatype.org/content/repositories/public/org/apache/maven/plugins/maven-plugins/24/maven-plugins-24.pom
Downloading: https://repo.eclipse.org/content/repositories/cbi/org/apache/maven/plugins/maven-plugins/24/maven-plugins-24.pom
Downloading: https://repo.eclipse.org/content/repositories/tycho-snapshots/org/apache/maven/plugins/maven-plugins/24/maven-plugins-24.pom
Downloading: https://repo.eclipse.org/content/repositories/maven_central/org/apache/maven/plugins/maven-plugins/24/maven-plugins-24.pom
Downloaded: https://repo.eclipse.org/content/repositories/maven_central/org/apache/maven/plugins/maven-plugins/24/maven-plugins-24.pom (11 KB at 458.8 KB/sec)
Downloading: https://oss.sonatype.org/content/repositories/public/org/apache/maven/maven-parent/23/maven-parent-23.pom
Downloading: https://repo.eclipse.org/content/repositories/cbi/org/apache/maven/maven-parent/23/maven-parent-23.pom
Downloading: https://repo.eclipse.org/content/repositories/tycho-snapshots/org/apache/maven/maven-parent/23/maven-parent-23.pom
Downloading: https://repo.eclipse.org/content/repositories/maven_central/org/apache/maven/maven-parent/23/maven-parent-23.pom
Downloaded: https://repo.eclipse.org/content/repositories/maven_central/org/apache/maven/maven-parent/23/maven-parent-23.pom (32 KB at 1178.6 KB/sec)
Downloading: https://oss.sonatype.org/content/repositories/public/org/apache/maven/plugins/maven-site-plugin/3.3/maven-site-plugin-3.3.jar
Downloading: https://repo.eclipse.org/content/repositories/cbi/org/apache/maven/plugins/maven-site-plugin/3.3/maven-site-plugin-3.3.jar
Downloading: https://repo.eclipse.org/content/repositories/tycho-snapshots/org/apache/maven/plugins/maven-site-plugin/3.3/maven-site-plugin-3.3.jar
Downloading: https://repo.eclipse.org/content/repositories/maven_central/org/apache/maven/plugins/maven-site-plugin/3.3/maven-site-plugin-3.3.jar
Downloaded: https://repo.eclipse.org/content/repositories/maven_central/org/apache/maven/plugins/maven-site-plugin/3.3/maven-site-plugin-3.3.jar (122 KB at 3680.1 KB/sec)
Downloading: https://oss.sonatype.org/content/repositories/public/org/eclipse/tycho/tycho-p2-repository-plugin/0.21.0/tycho-p2-repository-plugin-0.21.0.pom
Downloaded: https://oss.sonatype.org/content/repositories/public/org/eclipse/tycho/tycho-p2-repository-plugin/0.21.0/tycho-p2-repository-plugin-0.21.0.pom (2 KB at 7.9 KB/sec)
Downloading: https://oss.sonatype.org/content/repositories/public/org/eclipse/tycho/tycho-p2-repository-plugin/0.21.0/tycho-p2-repository-plugin-0.21.0.jar
Downloaded: https://oss.sonatype.org/content/repositories/public/org/eclipse/tycho/tycho-p2-repository-plugin/0.21.0/tycho-p2-repository-plugin-0.21.0.jar (13 KB at 86.0 KB/sec)
Downloading: https://oss.sonatype.org/content/repositories/public/org/eclipse/tycho/tycho-p2-publisher-plugin/0.21.0/tycho-p2-publisher-plugin-0.21.0.pom
Downloaded: https://oss.sonatype.org/content/repositories/public/org/eclipse/tycho/tycho-p2-publisher-plugin/0.21.0/tycho-p2-publisher-plugin-0.21.0.pom (2 KB at 15.2 KB/sec)
Downloading: https://oss.sonatype.org/content/repositories/public/org/eclipse/tycho/tycho-p2-publisher-plugin/0.21.0/tycho-p2-publisher-plugin-0.21.0.jar
Downloaded: https://oss.sonatype.org/content/repositories/public/org/eclipse/tycho/tycho-p2-publisher-plugin/0.21.0/tycho-p2-publisher-plugin-0.21.0.jar (23 KB at 116.3 KB/sec)
Downloading: https://oss.sonatype.org/content/repositories/public/org/eclipse/tycho/extras/tycho-p2-extras-plugin/0.21.0/tycho-p2-extras-plugin-0.21.0.pom
Downloaded: https://oss.sonatype.org/content/repositories/public/org/eclipse/tycho/extras/tycho-p2-extras-plugin/0.21.0/tycho-p2-extras-plugin-0.21.0.pom (5 KB at 36.9 KB/sec)
Downloading: https://oss.sonatype.org/content/repositories/public/org/eclipse/tycho/extras/tycho-p2-extras-plugin/0.21.0/tycho-p2-extras-plugin-0.21.0.jar
Downloaded: https://oss.sonatype.org/content/repositories/public/org/eclipse/tycho/extras/tycho-p2-extras-plugin/0.21.0/tycho-p2-extras-plugin-0.21.0.jar (19 KB at 90.6 KB/sec)
Downloading: https://oss.sonatype.org/content/repositories/public/org/codehaus/plexus/plexus-utils/2.0.4/plexus-utils-2.0.4.pom
Downloading: https://repo.eclipse.org/content/repositories/cbi/org/codehaus/plexus/plexus-utils/2.0.4/plexus-utils-2.0.4.pom
Downloading: https://repo.eclipse.org/content/repositories/tycho-snapshots/org/codehaus/plexus/plexus-utils/2.0.4/plexus-utils-2.0.4.pom
Downloading: https://repo.eclipse.org/content/repositories/maven_central/org/codehaus/plexus/plexus-utils/2.0.4/plexus-utils-2.0.4.pom
Downloaded: https://repo.eclipse.org/content/repositories/maven_central/org/codehaus/plexus/plexus-utils/2.0.4/plexus-utils-2.0.4.pom (4 KB at 120.6 KB/sec)
Downloading: https://oss.sonatype.org/content/repositories/public/org/codehaus/plexus/plexus-utils/1.5.5/plexus-utils-1.5.5.pom
Downloading: https://repo.eclipse.org/content/repositories/cbi/org/codehaus/plexus/plexus-utils/1.5.5/plexus-utils-1.5.5.pom
Downloading: https://repo.eclipse.org/content/repositories/tycho-snapshots/org/codehaus/plexus/plexus-utils/1.5.5/plexus-utils-1.5.5.pom
Downloading: https://repo.eclipse.org/content/repositories/maven_central/org/codehaus/plexus/plexus-utils/1.5.5/plexus-utils-1.5.5.pom
Downloaded: https://repo.eclipse.org/content/repositories/maven_central/org/codehaus/plexus/plexus-utils/1.5.5/plexus-utils-1.5.5.pom (6 KB at 4.9 KB/sec)
Downloading: https://oss.sonatype.org/content/repositories/public/org/codehaus/plexus/plexus/1.0.11/plexus-1.0.11.pom
Downloading: https://repo.eclipse.org/content/repositories/cbi/org/codehaus/plexus/plexus/1.0.11/plexus-1.0.11.pom
Downloading: https://repo.eclipse.org/content/repositories/tycho-snapshots/org/codehaus/plexus/plexus/1.0.11/plexus-1.0.11.pom
Downloading: https://repo.eclipse.org/content/repositories/maven_central/org/codehaus/plexus/plexus/1.0.11/plexus-1.0.11.pom
Downloaded: https://repo.eclipse.org/content/repositories/maven_central/org/codehaus/plexus/plexus/1.0.11/plexus-1.0.11.pom (9 KB at 324.4 KB/sec)
Downloading: https://oss.sonatype.org/content/repositories/public/org/sonatype/plexus/plexus-cipher/1.4/plexus-cipher-1.4.pom
Downloading: https://repo.eclipse.org/content/repositories/cbi/org/sonatype/plexus/plexus-cipher/1.4/plexus-cipher-1.4.pom
Downloading: https://repo.eclipse.org/content/repositories/tycho-snapshots/org/sonatype/plexus/plexus-cipher/1.4/plexus-cipher-1.4.pom
Downloading: https://repo.eclipse.org/content/repositories/maven_central/org/sonatype/plexus/plexus-cipher/1.4/plexus-cipher-1.4.pom
Downloaded: https://repo.eclipse.org/content/repositories/maven_central/org/sonatype/plexus/plexus-cipher/1.4/plexus-cipher-1.4.pom (3 KB at 72.0 KB/sec)
Downloading: https://oss.sonatype.org/content/repositories/public/org/codehaus/plexus/plexus-component-annotations/1.5.4/plexus-component-annotations-1.5.4.pom
Downloading: https://repo.eclipse.org/content/repositories/cbi/org/codehaus/plexus/plexus-component-annotations/1.5.4/plexus-component-annotations-1.5.4.pom
Downloading: https://repo.eclipse.org/content/repositories/tycho-snapshots/org/codehaus/plexus/plexus-component-annotations/1.5.4/plexus-component-annotations-1.5.4.pom
Downloading: https://repo.eclipse.org/content/repositories/maven_central/org/codehaus/plexus/plexus-component-annotations/1.5.4/plexus-component-annotations-1.5.4.pom
Downloaded: https://repo.eclipse.org/content/repositories/maven_central/org/codehaus/plexus/plexus-component-annotations/1.5.4/plexus-component-annotations-1.5.4.pom (815 B at 29.5 KB/sec)
Downloading: https://oss.sonatype.org/content/repositories/public/org/codehaus/plexus/plexus-containers/1.5.4/plexus-containers-1.5.4.pom
Downloading: https://repo.eclipse.org/content/repositories/cbi/org/codehaus/plexus/plexus-containers/1.5.4/plexus-containers-1.5.4.pom
Downloading: https://repo.eclipse.org/content/repositories/tycho-snapshots/org/codehaus/plexus/plexus-containers/1.5.4/plexus-containers-1.5.4.pom
Downloading: https://repo.eclipse.org/content/repositories/maven_central/org/codehaus/plexus/plexus-containers/1.5.4/plexus-containers-1.5.4.pom
Downloaded: https://repo.eclipse.org/content/repositories/maven_central/org/codehaus/plexus/plexus-containers/1.5.4/plexus-containers-1.5.4.pom (5 KB at 153.4 KB/sec)
Downloading: https://oss.sonatype.org/content/repositories/public/org/codehaus/plexus/plexus/2.0.5/plexus-2.0.5.pom
Downloading: https://repo.eclipse.org/content/repositories/cbi/org/codehaus/plexus/plexus/2.0.5/plexus-2.0.5.pom
Downloading: https://repo.eclipse.org/content/repositories/tycho-snapshots/org/codehaus/plexus/plexus/2.0.5/plexus-2.0.5.pom
Downloading: https://repo.eclipse.org/content/repositories/maven_central/org/codehaus/plexus/plexus/2.0.5/plexus-2.0.5.pom
Downloaded: https://repo.eclipse.org/content/repositories/maven_central/org/codehaus/plexus/plexus/2.0.5/plexus-2.0.5.pom (17 KB at 651.6 KB/sec)
Downloading: https://oss.sonatype.org/content/repositories/public/org/codehaus/plexus/plexus-utils/2.0.5/plexus-utils-2.0.5.pom
Downloading: https://repo.eclipse.org/content/repositories/cbi/org/codehaus/plexus/plexus-utils/2.0.5/plexus-utils-2.0.5.pom
Downloading: https://repo.eclipse.org/content/repositories/tycho-snapshots/org/codehaus/plexus/plexus-utils/2.0.5/plexus-utils-2.0.5.pom
Downloading: https://repo.eclipse.org/content/repositories/maven_central/org/codehaus/plexus/plexus-utils/2.0.5/plexus-utils-2.0.5.pom
Downloaded: https://repo.eclipse.org/content/repositories/maven_central/org/codehaus/plexus/plexus-utils/2.0.5/plexus-utils-2.0.5.pom (4 KB at 120.6 KB/sec)
Downloading: https://oss.sonatype.org/content/repositories/public/org/codehaus/plexus/plexus-io/2.0.4/plexus-io-2.0.4.pom
Downloading: https://repo.eclipse.org/content/repositories/cbi/org/codehaus/plexus/plexus-io/2.0.4/plexus-io-2.0.4.pom
Downloading: https://repo.eclipse.org/content/repositories/tycho-snapshots/org/codehaus/plexus/plexus-io/2.0.4/plexus-io-2.0.4.pom
Downloading: https://repo.eclipse.org/content/repositories/maven_central/org/codehaus/plexus/plexus-io/2.0.4/plexus-io-2.0.4.pom
Downloaded: https://repo.eclipse.org/content/repositories/maven_central/org/codehaus/plexus/plexus-io/2.0.4/plexus-io-2.0.4.pom (2 KB at 67.7 KB/sec)
Downloading: https://oss.sonatype.org/content/repositories/public/org/codehaus/plexus/plexus-components/1.1.19/plexus-components-1.1.19.pom
Downloading: https://repo.eclipse.org/content/repositories/cbi/org/codehaus/plexus/plexus-components/1.1.19/plexus-components-1.1.19.pom
Downloading: https://repo.eclipse.org/content/repositories/tycho-snapshots/org/codehaus/plexus/plexus-components/1.1.19/plexus-components-1.1.19.pom
Downloading: https://repo.eclipse.org/content/repositories/maven_central/org/codehaus/plexus/plexus-components/1.1.19/plexus-components-1.1.19.pom
Downloaded: https://repo.eclipse.org/content/repositories/maven_central/org/codehaus/plexus/plexus-components/1.1.19/plexus-components-1.1.19.pom (3 KB at 97.6 KB/sec)
Downloading: https://oss.sonatype.org/content/repositories/public/org/codehaus/plexus/plexus-utils/3.0/plexus-utils-3.0.pom
Downloading: https://repo.eclipse.org/content/repositories/cbi/org/codehaus/plexus/plexus-utils/3.0/plexus-utils-3.0.pom
Downloading: https://repo.eclipse.org/content/repositories/tycho-snapshots/org/codehaus/plexus/plexus-utils/3.0/plexus-utils-3.0.pom
Downloading: https://repo.eclipse.org/content/repositories/maven_central/org/codehaus/plexus/plexus-utils/3.0/plexus-utils-3.0.pom
Downloaded: https://repo.eclipse.org/content/repositories/maven_central/org/codehaus/plexus/plexus-utils/3.0/plexus-utils-3.0.pom (4 KB at 158.9 KB/sec)
Downloading: https://oss.sonatype.org/content/repositories/public/org/sonatype/spice/spice-parent/16/spice-parent-16.pom
Downloading: https://repo.eclipse.org/content/repositories/cbi/org/sonatype/spice/spice-parent/16/spice-parent-16.pom
Downloading: https://repo.eclipse.org/content/repositories/tycho-snapshots/org/sonatype/spice/spice-parent/16/spice-parent-16.pom
Downloading: https://repo.eclipse.org/content/repositories/maven_central/org/sonatype/spice/spice-parent/16/spice-parent-16.pom
Downloaded: https://repo.eclipse.org/content/repositories/maven_central/org/sonatype/spice/spice-parent/16/spice-parent-16.pom (9 KB at 291.5 KB/sec)
Downloading: https://oss.sonatype.org/content/repositories/public/org/sonatype/plexus/plexus-cipher/1.4/plexus-cipher-1.4.jar
Downloading: https://oss.sonatype.org/content/repositories/public/org/codehaus/plexus/plexus-io/2.0.4/plexus-io-2.0.4.jar
Downloading: https://repo.eclipse.org/content/repositories/cbi/org/sonatype/plexus/plexus-cipher/1.4/plexus-cipher-1.4.jar
Downloading: https://repo.eclipse.org/content/repositories/cbi/org/codehaus/plexus/plexus-io/2.0.4/plexus-io-2.0.4.jar
Downloading: https://repo.eclipse.org/content/repositories/tycho-snapshots/org/sonatype/plexus/plexus-cipher/1.4/plexus-cipher-1.4.jar
Downloading: https://repo.eclipse.org/content/repositories/tycho-snapshots/org/codehaus/plexus/plexus-io/2.0.4/plexus-io-2.0.4.jar
Downloading: https://repo.eclipse.org/content/repositories/maven_central/org/sonatype/plexus/plexus-cipher/1.4/plexus-cipher-1.4.jar
Downloading: https://repo.eclipse.org/content/repositories/maven_central/org/codehaus/plexus/plexus-io/2.0.4/plexus-io-2.0.4.jar
Downloaded: https://repo.eclipse.org/content/repositories/maven_central/org/codehaus/plexus/plexus-io/2.0.4/plexus-io-2.0.4.jar (57 KB at 1673.9 KB/sec)
[INFO] o.h.m.e.h.MavenExecutionResultHandler - Build failed with exception(s)
[INFO] o.h.m.e.h.MavenExecutionResultHandler - [1] org.apache.maven.InternalErrorException: Internal error: java.lang.RuntimeException: org.apache.maven.MavenExecutionException: Could not setup plugin ClassRealm
[DEBUG] Closing connection to remote
[ERROR] Internal error: java.lang.RuntimeException: org.apache.maven.MavenExecutionException: Could not setup plugin ClassRealm: Plugin org.eclipse.tycho.extras:tycho-p2-extras-plugin:0.21.0 or one of its dependencies could not be resolved: Could not find artifact org.sonatype.plexus:plexus-cipher:jar:1.4 in tycho (https://oss.sonatype.org/content/repositories/public/) -> [Help 1]
org.apache.maven.InternalErrorException: Internal error: java.lang.RuntimeException: org.apache.maven.MavenExecutionException: Could not setup plugin ClassRealm
        at org.apache.maven.DefaultMaven.execute(DefaultMaven.java:167)
        at org.apache.maven.cli.MavenCli.execute(MavenCli.java:584)
        at org.apache.maven.cli.MavenCli.doMain(MavenCli.java:216)
        at org.apache.maven.cli.MavenCli.main(MavenCli.java:160)
        at sun.reflect.NativeMethodAccessorImpl.invoke0(Native Method)
        at sun.reflect.NativeMethodAccessorImpl.invoke(NativeMethodAccessorImpl.java:62)
        at sun.reflect.DelegatingMethodAccessorImpl.invoke(DelegatingMethodAccessorImpl.java:43)
        at java.lang.reflect.Method.invoke(Method.java:498)
        at org.codehaus.plexus.classworlds.launcher.Launcher.launchEnhanced(Launcher.java:289)
        at org.codehaus.plexus.classworlds.launcher.Launcher.launch(Launcher.java:229)
        at org.codehaus.plexus.classworlds.launcher.Launcher.mainWithExitCode(Launcher.java:415)
        at org.codehaus.plexus.classworlds.launcher.Launcher.main(Launcher.java:356)
Caused by: java.lang.RuntimeException: org.apache.maven.MavenExecutionException: Could not setup plugin ClassRealm
        at org.eclipse.tycho.p2.resolver.P2DependencyResolver.getDependencyMetadata(P2DependencyResolver.java:168)
        at org.eclipse.tycho.p2.resolver.P2DependencyResolver.setupProjects(P2DependencyResolver.java:126)
        at org.eclipse.tycho.core.resolver.DefaultTychoResolver.setupProject(DefaultTychoResolver.java:87)
        at org.eclipse.tycho.core.maven.TychoMavenLifecycleParticipant.afterProjectsRead(TychoMavenLifecycleParticipant.java:70)
        at org.apache.maven.DefaultMaven.doExecute(DefaultMaven.java:318)
        at org.apache.maven.DefaultMaven.execute(DefaultMaven.java:155)
        ... 11 more
Caused by: org.apache.maven.MavenExecutionException: Could not setup plugin ClassRealm
        at org.eclipse.tycho.core.maven.utils.PluginRealmHelper.newMavenExecutionException(PluginRealmHelper.java:143)
        at org.eclipse.tycho.core.maven.utils.PluginRealmHelper.execute(PluginRealmHelper.java:130)
        at org.eclipse.tycho.p2.resolver.P2DependencyResolver.getDependencyMetadata(P2DependencyResolver.java:148)
        ... 16 more
Caused by: org.apache.maven.plugin.PluginResolutionException: Plugin org.eclipse.tycho.extras:tycho-p2-extras-plugin:0.21.0 or one of its dependencies could not be resolved: Could not find artifact org.sonatype.plexus:plexus-cipher:jar:1.4 in tycho (https://oss.sonatype.org/content/repositories/public/)
        at org.apache.maven.plugin.internal.DefaultPluginDependenciesResolver.resolve(DefaultPluginDependenciesResolver.java:208)
        at org.apache.maven.plugin.internal.DefaultMavenPluginManager.createPluginRealm(DefaultMavenPluginManager.java:361)
        at org.apache.maven.plugin.internal.DefaultMavenPluginManager.setupPluginRealm(DefaultMavenPluginManager.java:329)
        at org.apache.maven.plugin.DefaultBuildPluginManager.getPluginRealm(DefaultBuildPluginManager.java:229)
        at org.eclipse.tycho.core.maven.utils.PluginRealmHelper.execute(PluginRealmHelper.java:112)
        ... 17 more
Caused by: org.eclipse.aether.resolution.ArtifactResolutionException: Could not find artifact org.sonatype.plexus:plexus-cipher:jar:1.4 in tycho (https://oss.sonatype.org/content/repositories/public/)
        at org.eclipse.aether.internal.impl.DefaultArtifactResolver.resolve(DefaultArtifactResolver.java:444)
        at org.eclipse.aether.internal.impl.DefaultArtifactResolver.resolveArtifacts(DefaultArtifactResolver.java:246)
        at org.eclipse.aether.internal.impl.DefaultRepositorySystem.resolveDependencies(DefaultRepositorySystem.java:367)
        at org.apache.maven.plugin.internal.DefaultPluginDependenciesResolver.resolve(DefaultPluginDependenciesResolver.java:200)
        ... 21 more
Caused by: org.eclipse.aether.transfer.ArtifactNotFoundException: Could not find artifact org.sonatype.plexus:plexus-cipher:jar:1.4 in tycho (https://oss.sonatype.org/content/repositories/public/)
        at org.eclipse.aether.connector.basic.ArtifactTransportListener.transferFailed(ArtifactTransportListener.java:39)
        at org.eclipse.aether.connector.basic.BasicRepositoryConnector$TaskRunner.run(BasicRepositoryConnector.java:355)
        at org.eclipse.aether.util.concurrency.RunnableErrorForwarder$1.run(RunnableErrorForwarder.java:67)
        at java.util.concurrent.ThreadPoolExecutor.runWorker(ThreadPoolExecutor.java:1142)
        at java.util.concurrent.ThreadPoolExecutor$Worker.run(ThreadPoolExecutor.java:617)
        at java.lang.Thread.run(Thread.java:745)
[ERROR]
[ERROR] To see the full stack trace of the errors, re-run Maven with the -e switch.
[ERROR] Re-run Maven using the -X switch to enable full debug logging.
[ERROR]
[ERROR] For more information about the errors and possible solutions, please read the following articles:
[ERROR] [Help 1] http://cwiki.apache.org/confluence/display/MAVEN/InternalErrorException
[DEBUG] Waiting for process to finish
[DEBUG] Result: 1
Terminating xvnc.
Archiving artifacts

--
This message is automatically generated by Hudson.
For more information on Hudson, see: http://hudson-ci.org/
_______________________________________________
wtp-releng mailing list
[hidden email]
To change your delivery options, retrieve your password, or unsubscribe from this list, visit
https://dev.eclipse.org/mailman/listinfo/wtp-releng
Reply | Threaded
Open this post in threaded view
|  
Report Content as Inappropriate

[Hudson] Hudson build is back to normal : WTP-R3_8_x_Maintenance #172

hudsonbuild
See <https://hudson.eclipse.org/webtools/job/WTP-R3_8_x_Maintenance/172/>


--
This message is automatically generated by Hudson.
For more information on Hudson, see: http://hudson-ci.org/
_______________________________________________
wtp-releng mailing list
[hidden email]
To change your delivery options, retrieve your password, or unsubscribe from this list, visit
https://dev.eclipse.org/mailman/listinfo/wtp-releng
Loading...