Quantcast

[Hudson] Build failed in Hudson: WTP-R3_8_x_Maintenance #99

classic Classic list List threaded Threaded
2 messages Options
Reply | Threaded
Open this post in threaded view
|  
Report Content as Inappropriate

[Hudson] Build failed in Hudson: WTP-R3_8_x_Maintenance #99

hudsonbuild
See <https://hudson.eclipse.org/webtools/job/WTP-R3_8_x_Maintenance/99/>

------------------------------------------
[...truncated 265 lines...]
/jobs/genie.webtools/WTP-R3_8_x_Maintenance/workspace/webtools.servertools.tests /jobs/genie.webtools/WTP-R3_8_x_Maintenance/workspace
Previous HEAD position was 2d70da7... [442420] org.eclipse.jst.server.core.tests is not completed due to a timeout
Switched to a new branch 'R3_8_maintenance'
Branch R3_8_maintenance set up to track remote branch R3_8_maintenance from origin.
Already up-to-date.
/jobs/genie.webtools/WTP-R3_8_x_Maintenance/workspace
/jobs/genie.webtools/WTP-R3_8_x_Maintenance/workspace/webtools.sourceediting /jobs/genie.webtools/WTP-R3_8_x_Maintenance/workspace
Previous HEAD position was 360e004... [443836] Source Editing Components that require version increase
Switched to a new branch 'R3_8_maintenance'
Branch R3_8_maintenance set up to track remote branch R3_8_maintenance from origin.
Already up-to-date.
/jobs/genie.webtools/WTP-R3_8_x_Maintenance/workspace
/jobs/genie.webtools/WTP-R3_8_x_Maintenance/workspace/webtools.sourceediting.xpath /jobs/genie.webtools/WTP-R3_8_x_Maintenance/workspace
Previous HEAD position was de85043... [443836] Source Editing Components that require version increase
Switched to branch 'master'
Your branch is up-to-date with 'origin/master'.
Already up-to-date.
/jobs/genie.webtools/WTP-R3_8_x_Maintenance/workspace
/jobs/genie.webtools/WTP-R3_8_x_Maintenance/workspace/webtools.sourceediting.xpath.tests /jobs/genie.webtools/WTP-R3_8_x_Maintenance/workspace
Previous HEAD position was 74e7562... [435968] [CBI] Set Eclipse-SourceReferences for sourceediting.xpath
Switched to branch 'master'
Your branch is up-to-date with 'origin/master'.
Already up-to-date.
/jobs/genie.webtools/WTP-R3_8_x_Maintenance/workspace
/jobs/genie.webtools/WTP-R3_8_x_Maintenance/workspace/webtools.sourceediting.xsl /jobs/genie.webtools/WTP-R3_8_x_Maintenance/workspace
Switched to branch 'master'
Your branch is up-to-date with 'origin/master'.
Already up-to-date.
/jobs/genie.webtools/WTP-R3_8_x_Maintenance/workspace
/jobs/genie.webtools/WTP-R3_8_x_Maintenance/workspace/webtools.sourceediting.xsl.tests /jobs/genie.webtools/WTP-R3_8_x_Maintenance/workspace
Switched to branch 'master'
Your branch is up-to-date with 'origin/master'.
Already up-to-date.
/jobs/genie.webtools/WTP-R3_8_x_Maintenance/workspace
/jobs/genie.webtools/WTP-R3_8_x_Maintenance/workspace/webtools.webservices /jobs/genie.webtools/WTP-R3_8_x_Maintenance/workspace
Previous HEAD position was 68a2057... [443846] Version updates needed for WTP 3.6.1
Switched to branch 'master'
Your branch is up-to-date with 'origin/master'.
Already up-to-date.
/jobs/genie.webtools/WTP-R3_8_x_Maintenance/workspace
/jobs/genie.webtools/WTP-R3_8_x_Maintenance/workspace/webtools.webservices.axis2 /jobs/genie.webtools/WTP-R3_8_x_Maintenance/workspace
Previous HEAD position was eeeafe4... [433929] Update the Web Services license features to 1.0.1 for Luna
Switched to branch 'master'
Your branch is up-to-date with 'origin/master'.
Already up-to-date.
/jobs/genie.webtools/WTP-R3_8_x_Maintenance/workspace
/jobs/genie.webtools/WTP-R3_8_x_Maintenance/workspace/webtools.webservices.jaxws /jobs/genie.webtools/WTP-R3_8_x_Maintenance/workspace
Previous HEAD position was 5ea598f... [443846] Version updates needed for WTP 3.6.1
Switched to branch 'master'
Your branch is up-to-date with 'origin/master'.
Already up-to-date.
/jobs/genie.webtools/WTP-R3_8_x_Maintenance/workspace
[INFO] Using Maven 3 installation: Maven 3.2.5
[INFO] Checking Maven 3 installation environment
[workspace] $ /shared/common/apache-maven-3.2.5/bin/mvn --help
[INFO] Checking Maven 3 installation version
[INFO] Detected Maven 3 installation version: 3.2.5
[workspace] $ /shared/common/apache-maven-3.2.5/bin/mvn clean install -V -B -Dmaven.test.skip=true -Dmaven.test.failure.ignore=true -Dmaven.test.error.ignore=true -Dsurefire.timeout=1800 -DskipWithIssues=false -Dmaven.ext.class.path=/home/hudson/genie.webtools/.hudson/maven/slavebundle/resources:/home/hudson/genie.webtools/.hudson/maven/slavebundle/lib/maven3-eventspy-3.1.jar:/home/hudson/genie.webtools/.hudson/war/webapp/WEB-INF/lib/hudson-remoting-3.0.3.jar -Dhudson.eventspy.port=43172 -Dmaven.repo.local=<https://hudson.eclipse.org/webtools/job/WTP-R3_8_x_Maintenance/ws/.maven/repo> -f pom.xml -P bree-libs -P eclipse-sign -ff
[DEBUG] Waiting for connection on port: 43172
Apache Maven 3.2.5 (12a6b3acb947671f09b81f49094c53f426d8cea1; 2014-12-14T12:29:23-05:00)
Maven home: /shared/common/apache-maven-3.2.5
Java version: 1.8.0_102, vendor: Oracle Corporation
Java home: /opt/public/common/jdk1.8.0_102.x64/jre
Default locale: en_US, platform encoding: UTF-8
OS name: "linux", version: "3.12.51-52.39-default", arch: "amd64", family: "unix"
SLF4J: Class path contains multiple SLF4J bindings.
SLF4J: Found binding in [jar:file:/home/hudson/genie.webtools/.hudson/maven/slavebundle/lib/maven3-eventspy-runtime.jar!/org/slf4j/impl/StaticLoggerBinder.class]
SLF4J: Found binding in [jar:file:/shared/common/apache-maven-3.2.5/lib/slf4j-simple-1.7.5.jar!/org/slf4j/impl/StaticLoggerBinder.class]
SLF4J: See http://www.slf4j.org/codes.html#multiple_bindings for an explanation.
[DEBUG] Connected to remote
[INFO] o.h.m.e.h.SettingsBuildingRequestHandler - Using settings document ID: e23a0b6a-ab36-4ea3-8d97-c6ce7ba3db90
[INFO] o.h.m.e.h.MavenExecutionRequestHandler - Using tool-chains document ID: f1492191-c1d9-4caa-a6bf-44160486454d
[INFO] Scanning for projects...
Downloading: https://oss.sonatype.org/content/repositories/public/org/eclipse/tycho/tycho-maven-plugin/0.21.0/tycho-maven-plugin-0.21.0.pom
Downloaded: https://oss.sonatype.org/content/repositories/public/org/eclipse/tycho/tycho-maven-plugin/0.21.0/tycho-maven-plugin-0.21.0.pom (3 KB at 5.1 KB/sec)
Downloading: https://oss.sonatype.org/content/repositories/public/org/eclipse/tycho/tycho/0.21.0/tycho-0.21.0.pom
Downloaded: https://oss.sonatype.org/content/repositories/public/org/eclipse/tycho/tycho/0.21.0/tycho-0.21.0.pom (18 KB at 100.7 KB/sec)
Downloading: https://oss.sonatype.org/content/repositories/public/org/eclipse/tycho/tycho-core/0.21.0/tycho-core-0.21.0.pom
Downloaded: https://oss.sonatype.org/content/repositories/public/org/eclipse/tycho/tycho-core/0.21.0/tycho-core-0.21.0.pom (5 KB at 31.1 KB/sec)
Downloading: https://oss.sonatype.org/content/repositories/public/org/apache/maven/maven-core/3.0/maven-core-3.0.pom
Downloading: https://repo.eclipse.org/content/repositories/cbi/org/apache/maven/maven-core/3.0/maven-core-3.0.pom
Downloading: https://repo.eclipse.org/content/repositories/tycho-snapshots/org/apache/maven/maven-core/3.0/maven-core-3.0.pom
Downloading: https://repo.eclipse.org/content/repositories/maven_central/org/apache/maven/maven-core/3.0/maven-core-3.0.pom
Downloading: https://oss.sonatype.org/content/repositories/public/org/apache/maven/maven-plugin-api/3.0/maven-plugin-api-3.0.pom
Downloading: https://repo.eclipse.org/content/repositories/cbi/org/apache/maven/maven-plugin-api/3.0/maven-plugin-api-3.0.pom
Downloading: https://repo.eclipse.org/content/repositories/tycho-snapshots/org/apache/maven/maven-plugin-api/3.0/maven-plugin-api-3.0.pom
Downloading: https://repo.eclipse.org/content/repositories/maven_central/org/apache/maven/maven-plugin-api/3.0/maven-plugin-api-3.0.pom
Downloading: https://oss.sonatype.org/content/repositories/public/org/codehaus/plexus/plexus-utils/3.0.7/plexus-utils-3.0.7.pom
Downloading: https://repo.eclipse.org/content/repositories/cbi/org/codehaus/plexus/plexus-utils/3.0.7/plexus-utils-3.0.7.pom
Downloading: https://repo.eclipse.org/content/repositories/tycho-snapshots/org/codehaus/plexus/plexus-utils/3.0.7/plexus-utils-3.0.7.pom
Downloading: https://repo.eclipse.org/content/repositories/maven_central/org/codehaus/plexus/plexus-utils/3.0.7/plexus-utils-3.0.7.pom
Downloading: https://oss.sonatype.org/content/repositories/public/org/codehaus/plexus/plexus-archiver/2.2/plexus-archiver-2.2.pom
Downloading: https://repo.eclipse.org/content/repositories/cbi/org/codehaus/plexus/plexus-archiver/2.2/plexus-archiver-2.2.pom
Downloading: https://repo.eclipse.org/content/repositories/tycho-snapshots/org/codehaus/plexus/plexus-archiver/2.2/plexus-archiver-2.2.pom
Downloading: https://repo.eclipse.org/content/repositories/maven_central/org/codehaus/plexus/plexus-archiver/2.2/plexus-archiver-2.2.pom
Downloading: https://oss.sonatype.org/content/repositories/public/org/eclipse/tycho/org.eclipse.osgi.compatibility.state/1.0.0.v20140403-1907/org.eclipse.osgi.compatibility.state-1.0.0.v20140403-1907.pom
Downloaded: https://oss.sonatype.org/content/repositories/public/org/eclipse/tycho/org.eclipse.osgi.compatibility.state/1.0.0.v20140403-1907/org.eclipse.osgi.compatibility.state-1.0.0.v20140403-1907.pom (2 KB at 4.8 KB/sec)
Downloading: https://oss.sonatype.org/content/repositories/public/org/eclipse/tycho/sisu-equinox-embedder/0.21.0/sisu-equinox-embedder-0.21.0.pom
Downloaded: https://oss.sonatype.org/content/repositories/public/org/eclipse/tycho/sisu-equinox-embedder/0.21.0/sisu-equinox-embedder-0.21.0.pom (2 KB at 5.7 KB/sec)
Downloading: https://oss.sonatype.org/content/repositories/public/org/eclipse/tycho/sisu-equinox/0.21.0/sisu-equinox-0.21.0.pom
Downloaded: https://oss.sonatype.org/content/repositories/public/org/eclipse/tycho/sisu-equinox/0.21.0/sisu-equinox-0.21.0.pom (2 KB at 8.6 KB/sec)
Downloading: https://oss.sonatype.org/content/repositories/public/org/codehaus/plexus/plexus-component-annotations/1.5.5/plexus-component-annotations-1.5.5.pom
Downloading: https://repo.eclipse.org/content/repositories/cbi/org/codehaus/plexus/plexus-component-annotations/1.5.5/plexus-component-annotations-1.5.5.pom
Downloading: https://repo.eclipse.org/content/repositories/tycho-snapshots/org/codehaus/plexus/plexus-component-annotations/1.5.5/plexus-component-annotations-1.5.5.pom
Downloading: https://repo.eclipse.org/content/repositories/maven_central/org/codehaus/plexus/plexus-component-annotations/1.5.5/plexus-component-annotations-1.5.5.pom
Downloading: https://oss.sonatype.org/content/repositories/public/org/eclipse/tycho/org.eclipse.osgi/3.10.0.v20140606-1445/org.eclipse.osgi-3.10.0.v20140606-1445.pom
Downloaded: https://oss.sonatype.org/content/repositories/public/org/eclipse/tycho/org.eclipse.osgi/3.10.0.v20140606-1445/org.eclipse.osgi-3.10.0.v20140606-1445.pom (2 KB at 4.3 KB/sec)
Downloading: https://oss.sonatype.org/content/repositories/public/org/eclipse/tycho/sisu-equinox-api/0.21.0/sisu-equinox-api-0.21.0.pom
Downloaded: https://oss.sonatype.org/content/repositories/public/org/eclipse/tycho/sisu-equinox-api/0.21.0/sisu-equinox-api-0.21.0.pom (2 KB at 16.6 KB/sec)
Downloading: https://oss.sonatype.org/content/repositories/public/org/eclipse/tycho/tycho-metadata-model/0.21.0/tycho-metadata-model-0.21.0.pom
Downloaded: https://oss.sonatype.org/content/repositories/public/org/eclipse/tycho/tycho-metadata-model/0.21.0/tycho-metadata-model-0.21.0.pom (2 KB at 10.7 KB/sec)
Downloading: https://oss.sonatype.org/content/repositories/public/de/pdark/decentxml/1.3/decentxml-1.3.pom
Downloaded: https://oss.sonatype.org/content/repositories/public/de/pdark/decentxml/1.3/decentxml-1.3.pom (7 KB at 52.8 KB/sec)
Downloading: https://oss.sonatype.org/content/repositories/public/org/eclipse/tycho/tycho-embedder-api/0.21.0/tycho-embedder-api-0.21.0.pom
Downloaded: https://oss.sonatype.org/content/repositories/public/org/eclipse/tycho/tycho-embedder-api/0.21.0/tycho-embedder-api-0.21.0.pom (3 KB at 18.1 KB/sec)
Downloading: https://oss.sonatype.org/content/repositories/public/org/eclipse/tycho/org.eclipse.tycho.embedder.shared/0.21.0/org.eclipse.tycho.embedder.shared-0.21.0.pom
Downloaded: https://oss.sonatype.org/content/repositories/public/org/eclipse/tycho/org.eclipse.tycho.embedder.shared/0.21.0/org.eclipse.tycho.embedder.shared-0.21.0.pom (2 KB at 9.5 KB/sec)
Downloading: https://oss.sonatype.org/content/repositories/public/org/eclipse/tycho/tycho-bundles/0.21.0/tycho-bundles-0.21.0.pom
Downloaded: https://oss.sonatype.org/content/repositories/public/org/eclipse/tycho/tycho-bundles/0.21.0/tycho-bundles-0.21.0.pom (3 KB at 25.4 KB/sec)
Downloading: https://oss.sonatype.org/content/repositories/public/org/eclipse/tycho/org.eclipse.tycho.core.shared/0.21.0/org.eclipse.tycho.core.shared-0.21.0.pom
Downloaded: https://oss.sonatype.org/content/repositories/public/org/eclipse/tycho/org.eclipse.tycho.core.shared/0.21.0/org.eclipse.tycho.core.shared-0.21.0.pom (2 KB at 9.1 KB/sec)
Downloading: https://oss.sonatype.org/content/repositories/public/org/eclipse/tycho/tycho-p2-facade/0.21.0/tycho-p2-facade-0.21.0.pom
Downloaded: https://oss.sonatype.org/content/repositories/public/org/eclipse/tycho/tycho-p2-facade/0.21.0/tycho-p2-facade-0.21.0.pom (3 KB at 18.7 KB/sec)
Downloading: https://oss.sonatype.org/content/repositories/public/org/eclipse/tycho/tycho-p2/0.21.0/tycho-p2-0.21.0.pom
Downloaded: https://oss.sonatype.org/content/repositories/public/org/eclipse/tycho/tycho-p2/0.21.0/tycho-p2-0.21.0.pom (2 KB at 10.3 KB/sec)
Downloading: https://oss.sonatype.org/content/repositories/public/org/eclipse/tycho/org.eclipse.tycho.p2.resolver.shared/0.21.0/org.eclipse.tycho.p2.resolver.shared-0.21.0.pom
Downloaded: https://oss.sonatype.org/content/repositories/public/org/eclipse/tycho/org.eclipse.tycho.p2.resolver.shared/0.21.0/org.eclipse.tycho.p2.resolver.shared-0.21.0.pom (2 KB at 10.1 KB/sec)
Downloading: https://oss.sonatype.org/content/repositories/public/org/eclipse/tycho/org.eclipse.tycho.p2.tools.shared/0.21.0/org.eclipse.tycho.p2.tools.shared-0.21.0.pom
Downloaded: https://oss.sonatype.org/content/repositories/public/org/eclipse/tycho/org.eclipse.tycho.p2.tools.shared/0.21.0/org.eclipse.tycho.p2.tools.shared-0.21.0.pom (2 KB at 8.6 KB/sec)
[INFO] o.h.m.e.h.MavenExecutionResultHandler - Build failed with exception(s)
[INFO] o.h.m.e.h.MavenExecutionResultHandler - [1] org.apache.maven.project.ProjectBuildingException: Some problems were encountered while processing the POMs:
[ERROR] Unresolveable build extension: Plugin org.eclipse.tycho:tycho-maven-plugin:0.21.0 or one of its dependencies could not be resolved: Failed to collect dependencies at org.eclipse.tycho:tycho-maven-plugin:jar:0.21.0 -> org.eclipse.tycho:tycho-core:jar:0.21.0 -> org.apache.maven:maven-core:jar:3.0 @
[ERROR] Unresolveable build extension: Plugin org.eclipse.tycho:tycho-maven-plugin:0.21.0 or one of its dependencies could not be resolved: Failed to collect dependencies at org.eclipse.tycho:tycho-maven-plugin:jar:0.21.0 -> org.eclipse.tycho:tycho-core:jar:0.21.0 -> org.apache.maven:maven-core:jar:3.0 @
[ERROR] Unresolveable build extension: Plugin org.eclipse.tycho:tycho-maven-plugin:0.21.0 or one of its dependencies could not be resolved: Failed to collect dependencies at org.eclipse.tycho:tycho-maven-plugin:jar:0.21.0 -> org.eclipse.tycho:tycho-core:jar:0.21.0 -> org.apache.maven:maven-core:jar:3.0 @
[ERROR] Unresolveable build extension: Plugin org.eclipse.tycho:tycho-maven-plugin:0.21.0 or one of its dependencies could not be resolved: Failed to collect dependencies at org.eclipse.tycho:tycho-maven-plugin:jar:0.21.0 -> org.eclipse.tycho:tycho-core:jar:0.21.0 -> org.apache.maven:maven-core:jar:3.0 @
[ERROR] Unresolveable build extension: Plugin org.eclipse.tycho:tycho-maven-plugin:0.21.0 or one of its dependencies could not be resolved: Failed to collect dependencies at org.eclipse.tycho:tycho-maven-plugin:jar:0.21.0 -> org.eclipse.tycho:tycho-core:jar:0.21.0 -> org.apache.maven:maven-core:jar:3.0 @
[ERROR] Unresolveable build extension: Plugin org.eclipse.tycho:tycho-maven-plugin:0.21.0 or one of its dependencies could not be resolved: Failed to collect dependencies at org.eclipse.tycho:tycho-maven-plugin:jar:0.21.0 -> org.eclipse.tycho:tycho-core:jar:0.21.0 -> org.apache.maven:maven-core:jar:3.0 @
[ERROR] Unresolveable build extension: Plugin org.eclipse.tycho:tycho-maven-plugin:0.21.0 or one of its dependencies could not be resolved: Failed to collect dependencies at org.eclipse.tycho:tycho-maven-plugin:jar:0.21.0 -> org.eclipse.tycho:tycho-core:jar:0.21.0 -> org.apache.maven:maven-core:jar:3.0 @
[ERROR] Unresolveable build extension: Plugin org.eclipse.tycho:tycho-maven-plugin:0.21.0 or one of its dependencies could not be resolved: Failed to collect dependencies at org.eclipse.tycho:tycho-maven-plugin:jar:0.21.0 -> org.eclipse.tycho:tycho-core:jar:0.21.0 -> org.apache.maven:maven-core:jar:3.0 @
[ERROR] Unresolveable build extension: Plugin org.eclipse.tycho:tycho-maven-plugin:0.21.0 or one of its dependencies could not be resolved: Failed to collect dependencies at org.eclipse.tycho:tycho-maven-plugin:jar:0.21.0 -> org.eclipse.tycho:tycho-core:jar:0.21.0 -> org.apache.maven:maven-core:jar:3.0 @
[ERROR] Unresolveable build extension: Plugin org.eclipse.tycho:tycho-maven-plugin:0.21.0 or one of its dependencies could not be resolved: Failed to collect dependencies at org.eclipse.tycho:tycho-maven-plugin:jar:0.21.0 -> org.eclipse.tycho:tycho-core:jar:0.21.0 -> org.apache.maven:maven-core:jar:3.0 @
[ERROR] Unresolveable build extension: Plugin org.eclipse.tycho:tycho-maven-plugin:0.21.0 or one of its dependencies could not be resolved: Failed to collect dependencies at org.eclipse.tycho:tycho-maven-plugin:jar:0.21.0 -> org.eclipse.tycho:tycho-core:jar:0.21.0 -> org.apache.maven:maven-core:jar:3.0 @
[ERROR] Unresolveable build extension: Plugin org.eclipse.tycho:tycho-maven-plugin:0.21.0 or one of its dependencies could not be resolved: Failed to collect dependencies at org.eclipse.tycho:tycho-maven-plugin:jar:0.21.0 -> org.eclipse.tycho:tycho-core:jar:0.21.0 -> org.apache.maven:maven-core:jar:3.0 @
[ERROR] Unresolveable build extension: Plugin org.eclipse.tycho:tycho-maven-plugin:0.21.0 or one of its dependencies could not be resolved: Failed to collect dependencies at org.eclipse.tycho:tycho-maven-plugin:jar:0.21.0 -> org.eclipse.tycho:tycho-core:jar:0.21.0 -> org.apache.maven:maven-core:jar:3.0 @
[ERROR] Unresolveable build extension: Plugin org.eclipse.tycho:tycho-maven-plugin:0.21.0 or one of its dependencies could not be resolved: Failed to collect dependencies at org.eclipse.tycho:tycho-maven-plugin:jar:0.21.0 -> org.eclipse.tycho:tycho-core:jar:0.21.0 -> org.apache.maven:maven-core:jar:3.0 @
[ERROR] Unresolveable build extension: Plugin org.eclipse.tycho:tycho-maven-plugin:0.21.0 or one of its dependencies could not be resolved: Failed to collect dependencies at org.eclipse.tycho:tycho-maven-plugin:jar:0.21.0 -> org.eclipse.tycho:tycho-core:jar:0.21.0 -> org.apache.maven:maven-core:jar:3.0 @
[ERROR] Unresolveable build extension: Plugin org.eclipse.tycho:tycho-maven-plugin:0.21.0 or one of its dependencies could not be resolved: Failed to collect dependencies at org.eclipse.tycho:tycho-maven-plugin:jar:0.21.0 -> org.eclipse.tycho:tycho-core:jar:0.21.0 -> org.apache.maven:maven-core:jar:3.0 @
[ERROR] Unresolveable build extension: Plugin org.eclipse.tycho:tycho-maven-plugin:0.21.0 or one of its dependencies could not be resolved: Failed to collect dependencies at org.eclipse.tycho:tycho-maven-plugin:jar:0.21.0 -> org.eclipse.tycho:tycho-core:jar:0.21.0 -> org.apache.maven:maven-core:jar:3.0 @
[ERROR] Unresolveable build extension: Plugin org.eclipse.tycho:tycho-maven-plugin:0.21.0 or one of its dependencies could not be resolved: Failed to collect dependencies at org.eclipse.tycho:tycho-maven-plugin:jar:0.21.0 -> org.eclipse.tycho:tycho-core:jar:0.21.0 -> org.apache.maven:maven-core:jar:3.0 @
[ERROR] Unresolveable build extension: Plugin org.eclipse.tycho:tycho-maven-plugin:0.21.0 or one of its dependencies could not be resolved: Failed to collect dependencies at org.eclipse.tycho:tycho-maven-plugin:jar:0.21.0 -> org.eclipse.tycho:tycho-core:jar:0.21.0 -> org.apache.maven:maven-core:jar:3.0 @
[ERROR] Unresolveable build extension: Plugin org.eclipse.tycho:tycho-maven-plugin:0.21.0 or one of its dependencies could not be resolved: Failed to collect dependencies at org.eclipse.tycho:tycho-maven-plugin:jar:0.21.0 -> org.eclipse.tycho:tycho-core:jar:0.21.0 -> org.apache.maven:maven-core:jar:3.0 @
[ERROR] Unresolveable build extension: Plugin org.eclipse.tycho:tycho-maven-plugin:0.21.0 or one of its dependencies could not be resolved: Failed to collect dependencies at org.eclipse.tycho:tycho-maven-plugin:jar:0.21.0 -> org.eclipse.tycho:tycho-core:jar:0.21.0 -> org.apache.maven:maven-core:jar:3.0 @
[ERROR] Unresolveable build extension: Plugin org.eclipse.tycho:tycho-maven-plugin:0.21.0 or one of its dependencies could not be resolved: Failed to collect dependencies at org.eclipse.tycho:tycho-maven-plugin:jar:0.21.0 -> org.eclipse.tycho:tycho-core:jar:0.21.0 -> org.apache.maven:maven-core:jar:3.0 @
[ERROR] Unresolveable build extension: Plugin org.eclipse.tycho:tycho-maven-plugin:0.21.0 or one of its dependencies could not be resolved: Failed to collect dependencies at org.eclipse.tycho:tycho-maven-plugin:jar:0.21.0 -> org.eclipse.tycho:tycho-core:jar:0.21.0 -> org.apache.maven:maven-core:jar:3.0 @
[ERROR] Unresolveable build extension: Plugin org.eclipse.tycho:tycho-maven-plugin:0.21.0 or one of its dependencies could not be resolved: Failed to collect dependencies at org.eclipse.tycho:tycho-maven-plugin:jar:0.21.0 -> org.eclipse.tycho:tycho-core:jar:0.21.0 -> org.apache.maven:maven-core:jar:3.0 @
[ERROR] Unresolveable build extension: Plugin org.eclipse.tycho:tycho-maven-plugin:0.21.0 or one of its dependencies could not be resolved: Failed to collect dependencies at org.eclipse.tycho:tycho-maven-plugin:jar:0.21.0 -> org.eclipse.tycho:tycho-core:jar:0.21.0 -> org.apache.maven:maven-core:jar:3.0 @
[ERROR] Unresolveable build extension: Plugin org.eclipse.tycho:tycho-maven-plugin:0.21.0 or one of its dependencies could not be resolved: Failed to collect dependencies at org.eclipse.tycho:tycho-maven-plugin:jar:0.21.0 -> org.eclipse.tycho:tycho-core:jar:0.21.0 -> org.apache.maven:maven-core:jar:3.0 @

[DEBUG] Closing connection to remote
[ERROR] The build could not read 26 projects -> [Help 1]
[ERROR]  
[ERROR]   The project org.eclipse:wtp-parent:3.6.0-SNAPSHOT (/jobs/genie.webtools/WTP-R3_8_x_Maintenance/workspace/wtp-parent/pom.xml) has 1 error
[ERROR]     Unresolveable build extension: Plugin org.eclipse.tycho:tycho-maven-plugin:0.21.0 or one of its dependencies could not be resolved: Failed to collect dependencies at org.eclipse.tycho:tycho-maven-plugin:jar:0.21.0 -> org.eclipse.tycho:tycho-core:jar:0.21.0 -> org.apache.maven:maven-core:jar:3.0: Failed to read artifact descriptor for org.apache.maven:maven-core:jar:3.0: Could not transfer artifact org.apache.maven:maven-core:pom:3.0 from/to cbi-repo (https://repo.eclipse.org/content/repositories/cbi/): Connect to repo.eclipse.org:443 [repo.eclipse.org/198.41.30.233] failed: Connection timed out -> [Help 2]
[ERROR]  
[ERROR]   The project org.eclipse.webtools.releng:org.eclipse.webtools.releng:3.6.0-SNAPSHOT (/jobs/genie.webtools/WTP-R3_8_x_Maintenance/workspace/webtools.releng/pom.xml) has 1 error
[ERROR]     Unresolveable build extension: Plugin org.eclipse.tycho:tycho-maven-plugin:0.21.0 or one of its dependencies could not be resolved: Failed to collect dependencies at org.eclipse.tycho:tycho-maven-plugin:jar:0.21.0 -> org.eclipse.tycho:tycho-core:jar:0.21.0 -> org.apache.maven:maven-core:jar:3.0: Failed to read artifact descriptor for org.apache.maven:maven-core:jar:3.0: Could not transfer artifact org.apache.maven:maven-core:pom:3.0 from/to cbi-repo (https://repo.eclipse.org/content/repositories/cbi/): Connect to repo.eclipse.org:443 [repo.eclipse.org/198.41.30.233] failed: Connection timed out -> [Help 2]
[ERROR]  
[ERROR]   The project org.eclipse.webtools:repositories:3.6.0-SNAPSHOT (/jobs/genie.webtools/WTP-R3_8_x_Maintenance/workspace/webtools.repositories/pom.xml) has 1 error
[ERROR]     Unresolveable build extension: Plugin org.eclipse.tycho:tycho-maven-plugin:0.21.0 or one of its dependencies could not be resolved: Failed to collect dependencies at org.eclipse.tycho:tycho-maven-plugin:jar:0.21.0 -> org.eclipse.tycho:tycho-core:jar:0.21.0 -> org.apache.maven:maven-core:jar:3.0: Failed to read artifact descriptor for org.apache.maven:maven-core:jar:3.0: Could not transfer artifact org.apache.maven:maven-core:pom:3.0 from/to cbi-repo (https://repo.eclipse.org/content/repositories/cbi/): Connect to repo.eclipse.org:443 [repo.eclipse.org/198.41.30.233] failed: Connection timed out -> [Help 2]
[ERROR]  
[ERROR]   The project org.eclipse.webtools.common:org.eclipse.webtools.common:3.6.0-SNAPSHOT (/jobs/genie.webtools/WTP-R3_8_x_Maintenance/workspace/webtools.common/pom.xml) has 1 error
[ERROR]     Unresolveable build extension: Plugin org.eclipse.tycho:tycho-maven-plugin:0.21.0 or one of its dependencies could not be resolved: Failed to collect dependencies at org.eclipse.tycho:tycho-maven-plugin:jar:0.21.0 -> org.eclipse.tycho:tycho-core:jar:0.21.0 -> org.apache.maven:maven-core:jar:3.0: Failed to read artifact descriptor for org.apache.maven:maven-core:jar:3.0: Could not transfer artifact org.apache.maven:maven-core:pom:3.0 from/to cbi-repo (https://repo.eclipse.org/content/repositories/cbi/): Connect to repo.eclipse.org:443 [repo.eclipse.org/198.41.30.233] failed: Connection timed out -> [Help 2]
[ERROR]  
[ERROR]   The project org.eclipse.webtools.common:org.eclipse.webtools.common.fproj:3.6.0-SNAPSHOT (/jobs/genie.webtools/WTP-R3_8_x_Maintenance/workspace/webtools.common.fproj/pom.xml) has 1 error
[ERROR]     Unresolveable build extension: Plugin org.eclipse.tycho:tycho-maven-plugin:0.21.0 or one of its dependencies could not be resolved: Failed to collect dependencies at org.eclipse.tycho:tycho-maven-plugin:jar:0.21.0 -> org.eclipse.tycho:tycho-core:jar:0.21.0 -> org.apache.maven:maven-core:jar:3.0: Failed to read artifact descriptor for org.apache.maven:maven-core:jar:3.0: Could not transfer artifact org.apache.maven:maven-core:pom:3.0 from/to cbi-repo (https://repo.eclipse.org/content/repositories/cbi/): Connect to repo.eclipse.org:443 [repo.eclipse.org/198.41.30.233] failed: Connection timed out -> [Help 2]
[ERROR]  
[ERROR]   The project org.eclipse.webtools.common:org.eclipse.webtools.common.snippets:3.6.0-SNAPSHOT (/jobs/genie.webtools/WTP-R3_8_x_Maintenance/workspace/webtools.common.snippets/pom.xml) has 1 error
[ERROR]     Unresolveable build extension: Plugin org.eclipse.tycho:tycho-maven-plugin:0.21.0 or one of its dependencies could not be resolved: Failed to collect dependencies at org.eclipse.tycho:tycho-maven-plugin:jar:0.21.0 -> org.eclipse.tycho:tycho-core:jar:0.21.0 -> org.apache.maven:maven-core:jar:3.0: Failed to read artifact descriptor for org.apache.maven:maven-core:jar:3.0: Could not transfer artifact org.apache.maven:maven-core:pom:3.0 from/to cbi-repo (https://repo.eclipse.org/content/repositories/cbi/): Connect to repo.eclipse.org:443 [repo.eclipse.org/198.41.30.233] failed: Connection timed out -> [Help 2]
[ERROR]  
[ERROR]   The project org.eclipse.webtools.common:org.eclipse.webtools.common.tests:3.6.0-SNAPSHOT (/jobs/genie.webtools/WTP-R3_8_x_Maintenance/workspace/webtools.common.tests/pom.xml) has 1 error
[ERROR]     Unresolveable build extension: Plugin org.eclipse.tycho:tycho-maven-plugin:0.21.0 or one of its dependencies could not be resolved: Failed to collect dependencies at org.eclipse.tycho:tycho-maven-plugin:jar:0.21.0 -> org.eclipse.tycho:tycho-core:jar:0.21.0 -> org.apache.maven:maven-core:jar:3.0: Failed to read artifact descriptor for org.apache.maven:maven-core:jar:3.0: Could not transfer artifact org.apache.maven:maven-core:pom:3.0 from/to cbi-repo (https://repo.eclipse.org/content/repositories/cbi/): Connect to repo.eclipse.org:443 [repo.eclipse.org/198.41.30.233] failed: Connection timed out -> [Help 2]
[ERROR]  
[ERROR]   The project org.eclipse.webtools.dali:org.eclipse.webtools.dali:3.4.0-SNAPSHOT (/jobs/genie.webtools/WTP-R3_8_x_Maintenance/workspace/webtools.dali/pom.xml) has 1 error
[ERROR]     Unresolveable build extension: Plugin org.eclipse.tycho:tycho-maven-plugin:0.21.0 or one of its dependencies could not be resolved: Failed to collect dependencies at org.eclipse.tycho:tycho-maven-plugin:jar:0.21.0 -> org.eclipse.tycho:tycho-core:jar:0.21.0 -> org.apache.maven:maven-core:jar:3.0: Failed to read artifact descriptor for org.apache.maven:maven-core:jar:3.0: Could not transfer artifact org.apache.maven:maven-core:pom:3.0 from/to cbi-repo (https://repo.eclipse.org/content/repositories/cbi/): Connect to repo.eclipse.org:443 [repo.eclipse.org/198.41.30.233] failed: Connection timed out -> [Help 2]
[ERROR]  
[ERROR]   The project org.eclipse.webtools.ejb:org.eclipse.webtools.ejb:3.6.0-SNAPSHOT (/jobs/genie.webtools/WTP-R3_8_x_Maintenance/workspace/webtools.ejb/pom.xml) has 1 error
[ERROR]     Unresolveable build extension: Plugin org.eclipse.tycho:tycho-maven-plugin:0.21.0 or one of its dependencies could not be resolved: Failed to collect dependencies at org.eclipse.tycho:tycho-maven-plugin:jar:0.21.0 -> org.eclipse.tycho:tycho-core:jar:0.21.0 -> org.apache.maven:maven-core:jar:3.0: Failed to read artifact descriptor for org.apache.maven:maven-core:jar:3.0: Could not transfer artifact org.apache.maven:maven-core:pom:3.0 from/to cbi-repo (https://repo.eclipse.org/content/repositories/cbi/): Connect to repo.eclipse.org:443 [repo.eclipse.org/198.41.30.233] failed: Connection timed out -> [Help 2]
[ERROR]  
[ERROR]   The project org.eclipse.webtools.javaee:org.eclipse.webtools.javaee:3.6.0-SNAPSHOT (/jobs/genie.webtools/WTP-R3_8_x_Maintenance/workspace/webtools.javaee/pom.xml) has 1 error
[ERROR]     Unresolveable build extension: Plugin org.eclipse.tycho:tycho-maven-plugin:0.21.0 or one of its dependencies could not be resolved: Failed to collect dependencies at org.eclipse.tycho:tycho-maven-plugin:jar:0.21.0 -> org.eclipse.tycho:tycho-core:jar:0.21.0 -> org.apache.maven:maven-core:jar:3.0: Failed to read artifact descriptor for org.apache.maven:maven-core:jar:3.0: Could not transfer artifact org.apache.maven:maven-core:pom:3.0 from/to cbi-repo (https://repo.eclipse.org/content/repositories/cbi/): Connect to repo.eclipse.org:443 [repo.eclipse.org/198.41.30.233] failed: Connection timed out -> [Help 2]
[ERROR]  
[ERROR]   The project org.eclipse.webtools.javaee:org.eclipse.webtools.javaee.tests:3.6.0-SNAPSHOT (/jobs/genie.webtools/WTP-R3_8_x_Maintenance/workspace/webtools.javaee.tests/pom.xml) has 1 error
[ERROR]     Unresolveable build extension: Plugin org.eclipse.tycho:tycho-maven-plugin:0.21.0 or one of its dependencies could not be resolved: Failed to collect dependencies at org.eclipse.tycho:tycho-maven-plugin:jar:0.21.0 -> org.eclipse.tycho:tycho-core:jar:0.21.0 -> org.apache.maven:maven-core:jar:3.0: Failed to read artifact descriptor for org.apache.maven:maven-core:jar:3.0: Could not transfer artifact org.apache.maven:maven-core:pom:3.0 from/to cbi-repo (https://repo.eclipse.org/content/repositories/cbi/): Connect to repo.eclipse.org:443 [repo.eclipse.org/198.41.30.233] failed: Connection timed out -> [Help 2]
[ERROR]  
[ERROR]   The project org.eclipse.webtools.jsdt:jsdt-parent:3.6.0-SNAPSHOT (/jobs/genie.webtools/WTP-R3_8_x_Maintenance/workspace/webtools.jsdt/pom.xml) has 1 error
[ERROR]     Unresolveable build extension: Plugin org.eclipse.tycho:tycho-maven-plugin:0.21.0 or one of its dependencies could not be resolved: Failed to collect dependencies at org.eclipse.tycho:tycho-maven-plugin:jar:0.21.0 -> org.eclipse.tycho:tycho-core:jar:0.21.0 -> org.apache.maven:maven-core:jar:3.0: Failed to read artifact descriptor for org.apache.maven:maven-core:jar:3.0: Could not transfer artifact org.apache.maven:maven-core:pom:3.0 from/to cbi-repo (https://repo.eclipse.org/content/repositories/cbi/): Connect to repo.eclipse.org:443 [repo.eclipse.org/198.41.30.233] failed: Connection timed out -> [Help 2]
[ERROR]  
[ERROR]   The project org.eclipse.webtools.jsf:org.eclipse.webtools.jsf:3.6.0-SNAPSHOT (/jobs/genie.webtools/WTP-R3_8_x_Maintenance/workspace/webtools.jsf/pom.xml) has 1 error
[ERROR]     Unresolveable build extension: Plugin org.eclipse.tycho:tycho-maven-plugin:0.21.0 or one of its dependencies could not be resolved: Failed to collect dependencies at org.eclipse.tycho:tycho-maven-plugin:jar:0.21.0 -> org.eclipse.tycho:tycho-core:jar:0.21.0 -> org.apache.maven:maven-core:jar:3.0: Failed to read artifact descriptor for org.apache.maven:maven-core:jar:3.0: Could not transfer artifact org.apache.maven:maven-core:pom:3.0 from/to cbi-repo (https://repo.eclipse.org/content/repositories/cbi/): Connect to repo.eclipse.org:443 [repo.eclipse.org/198.41.30.233] failed: Connection timed out -> [Help 2]
[ERROR]  
[ERROR]   The project org.eclipse.webtools.jsf:org.eclipse.webtools.jsf.docs:3.6.0-SNAPSHOT (/jobs/genie.webtools/WTP-R3_8_x_Maintenance/workspace/webtools.jsf.docs/pom.xml) has 1 error
[ERROR]     Unresolveable build extension: Plugin org.eclipse.tycho:tycho-maven-plugin:0.21.0 or one of its dependencies could not be resolved: Failed to collect dependencies at org.eclipse.tycho:tycho-maven-plugin:jar:0.21.0 -> org.eclipse.tycho:tycho-core:jar:0.21.0 -> org.apache.maven:maven-core:jar:3.0: Failed to read artifact descriptor for org.apache.maven:maven-core:jar:3.0: Could not transfer artifact org.apache.maven:maven-core:pom:3.0 from/to cbi-repo (https://repo.eclipse.org/content/repositories/cbi/): Connect to repo.eclipse.org:443 [repo.eclipse.org/198.41.30.233] failed: Connection timed out -> [Help 2]
[ERROR]  
[ERROR]   The project org.eclipse.webtools.jsf:org.eclipse.webtools.jsf.tests:3.6.0-SNAPSHOT (/jobs/genie.webtools/WTP-R3_8_x_Maintenance/workspace/webtools.jsf.tests/pom.xml) has 1 error
[ERROR]     Unresolveable build extension: Plugin org.eclipse.tycho:tycho-maven-plugin:0.21.0 or one of its dependencies could not be resolved: Failed to collect dependencies at org.eclipse.tycho:tycho-maven-plugin:jar:0.21.0 -> org.eclipse.tycho:tycho-core:jar:0.21.0 -> org.apache.maven:maven-core:jar:3.0: Failed to read artifact descriptor for org.apache.maven:maven-core:jar:3.0: Could not transfer artifact org.apache.maven:maven-core:pom:3.0 from/to cbi-repo (https://repo.eclipse.org/content/repositories/cbi/): Connect to repo.eclipse.org:443 [repo.eclipse.org/198.41.30.233] failed: Connection timed out -> [Help 2]
[ERROR]  
[ERROR]   The project org.eclipse.webtools.servertools:org.eclipse.webtools.servertools:3.6.0-SNAPSHOT (/jobs/genie.webtools/WTP-R3_8_x_Maintenance/workspace/webtools.servertools/pom.xml) has 1 error
[ERROR]     Unresolveable build extension: Plugin org.eclipse.tycho:tycho-maven-plugin:0.21.0 or one of its dependencies could not be resolved: Failed to collect dependencies at org.eclipse.tycho:tycho-maven-plugin:jar:0.21.0 -> org.eclipse.tycho:tycho-core:jar:0.21.0 -> org.apache.maven:maven-core:jar:3.0: Failed to read artifact descriptor for org.apache.maven:maven-core:jar:3.0: Could not transfer artifact org.apache.maven:maven-core:pom:3.0 from/to cbi-repo (https://repo.eclipse.org/content/repositories/cbi/): Connect to repo.eclipse.org:443 [repo.eclipse.org/198.41.30.233] failed: Connection timed out -> [Help 2]
[ERROR]  
[ERROR]   The project org.eclipse.webtools.servertools:org.eclipse.webtools.servertools.docs:3.6.0-SNAPSHOT (/jobs/genie.webtools/WTP-R3_8_x_Maintenance/workspace/webtools.servertools.docs/pom.xml) has 1 error
[ERROR]     Unresolveable build extension: Plugin org.eclipse.tycho:tycho-maven-plugin:0.21.0 or one of its dependencies could not be resolved: Failed to collect dependencies at org.eclipse.tycho:tycho-maven-plugin:jar:0.21.0 -> org.eclipse.tycho:tycho-core:jar:0.21.0 -> org.apache.maven:maven-core:jar:3.0: Failed to read artifact descriptor for org.apache.maven:maven-core:jar:3.0: Could not transfer artifact org.apache.maven:maven-core:pom:3.0 from/to cbi-repo (https://repo.eclipse.org/content/repositories/cbi/): Connect to repo.eclipse.org:443 [repo.eclipse.org/198.41.30.233] failed: Connection timed out -> [Help 2]
[ERROR]  
[ERROR]   The project org.eclipse.webtools.servertools:org.eclipse.webtools.servertools.tests:3.6.0-SNAPSHOT (/jobs/genie.webtools/WTP-R3_8_x_Maintenance/workspace/webtools.servertools.tests/pom.xml) has 1 error
[ERROR]     Unresolveable build extension: Plugin org.eclipse.tycho:tycho-maven-plugin:0.21.0 or one of its dependencies could not be resolved: Failed to collect dependencies at org.eclipse.tycho:tycho-maven-plugin:jar:0.21.0 -> org.eclipse.tycho:tycho-core:jar:0.21.0 -> org.apache.maven:maven-core:jar:3.0: Failed to read artifact descriptor for org.apache.maven:maven-core:jar:3.0: Could not transfer artifact org.apache.maven:maven-core:pom:3.0 from/to cbi-repo (https://repo.eclipse.org/content/repositories/cbi/): Connect to repo.eclipse.org:443 [repo.eclipse.org/198.41.30.233] failed: Connection timed out -> [Help 2]
[ERROR]  
[ERROR]   The project org.eclipse.webtools.sourceediting:sourceediting-parent:3.6.0-SNAPSHOT (/jobs/genie.webtools/WTP-R3_8_x_Maintenance/workspace/webtools.sourceediting/pom.xml) has 1 error
[ERROR]     Unresolveable build extension: Plugin org.eclipse.tycho:tycho-maven-plugin:0.21.0 or one of its dependencies could not be resolved: Failed to collect dependencies at org.eclipse.tycho:tycho-maven-plugin:jar:0.21.0 -> org.eclipse.tycho:tycho-core:jar:0.21.0 -> org.apache.maven:maven-core:jar:3.0: Failed to read artifact descriptor for org.apache.maven:maven-core:jar:3.0: Could not transfer artifact org.apache.maven:maven-core:pom:3.0 from/to cbi-repo (https://repo.eclipse.org/content/repositories/cbi/): Connect to repo.eclipse.org:443 [repo.eclipse.org/198.41.30.233] failed: Connection timed out -> [Help 2]
[ERROR]  
[ERROR]   The project org.eclipse.webtools.sourceediting:org.eclipse.webtools.sourceediting.xpath:3.6.0-SNAPSHOT (/jobs/genie.webtools/WTP-R3_8_x_Maintenance/workspace/webtools.sourceediting.xpath/pom.xml) has 1 error
[ERROR]     Unresolveable build extension: Plugin org.eclipse.tycho:tycho-maven-plugin:0.21.0 or one of its dependencies could not be resolved: Failed to collect dependencies at org.eclipse.tycho:tycho-maven-plugin:jar:0.21.0 -> org.eclipse.tycho:tycho-core:jar:0.21.0 -> org.apache.maven:maven-core:jar:3.0: Failed to read artifact descriptor for org.apache.maven:maven-core:jar:3.0: Could not transfer artifact org.apache.maven:maven-core:pom:3.0 from/to cbi-repo (https://repo.eclipse.org/content/repositories/cbi/): Connect to repo.eclipse.org:443 [repo.eclipse.org/198.41.30.233] failed: Connection timed out -> [Help 2]
[ERROR]  
[ERROR]   The project org.eclipse.webtools.sourceediting:org.eclipse.webtools.sourceediting.xpath.tests:3.6.0-SNAPSHOT (/jobs/genie.webtools/WTP-R3_8_x_Maintenance/workspace/webtools.sourceediting.xpath.tests/pom.xml) has 1 error
[ERROR]     Unresolveable build extension: Plugin org.eclipse.tycho:tycho-maven-plugin:0.21.0 or one of its dependencies could not be resolved: Failed to collect dependencies at org.eclipse.tycho:tycho-maven-plugin:jar:0.21.0 -> org.eclipse.tycho:tycho-core:jar:0.21.0 -> org.apache.maven:maven-core:jar:3.0: Failed to read artifact descriptor for org.apache.maven:maven-core:jar:3.0: Could not transfer artifact org.apache.maven:maven-core:pom:3.0 from/to cbi-repo (https://repo.eclipse.org/content/repositories/cbi/): Connect to repo.eclipse.org:443 [repo.eclipse.org/198.41.30.233] failed: Connection timed out -> [Help 2]
[ERROR]  
[ERROR]   The project org.eclipse.webtools.sourceediting:org.eclipse.webtools.sourceediting.xsl:3.6.0-SNAPSHOT (/jobs/genie.webtools/WTP-R3_8_x_Maintenance/workspace/webtools.sourceediting.xsl/pom.xml) has 1 error
[ERROR]     Unresolveable build extension: Plugin org.eclipse.tycho:tycho-maven-plugin:0.21.0 or one of its dependencies could not be resolved: Failed to collect dependencies at org.eclipse.tycho:tycho-maven-plugin:jar:0.21.0 -> org.eclipse.tycho:tycho-core:jar:0.21.0 -> org.apache.maven:maven-core:jar:3.0: Failed to read artifact descriptor for org.apache.maven:maven-core:jar:3.0: Could not transfer artifact org.apache.maven:maven-core:pom:3.0 from/to cbi-repo (https://repo.eclipse.org/content/repositories/cbi/): Connect to repo.eclipse.org:443 [repo.eclipse.org/198.41.30.233] failed: Connection timed out -> [Help 2]
[ERROR]  
[ERROR]   The project org.eclipse.webtools.sourceediting:org.eclipse.webtools.sourceediting.xsl.tests:3.6.0-SNAPSHOT (/jobs/genie.webtools/WTP-R3_8_x_Maintenance/workspace/webtools.sourceediting.xsl.tests/pom.xml) has 1 error
[ERROR]     Unresolveable build extension: Plugin org.eclipse.tycho:tycho-maven-plugin:0.21.0 or one of its dependencies could not be resolved: Failed to collect dependencies at org.eclipse.tycho:tycho-maven-plugin:jar:0.21.0 -> org.eclipse.tycho:tycho-core:jar:0.21.0 -> org.apache.maven:maven-core:jar:3.0: Failed to read artifact descriptor for org.apache.maven:maven-core:jar:3.0: Could not transfer artifact org.apache.maven:maven-core:pom:3.0 from/to cbi-repo (https://repo.eclipse.org/content/repositories/cbi/): Connect to repo.eclipse.org:443 [repo.eclipse.org/198.41.30.233] failed: Connection timed out -> [Help 2]
[ERROR]  
[ERROR]   The project org.eclipse.webtools.webservices:org.eclipse.webtools.webservices:3.6.0-SNAPSHOT (/jobs/genie.webtools/WTP-R3_8_x_Maintenance/workspace/webtools.webservices/pom.xml) has 1 error
[ERROR]     Unresolveable build extension: Plugin org.eclipse.tycho:tycho-maven-plugin:0.21.0 or one of its dependencies could not be resolved: Failed to collect dependencies at org.eclipse.tycho:tycho-maven-plugin:jar:0.21.0 -> org.eclipse.tycho:tycho-core:jar:0.21.0 -> org.apache.maven:maven-core:jar:3.0: Failed to read artifact descriptor for org.apache.maven:maven-core:jar:3.0: Could not transfer artifact org.apache.maven:maven-core:pom:3.0 from/to cbi-repo (https://repo.eclipse.org/content/repositories/cbi/): Connect to repo.eclipse.org:443 [repo.eclipse.org/198.41.30.233] failed: Connection timed out -> [Help 2]
[ERROR]  
[ERROR]   The project org.eclipse.webtools.webservices:org.eclipse.webtools.webservices.axis2:3.6.0-SNAPSHOT (/jobs/genie.webtools/WTP-R3_8_x_Maintenance/workspace/webtools.webservices.axis2/pom.xml) has 1 error
[ERROR]     Unresolveable build extension: Plugin org.eclipse.tycho:tycho-maven-plugin:0.21.0 or one of its dependencies could not be resolved: Failed to collect dependencies at org.eclipse.tycho:tycho-maven-plugin:jar:0.21.0 -> org.eclipse.tycho:tycho-core:jar:0.21.0 -> org.apache.maven:maven-core:jar:3.0: Failed to read artifact descriptor for org.apache.maven:maven-core:jar:3.0: Could not transfer artifact org.apache.maven:maven-core:pom:3.0 from/to cbi-repo (https://repo.eclipse.org/content/repositories/cbi/): Connect to repo.eclipse.org:443 [repo.eclipse.org/198.41.30.233] failed: Connection timed out -> [Help 2]
[ERROR]  
[ERROR]   The project org.eclipse.webtools.webservices:org.eclipse.webtools.webservices.jaxws:3.6.0-SNAPSHOT (/jobs/genie.webtools/WTP-R3_8_x_Maintenance/workspace/webtools.webservices.jaxws/pom.xml) has 1 error
[ERROR]     Unresolveable build extension: Plugin org.eclipse.tycho:tycho-maven-plugin:0.21.0 or one of its dependencies could not be resolved: Failed to collect dependencies at org.eclipse.tycho:tycho-maven-plugin:jar:0.21.0 -> org.eclipse.tycho:tycho-core:jar:0.21.0 -> org.apache.maven:maven-core:jar:3.0: Failed to read artifact descriptor for org.apache.maven:maven-core:jar:3.0: Could not transfer artifact org.apache.maven:maven-core:pom:3.0 from/to cbi-repo (https://repo.eclipse.org/content/repositories/cbi/): Connect to repo.eclipse.org:443 [repo.eclipse.org/198.41.30.233] failed: Connection timed out -> [Help 2]
[ERROR]
[ERROR] To see the full stack trace of the errors, re-run Maven with the -e switch.
[ERROR] Re-run Maven using the -X switch to enable full debug logging.
[ERROR]
[ERROR] For more information about the errors and possible solutions, please read the following articles:
[ERROR] [Help 1] http://cwiki.apache.org/confluence/display/MAVEN/ProjectBuildingException
[ERROR] [Help 2] http://cwiki.apache.org/confluence/display/MAVEN/PluginResolutionException
[DEBUG] Waiting for process to finish
[DEBUG] Result: 1
Terminating xvnc.
Archiving artifacts

--
This message is automatically generated by Hudson.
For more information on Hudson, see: http://hudson-ci.org/
_______________________________________________
wtp-releng mailing list
[hidden email]
To change your delivery options, retrieve your password, or unsubscribe from this list, visit
https://dev.eclipse.org/mailman/listinfo/wtp-releng
Reply | Threaded
Open this post in threaded view
|  
Report Content as Inappropriate

[Hudson] Hudson build is back to normal : WTP-R3_8_x_Maintenance #100

hudsonbuild
See <https://hudson.eclipse.org/webtools/job/WTP-R3_8_x_Maintenance/100/>


--
This message is automatically generated by Hudson.
For more information on Hudson, see: http://hudson-ci.org/
_______________________________________________
wtp-releng mailing list
[hidden email]
To change your delivery options, retrieve your password, or unsubscribe from this list, visit
https://dev.eclipse.org/mailman/listinfo/wtp-releng
Loading...