Quantcast

[Hudson] Build failed in Hudson: WTP-R3_9_Integration #204

classic Classic list List threaded Threaded
4 messages Options
Reply | Threaded
Open this post in threaded view
|  
Report Content as Inappropriate

[Hudson] Build failed in Hudson: WTP-R3_9_Integration #204

hudsonbuild
See <https://hudson.eclipse.org/webtools/job/WTP-R3_9_Integration/204/>

------------------------------------------
[...truncated 93892 lines...]
[INFO] PsychoPath XPath 2.0 Processor ..................... SKIPPED
[INFO] org.eclipse.wst.xml.xpath.ui ....................... SKIPPED
[INFO] PsychoPath XPath 2.0 Processor: User Documentation . SKIPPED
[INFO] PsychoPath XPath 2.0 Processor: Branding Plug-in ... SKIPPED
[INFO] PsychoPath XPath 2.0 Processor Feature ............. SKIPPED
[INFO] org.eclipse.webtools.sourceediting.xsl ............. SKIPPED
[INFO] XSLT Core Plugin ................................... SKIPPED
[INFO] XSLT Launching Plugin .............................. SKIPPED
[INFO] XSLT Debug UI Plugin ............................... SKIPPED
[INFO] org.eclipse.wst.xsl.doc ............................ SKIPPED
[INFO] XSLT EXSLT Core Plugin ............................. SKIPPED
[INFO] XSLT UI Plugin ..................................... SKIPPED
[INFO] XSLT EXSLT UI Plugin ............................... SKIPPED
[INFO] XSLT JAXP Debug Plugin ............................. SKIPPED
[INFO] XSLT Xalan Plugin .................................. SKIPPED
[INFO] XSLT Saxon Plugin .................................. SKIPPED
[INFO] XSL Tools Branding Plugin .......................... SKIPPED
[INFO] XSLT JAXP Launching UI Plugin ...................... SKIPPED
[INFO] XSLT JAXP Debug UI Plugin .......................... SKIPPED
[INFO] XSLT FeaturePlugin ................................. SKIPPED
[INFO] org.eclipse.wst.xsl.sdk.documentation .............. SKIPPED
[INFO] org.eclipse.wst.xsl_sdk.feature .................... SKIPPED
[INFO] org.eclipse.wst.server.http.core ................... SKIPPED
[INFO] org.eclipse.wst.server.http.ui ..................... SKIPPED
[INFO] org.eclipse.wst.server.preview ..................... SKIPPED
[INFO] org.eclipse.wst.server.preview.adapter ............. SKIPPED
[INFO] org.eclipse.wst.server_adapters.feature ............ SKIPPED
[INFO] org.eclipse.wst.server_adapters.sdk.feature ........ SKIPPED
[INFO] org.eclipse.wst.sdk ................................ SKIPPED
[INFO] org.eclipse.wst.common.project.facet.core.tests .... SKIPPED
[INFO] org.eclipse.wst.common.project.facet.ui.tests ...... SKIPPED
[INFO] org.eclipse.wst.common.snippets.tests .............. SKIPPED
[INFO] org.eclipse.wst.common.tests.ui .................... SKIPPED
[INFO] org.eclipse.wst.common.tests.validation ............ SKIPPED
[INFO] org.eclipse.wst.common.tests.validation.guard ...... SKIPPED
[INFO] org.eclipse.wst.internet.cache.tests ............... SKIPPED
[INFO] org.eclipse.wst.common_tests.feature ............... SKIPPED
[INFO] org.eclipse.wst.css.core.tests ..................... SKIPPED
[INFO] org.eclipse.wst.css.tests.encoding ................. SKIPPED
[INFO] org.eclipse.wst.css.ui.tests ....................... SKIPPED
[INFO] org.eclipse.wst.dtd.core.tests ..................... SKIPPED
[INFO] org.eclipse.wst.dtd.ui.tests ....................... SKIPPED
[INFO] org.eclipse.wst.html.core.tests .................... SKIPPED
[INFO] org.eclipse.wst.html.tests.encoding ................ SKIPPED
[INFO] org.eclipse.wst.html.ui.tests ...................... SKIPPED
[INFO] org.eclipse.wst.internet.monitor.core.tests ........ SKIPPED
[INFO] org.eclipse.wst.internet.monitor.ui.tests .......... SKIPPED
[INFO] tests .............................................. SKIPPED
[INFO] org.eclipse.wst.jsdt.core.tests.compiler ........... SKIPPED
[INFO] org.eclipse.wst.jsdt.core.tests.model .............. SKIPPED
[INFO] org.eclipse.wst.jsdt.debug.core.tests .............. SKIPPED
[INFO] org.eclipse.wst.jsdt.debug.rhino.tests ............. SKIPPED
[INFO] org.eclipse.wst.jsdt.js.node.common.tests .......... SKIPPED
[INFO] org.eclipse.wst.jsdt.ui.tests ...................... SKIPPED
[INFO] org.eclipse.wst.jsdt.web.core.tests ................ SKIPPED
[INFO] org.eclipse.wst.jsdt.web.ui.tests .................. SKIPPED
[INFO] org.eclipse.wtp.releng.tests ....................... SKIPPED
[INFO] org.eclipse.wst.jsdt_tests.feature ................. SKIPPED
[INFO] org.eclipse.wst.server_tests.feature ............... SKIPPED
[INFO] org.eclipse.wst.sse.core.tests ..................... SKIPPED
[INFO] org.eclipse.wst.sse.ui.tests ....................... SKIPPED
[INFO] org.eclipse.wtp.releng.fixups ...................... SKIPPED
[INFO] org.eclipse.wtp.releng.fixups.feature .............. SKIPPED
[INFO] org.eclipse.wtp.releng.tools ....................... SKIPPED
[INFO] org.eclipse.wtp.releng.tools.feature ............... SKIPPED
[INFO] org.eclipse.wtp.releng.tests.feature ............... SKIPPED
[INFO] org.eclipse.wst.xml.catalog.tests .................. SKIPPED
[INFO] org.eclipse.wst.xml.core.tests ..................... SKIPPED
[INFO] org.eclipse.wst.xml.ui.tests ....................... SKIPPED
[INFO] org.eclipse.wst.xml.validation.tests ............... SKIPPED
[INFO] org.eclipse.wst.xsd.validation.tests ............... SKIPPED
[INFO] org.eclipse.wst.xsd.core.tests ..................... SKIPPED
[INFO] org.eclipse.wst.xsd.ui.tests ....................... SKIPPED
[INFO] org.eclipse.wst.xml_tests.feature .................. SKIPPED
[INFO] org.eclipse.webtools.sourceediting.xpath.tests ..... SKIPPED
[INFO] org.eclipse.wst.xml.xpath.core.tests ............... SKIPPED
[INFO] org.eclipse.wst.xml.xpath.ui.tests ................. SKIPPED
[INFO] PsychoPath XPath 2.0 Processor: XQuery Test Suite .. SKIPPED
[INFO] PsychoPath XPath 2.0 Processor: Tests .............. SKIPPED
[INFO] org.eclipse.webtools.sourceediting.xsl.tests ....... SKIPPED
[INFO] XSLT Core Tests .................................... SKIPPED
[INFO] EXSLT Core Tests ................................... SKIPPED
[INFO] XSLT UI Tests ...................................... SKIPPED
[INFO] EXSLT UI Tests ..................................... SKIPPED
[INFO] JAXP Debug Tests ................................... SKIPPED
[INFO] XSL Launching Tests ................................ SKIPPED
[INFO] org.eclipse.wst.xsl.tests .......................... SKIPPED
[INFO] org.eclipse.wst.xsl_tests.feature .................. SKIPPED
[INFO] org.eclipse.wst.web_tests.feature .................. SKIPPED
[INFO] org.eclipse.wst.tests.feature ...................... SKIPPED
[INFO] org.eclipse.wtp.requiredpreques .................... SKIPPED
[INFO] org.eclipse.wtp.xml.dev ............................ SKIPPED
[INFO] org.eclipse.wtp.xml.dev.assembly.feature ........... SKIPPED
[INFO] org.uddi4j.feature ................................. SKIPPED
[INFO] org.eclipse.jst .................................... SKIPPED
[INFO] org.eclipse.wst .................................... SKIPPED
[INFO] org.eclipse.wst.doc.isv.feature .................... SKIPPED
[INFO] org.eclipse.wst.doc.user.feature ................... SKIPPED
[INFO] org.eclipse.wtp.epp.package.jee.intro .............. SKIPPED
[INFO] org.eclipse.wtp.epp.package.capabilities ........... SKIPPED
[INFO] org.eclipse.wtp.javascript.capabilities ............ SKIPPED
[INFO] org.eclipse.wtp.jee.capabilities ................... SKIPPED
[INFO] org.eclipse.wtp.web.capabilities ................... SKIPPED
[INFO] org.eclipse.wtp.xml.capabilities ................... SKIPPED
[INFO] org.eclipse.wtp.capabilities.feature ............... SKIPPED
[INFO] org.eclipse.wtp.capabilities ....................... SKIPPED
[INFO] org.eclipse.wtp.feature.branding.template .......... SKIPPED
[INFO] org.eclipse.wtp.jee ................................ SKIPPED
[INFO] repositories ....................................... SKIPPED
[INFO] org.eclipse.webtools.dali .......................... SKIPPED
[INFO] org.eclipse.jpt.common.utility ..................... SKIPPED
[INFO] org.eclipse.jpt.common.core ........................ SKIPPED
[INFO] org.eclipse.jpt.common.ui .......................... SKIPPED
[INFO] org.eclipse.jpt.common.branding .................... SKIPPED
[INFO] org.eclipse.jpt.common.feature ..................... SKIPPED
[INFO] org.eclipse.jpt.common_sdk.feature ................. SKIPPED
[INFO] org.eclipse.jpt.common.eclipselink.core ............ SKIPPED
[INFO] org.eclipse.jpt.common.eclipselink.branding ........ SKIPPED
[INFO] org.eclipse.jpt.common.eclipselink.feature ......... SKIPPED
[INFO] org.eclipse.jpt.common.eclipselink_sdk.feature ..... SKIPPED
[INFO] org.eclipse.jpt.doc.isv ............................ SKIPPED
[INFO] org.eclipse.jpt.jpa.db ............................. SKIPPED
[INFO] org.eclipse.jpt.jpa.core ........................... SKIPPED
[INFO] org.eclipse.jpt.jpa.annotate ....................... SKIPPED
[INFO] org.eclipse.jpt.jpa.db.ui .......................... SKIPPED
[INFO] org.eclipse.jpt.jpa.gen ............................ SKIPPED
[INFO] org.eclipse.jpt.jpa.ui ............................. SKIPPED
[INFO] org.eclipse.jpt.doc.user ........................... SKIPPED
[INFO] org.eclipse.jpt.jpa.branding ....................... SKIPPED
[INFO] org.eclipse.jpt.jpa.feature ........................ SKIPPED
[INFO] org.eclipse.jpt.jpa_sdk.feature .................... SKIPPED
[INFO] org.eclipse.jpt.jpa.eclipselink.core ............... SKIPPED
[INFO] org.eclipse.jpt.jpa.eclipselink.core.ddlgen ........ SKIPPED
[INFO] org.eclipse.jpt.jpa.eclipselink.ui ................. SKIPPED
[INFO] org.eclipse.jpt.jpa.eclipselink.branding ........... SKIPPED
[INFO] org.eclipse.jpt.jpa.eclipselink.feature ............ SKIPPED
[INFO] org.eclipse.jpt.jpa.eclipselink_sdk.feature ........ SKIPPED
[INFO] org.eclipse.jpt.jaxb.core .......................... SKIPPED
[INFO] org.eclipse.jpt.jaxb.core.schemagen ................ SKIPPED
[INFO] org.eclipse.jpt.jaxb.ui ............................ SKIPPED
[INFO] org.eclipse.jpt.jaxb.branding ...................... SKIPPED
[INFO] org.eclipse.jpt.jaxb.feature ....................... SKIPPED
[INFO] org.eclipse.jpt.jaxb_sdk.feature ................... SKIPPED
[INFO] org.eclipse.jpt.jaxb.eclipselink.core .............. SKIPPED
[INFO] org.eclipse.jpt.jaxb.eclipselink.core.schemagen .... SKIPPED
[INFO] org.eclipse.jpt.jaxb.eclipselink.ui ................ SKIPPED
[INFO] org.eclipse.jpt.jaxb.eclipselink.branding .......... SKIPPED
[INFO] org.eclipse.jpt.jaxb.eclipselink.feature ........... SKIPPED
[INFO] org.eclipse.jpt.jaxb.eclipselink_sdk.feature ....... SKIPPED
[INFO] org.eclipse.jpt.dbws.eclipselink.core.gen .......... SKIPPED
[INFO] org.eclipse.jpt.dbws.eclipselink.ui ................ SKIPPED
[INFO] org.eclipse.jpt.dbws.eclipselink.branding .......... SKIPPED
[INFO] org.eclipse.jpt.dbws.eclipselink.feature ........... SKIPPED
[INFO] org.eclipse.jpt.dbws.eclipselink_sdk.feature ....... SKIPPED
[INFO] JPA Diagram Editor Branding Plug-in ................ SKIPPED
[INFO] JPA Diagram Editor Plug-in ......................... SKIPPED
[INFO] JPA Diagram Editor Branding Plug-in ................ SKIPPED
[INFO] JPA Diagram Editor Feature ......................... SKIPPED
[INFO] org.eclipse.jpt.jpadiagrameditor_sdk.feature ....... SKIPPED
[INFO] dali4x-sdk ......................................... SKIPPED
[INFO] org.eclipse.jpt.common.utility.tests ............... SKIPPED
[INFO] org.eclipse.jpt.common.core.tests .................. SKIPPED
[INFO] org.eclipse.jpt.common.tests.feature ............... SKIPPED
[INFO] org.eclipse.jpt.jpa.core.tests.extension.resource .. SKIPPED
[INFO] org.eclipse.jpt.jpa.core.tests ..................... SKIPPED
[INFO] org.eclipse.jpt.jpa.tests.feature .................. SKIPPED
[INFO] org.eclipse.jpt.jpa.eclipselink.core.tests ......... SKIPPED
[INFO] org.eclipse.jpt.jpa.eclipselink.tests.feature ...... SKIPPED
[INFO] org.eclipse.jpt.jaxb.core.tests .................... SKIPPED
[INFO] org.eclipse.jpt.jaxb.tests.feature ................. SKIPPED
[INFO] org.eclipse.jpt.jaxb.eclipselink.core.tests ........ SKIPPED
[INFO] org.eclipse.jpt.jaxb.eclipselink.tests.feature ..... SKIPPED
[INFO] JPA Diagram Editor Test Plug-in .................... SKIPPED
[INFO] org.eclipse.jpt.jpadiagrameditor.tests.feature ..... SKIPPED
[INFO] dali4x.tests ....................................... SKIPPED
[INFO] jst4x-sdk .......................................... SKIPPED
[INFO] jst4x.tests ........................................ SKIPPED
[INFO] org.eclipse.wst.jsdt.chromium.debug.js ............. SKIPPED
[INFO] org.eclipse.wst.jsdt.chromium.debug.jsdtbridge ..... SKIPPED
[INFO] org.eclipse.wst.jsdt.chromium.wipbackend.dev ....... SKIPPED
[INFO] org.eclipse.wst.jsdt.chromium.wipbackend.protocol_1_0 SKIPPED
[INFO] org.eclipse.wst.jsdt.chromium.debug.feature ........ SKIPPED
[INFO] org.eclipse.wst.jsdt.chromium_sdk.feature .......... SKIPPED
[INFO] wst4x-sdk .......................................... SKIPPED
[INFO] org.eclipse.wst.jsdt.chromium.debug.core.tests ..... SKIPPED
[INFO] org.eclipse.wst.jsdt.chromium.tests ................ SKIPPED
[INFO] org.eclipse.wst.jsdt.chromium_tests.feature ........ SKIPPED
[INFO] org.eclipse.wst.json.core.tests .................... SKIPPED
[INFO] org.eclipse.wst.json_tests.feature ................. SKIPPED
[INFO] wst4x.tests ........................................ SKIPPED
[INFO] repository ......................................... SKIPPED
[INFO] repositoryunittests ................................ SKIPPED
[INFO] org.eclipse.jpt.assembly.feature ................... SKIPPED
[INFO] org.eclipse.jpt_sdk.assembly.feature ............... SKIPPED
[INFO] org.eclipse.jpt.tests.assembly.feature ............. SKIPPED
[INFO] JPA Editor Update Site ............................. SKIPPED
[INFO] org.eclipse.jst.doc.user.feature ................... SKIPPED
[INFO] org.eclipse.wst.jsdt.js.common.tests ............... SKIPPED
[INFO] org.eclipse.wst.jsdt.integration.tests ............. SKIPPED
[INFO] org.eclipse.jsf.assembly.feature ................... SKIPPED
[INFO] org.eclipse.jst.jsf.doc.feature .................... SKIPPED
[INFO] org.eclipse.wst.server.http.core.tests ............. SKIPPED
[INFO] org.eclipse.wst.server.util.tests .................. SKIPPED
[INFO] PsychoPath XPath 2.0 Processor: SDK Documentation .. SKIPPED
[INFO] PsychoPath XPath 2.0 Processor: SDK Feature ........ SKIPPED
[INFO] PsychoPath XPath 2.0 Processor: Tests for WTP type support SKIPPED
[INFO] org.eclipse.jst.ws.jaxws.assembly.feature .......... SKIPPED
[INFO] wtp-aggregator ..................................... SKIPPED
[INFO] ------------------------------------------------------------------------
[INFO] BUILD FAILURE
[INFO] ------------------------------------------------------------------------
[INFO] Total time: 22:55 min
[INFO] Finished at: 2017-02-22T00:44:15-05:00
[INFO] Final Memory: 962M/11924M
[INFO] ------------------------------------------------------------------------
[INFO] o.h.m.e.h.MavenExecutionResultHandler - Build failed with exception(s)
[INFO] o.h.m.e.h.MavenExecutionResultHandler - [1] org.apache.maven.lifecycle.LifecycleExecutionException: Failed to execute goal org.eclipse.tycho:tycho-compiler-plugin:0.21.0:compile (default-compile) on project org.eclipse.jst.jsp.core: Compilation failure
[DEBUG] Closing connection to remote
[ERROR] Failed to execute goal org.eclipse.tycho:tycho-compiler-plugin:0.21.0:compile (default-compile) on project org.eclipse.jst.jsp.core: Compilation failure: Compilation failure:
[ERROR] /jobs/genie.webtools/WTP-R3_9_Integration/workspace/webtools.sourceediting/bundles/org.eclipse.jst.jsp.core/src/org/eclipse/jst/jsp/core/internal/util/CommonXML.java:[48]
[ERROR] documentBuilderFactory.setFeature("http://xml.org/sax/features/external-general-entities", resolveExternalEntities);
[ERROR] ^^^^^^^^^^
[ERROR] The method setFeature(String, boolean) is undefined for the type DocumentBuilderFactory
[ERROR] /jobs/genie.webtools/WTP-R3_9_Integration/workspace/webtools.sourceediting/bundles/org.eclipse.jst.jsp.core/src/org/eclipse/jst/jsp/core/internal/util/CommonXML.java:[49]
[ERROR] documentBuilderFactory.setFeature("http://xml.org/sax/features/external-parameter-entities", resolveExternalEntities);
[ERROR] ^^^^^^^^^^
[ERROR] The method setFeature(String, boolean) is undefined for the type DocumentBuilderFactory
[ERROR] /jobs/genie.webtools/WTP-R3_9_Integration/workspace/webtools.sourceediting/bundles/org.eclipse.jst.jsp.core/src/org/eclipse/jst/jsp/core/internal/util/CommonXML.java:[67]
[ERROR] instance.setFeature("http://xml.org/sax/features/external-general-entities", resolveExternalEntities);
[ERROR] ^^^^^^^^^^
[ERROR] The method setFeature(String, boolean) is undefined for the type DocumentBuilderFactory
[ERROR] /jobs/genie.webtools/WTP-R3_9_Integration/workspace/webtools.sourceediting/bundles/org.eclipse.jst.jsp.core/src/org/eclipse/jst/jsp/core/internal/util/CommonXML.java:[68]
[ERROR] instance.setFeature("http://xml.org/sax/features/external-parameter-entities", resolveExternalEntities);
[ERROR] ^^^^^^^^^^
[ERROR] The method setFeature(String, boolean) is undefined for the type DocumentBuilderFactory
[ERROR] -> [Help 1]
[ERROR]
[ERROR] To see the full stack trace of the errors, re-run Maven with the -e switch.
[ERROR] Re-run Maven using the -X switch to enable full debug logging.
[ERROR]
[ERROR] For more information about the errors and possible solutions, please read the following articles:
[ERROR] [Help 1] http://cwiki.apache.org/confluence/display/MAVEN/MojoFailureException
[ERROR]
[ERROR] After correcting the problems, you can resume the build with the command
[ERROR]   mvn <goals> -rf :org.eclipse.jst.jsp.core
[DEBUG] Waiting for process to finish
[DEBUG] Result: 1
Terminating xvnc.
Archiving artifacts

--
This message is automatically generated by Hudson.
For more information on Hudson, see: http://hudson-ci.org/
_______________________________________________
wtp-releng mailing list
[hidden email]
To change your delivery options, retrieve your password, or unsubscribe from this list, visit
https://dev.eclipse.org/mailman/listinfo/wtp-releng
Reply | Threaded
Open this post in threaded view
|  
Report Content as Inappropriate

[Hudson] Build failed in Hudson: WTP-R3_9_Integration #205

hudsonbuild
See <https://hudson.eclipse.org/webtools/job/WTP-R3_9_Integration/205/>

------------------------------------------
[...truncated 93892 lines...]
[INFO] PsychoPath XPath 2.0 Processor ..................... SKIPPED
[INFO] org.eclipse.wst.xml.xpath.ui ....................... SKIPPED
[INFO] PsychoPath XPath 2.0 Processor: User Documentation . SKIPPED
[INFO] PsychoPath XPath 2.0 Processor: Branding Plug-in ... SKIPPED
[INFO] PsychoPath XPath 2.0 Processor Feature ............. SKIPPED
[INFO] org.eclipse.webtools.sourceediting.xsl ............. SKIPPED
[INFO] XSLT Core Plugin ................................... SKIPPED
[INFO] XSLT Launching Plugin .............................. SKIPPED
[INFO] XSLT Debug UI Plugin ............................... SKIPPED
[INFO] org.eclipse.wst.xsl.doc ............................ SKIPPED
[INFO] XSLT EXSLT Core Plugin ............................. SKIPPED
[INFO] XSLT UI Plugin ..................................... SKIPPED
[INFO] XSLT EXSLT UI Plugin ............................... SKIPPED
[INFO] XSLT JAXP Debug Plugin ............................. SKIPPED
[INFO] XSLT Xalan Plugin .................................. SKIPPED
[INFO] XSLT Saxon Plugin .................................. SKIPPED
[INFO] XSL Tools Branding Plugin .......................... SKIPPED
[INFO] XSLT JAXP Launching UI Plugin ...................... SKIPPED
[INFO] XSLT JAXP Debug UI Plugin .......................... SKIPPED
[INFO] XSLT FeaturePlugin ................................. SKIPPED
[INFO] org.eclipse.wst.xsl.sdk.documentation .............. SKIPPED
[INFO] org.eclipse.wst.xsl_sdk.feature .................... SKIPPED
[INFO] org.eclipse.wst.server.http.core ................... SKIPPED
[INFO] org.eclipse.wst.server.http.ui ..................... SKIPPED
[INFO] org.eclipse.wst.server.preview ..................... SKIPPED
[INFO] org.eclipse.wst.server.preview.adapter ............. SKIPPED
[INFO] org.eclipse.wst.server_adapters.feature ............ SKIPPED
[INFO] org.eclipse.wst.server_adapters.sdk.feature ........ SKIPPED
[INFO] org.eclipse.wst.sdk ................................ SKIPPED
[INFO] org.eclipse.wst.common.project.facet.core.tests .... SKIPPED
[INFO] org.eclipse.wst.common.project.facet.ui.tests ...... SKIPPED
[INFO] org.eclipse.wst.common.snippets.tests .............. SKIPPED
[INFO] org.eclipse.wst.common.tests.ui .................... SKIPPED
[INFO] org.eclipse.wst.common.tests.validation ............ SKIPPED
[INFO] org.eclipse.wst.common.tests.validation.guard ...... SKIPPED
[INFO] org.eclipse.wst.internet.cache.tests ............... SKIPPED
[INFO] org.eclipse.wst.common_tests.feature ............... SKIPPED
[INFO] org.eclipse.wst.css.core.tests ..................... SKIPPED
[INFO] org.eclipse.wst.css.tests.encoding ................. SKIPPED
[INFO] org.eclipse.wst.css.ui.tests ....................... SKIPPED
[INFO] org.eclipse.wst.dtd.core.tests ..................... SKIPPED
[INFO] org.eclipse.wst.dtd.ui.tests ....................... SKIPPED
[INFO] org.eclipse.wst.html.core.tests .................... SKIPPED
[INFO] org.eclipse.wst.html.tests.encoding ................ SKIPPED
[INFO] org.eclipse.wst.html.ui.tests ...................... SKIPPED
[INFO] org.eclipse.wst.internet.monitor.core.tests ........ SKIPPED
[INFO] org.eclipse.wst.internet.monitor.ui.tests .......... SKIPPED
[INFO] tests .............................................. SKIPPED
[INFO] org.eclipse.wst.jsdt.core.tests.compiler ........... SKIPPED
[INFO] org.eclipse.wst.jsdt.core.tests.model .............. SKIPPED
[INFO] org.eclipse.wst.jsdt.debug.core.tests .............. SKIPPED
[INFO] org.eclipse.wst.jsdt.debug.rhino.tests ............. SKIPPED
[INFO] org.eclipse.wst.jsdt.js.node.common.tests .......... SKIPPED
[INFO] org.eclipse.wst.jsdt.ui.tests ...................... SKIPPED
[INFO] org.eclipse.wst.jsdt.web.core.tests ................ SKIPPED
[INFO] org.eclipse.wst.jsdt.web.ui.tests .................. SKIPPED
[INFO] org.eclipse.wtp.releng.tests ....................... SKIPPED
[INFO] org.eclipse.wst.jsdt_tests.feature ................. SKIPPED
[INFO] org.eclipse.wst.server_tests.feature ............... SKIPPED
[INFO] org.eclipse.wst.sse.core.tests ..................... SKIPPED
[INFO] org.eclipse.wst.sse.ui.tests ....................... SKIPPED
[INFO] org.eclipse.wtp.releng.fixups ...................... SKIPPED
[INFO] org.eclipse.wtp.releng.fixups.feature .............. SKIPPED
[INFO] org.eclipse.wtp.releng.tools ....................... SKIPPED
[INFO] org.eclipse.wtp.releng.tools.feature ............... SKIPPED
[INFO] org.eclipse.wtp.releng.tests.feature ............... SKIPPED
[INFO] org.eclipse.wst.xml.catalog.tests .................. SKIPPED
[INFO] org.eclipse.wst.xml.core.tests ..................... SKIPPED
[INFO] org.eclipse.wst.xml.ui.tests ....................... SKIPPED
[INFO] org.eclipse.wst.xml.validation.tests ............... SKIPPED
[INFO] org.eclipse.wst.xsd.validation.tests ............... SKIPPED
[INFO] org.eclipse.wst.xsd.core.tests ..................... SKIPPED
[INFO] org.eclipse.wst.xsd.ui.tests ....................... SKIPPED
[INFO] org.eclipse.wst.xml_tests.feature .................. SKIPPED
[INFO] org.eclipse.webtools.sourceediting.xpath.tests ..... SKIPPED
[INFO] org.eclipse.wst.xml.xpath.core.tests ............... SKIPPED
[INFO] org.eclipse.wst.xml.xpath.ui.tests ................. SKIPPED
[INFO] PsychoPath XPath 2.0 Processor: XQuery Test Suite .. SKIPPED
[INFO] PsychoPath XPath 2.0 Processor: Tests .............. SKIPPED
[INFO] org.eclipse.webtools.sourceediting.xsl.tests ....... SKIPPED
[INFO] XSLT Core Tests .................................... SKIPPED
[INFO] EXSLT Core Tests ................................... SKIPPED
[INFO] XSLT UI Tests ...................................... SKIPPED
[INFO] EXSLT UI Tests ..................................... SKIPPED
[INFO] JAXP Debug Tests ................................... SKIPPED
[INFO] XSL Launching Tests ................................ SKIPPED
[INFO] org.eclipse.wst.xsl.tests .......................... SKIPPED
[INFO] org.eclipse.wst.xsl_tests.feature .................. SKIPPED
[INFO] org.eclipse.wst.web_tests.feature .................. SKIPPED
[INFO] org.eclipse.wst.tests.feature ...................... SKIPPED
[INFO] org.eclipse.wtp.requiredpreques .................... SKIPPED
[INFO] org.eclipse.wtp.xml.dev ............................ SKIPPED
[INFO] org.eclipse.wtp.xml.dev.assembly.feature ........... SKIPPED
[INFO] org.uddi4j.feature ................................. SKIPPED
[INFO] org.eclipse.jst .................................... SKIPPED
[INFO] org.eclipse.wst .................................... SKIPPED
[INFO] org.eclipse.wst.doc.isv.feature .................... SKIPPED
[INFO] org.eclipse.wst.doc.user.feature ................... SKIPPED
[INFO] org.eclipse.wtp.epp.package.jee.intro .............. SKIPPED
[INFO] org.eclipse.wtp.epp.package.capabilities ........... SKIPPED
[INFO] org.eclipse.wtp.javascript.capabilities ............ SKIPPED
[INFO] org.eclipse.wtp.jee.capabilities ................... SKIPPED
[INFO] org.eclipse.wtp.web.capabilities ................... SKIPPED
[INFO] org.eclipse.wtp.xml.capabilities ................... SKIPPED
[INFO] org.eclipse.wtp.capabilities.feature ............... SKIPPED
[INFO] org.eclipse.wtp.capabilities ....................... SKIPPED
[INFO] org.eclipse.wtp.feature.branding.template .......... SKIPPED
[INFO] org.eclipse.wtp.jee ................................ SKIPPED
[INFO] repositories ....................................... SKIPPED
[INFO] org.eclipse.webtools.dali .......................... SKIPPED
[INFO] org.eclipse.jpt.common.utility ..................... SKIPPED
[INFO] org.eclipse.jpt.common.core ........................ SKIPPED
[INFO] org.eclipse.jpt.common.ui .......................... SKIPPED
[INFO] org.eclipse.jpt.common.branding .................... SKIPPED
[INFO] org.eclipse.jpt.common.feature ..................... SKIPPED
[INFO] org.eclipse.jpt.common_sdk.feature ................. SKIPPED
[INFO] org.eclipse.jpt.common.eclipselink.core ............ SKIPPED
[INFO] org.eclipse.jpt.common.eclipselink.branding ........ SKIPPED
[INFO] org.eclipse.jpt.common.eclipselink.feature ......... SKIPPED
[INFO] org.eclipse.jpt.common.eclipselink_sdk.feature ..... SKIPPED
[INFO] org.eclipse.jpt.doc.isv ............................ SKIPPED
[INFO] org.eclipse.jpt.jpa.db ............................. SKIPPED
[INFO] org.eclipse.jpt.jpa.core ........................... SKIPPED
[INFO] org.eclipse.jpt.jpa.annotate ....................... SKIPPED
[INFO] org.eclipse.jpt.jpa.db.ui .......................... SKIPPED
[INFO] org.eclipse.jpt.jpa.gen ............................ SKIPPED
[INFO] org.eclipse.jpt.jpa.ui ............................. SKIPPED
[INFO] org.eclipse.jpt.doc.user ........................... SKIPPED
[INFO] org.eclipse.jpt.jpa.branding ....................... SKIPPED
[INFO] org.eclipse.jpt.jpa.feature ........................ SKIPPED
[INFO] org.eclipse.jpt.jpa_sdk.feature .................... SKIPPED
[INFO] org.eclipse.jpt.jpa.eclipselink.core ............... SKIPPED
[INFO] org.eclipse.jpt.jpa.eclipselink.core.ddlgen ........ SKIPPED
[INFO] org.eclipse.jpt.jpa.eclipselink.ui ................. SKIPPED
[INFO] org.eclipse.jpt.jpa.eclipselink.branding ........... SKIPPED
[INFO] org.eclipse.jpt.jpa.eclipselink.feature ............ SKIPPED
[INFO] org.eclipse.jpt.jpa.eclipselink_sdk.feature ........ SKIPPED
[INFO] org.eclipse.jpt.jaxb.core .......................... SKIPPED
[INFO] org.eclipse.jpt.jaxb.core.schemagen ................ SKIPPED
[INFO] org.eclipse.jpt.jaxb.ui ............................ SKIPPED
[INFO] org.eclipse.jpt.jaxb.branding ...................... SKIPPED
[INFO] org.eclipse.jpt.jaxb.feature ....................... SKIPPED
[INFO] org.eclipse.jpt.jaxb_sdk.feature ................... SKIPPED
[INFO] org.eclipse.jpt.jaxb.eclipselink.core .............. SKIPPED
[INFO] org.eclipse.jpt.jaxb.eclipselink.core.schemagen .... SKIPPED
[INFO] org.eclipse.jpt.jaxb.eclipselink.ui ................ SKIPPED
[INFO] org.eclipse.jpt.jaxb.eclipselink.branding .......... SKIPPED
[INFO] org.eclipse.jpt.jaxb.eclipselink.feature ........... SKIPPED
[INFO] org.eclipse.jpt.jaxb.eclipselink_sdk.feature ....... SKIPPED
[INFO] org.eclipse.jpt.dbws.eclipselink.core.gen .......... SKIPPED
[INFO] org.eclipse.jpt.dbws.eclipselink.ui ................ SKIPPED
[INFO] org.eclipse.jpt.dbws.eclipselink.branding .......... SKIPPED
[INFO] org.eclipse.jpt.dbws.eclipselink.feature ........... SKIPPED
[INFO] org.eclipse.jpt.dbws.eclipselink_sdk.feature ....... SKIPPED
[INFO] JPA Diagram Editor Branding Plug-in ................ SKIPPED
[INFO] JPA Diagram Editor Plug-in ......................... SKIPPED
[INFO] JPA Diagram Editor Branding Plug-in ................ SKIPPED
[INFO] JPA Diagram Editor Feature ......................... SKIPPED
[INFO] org.eclipse.jpt.jpadiagrameditor_sdk.feature ....... SKIPPED
[INFO] dali4x-sdk ......................................... SKIPPED
[INFO] org.eclipse.jpt.common.utility.tests ............... SKIPPED
[INFO] org.eclipse.jpt.common.core.tests .................. SKIPPED
[INFO] org.eclipse.jpt.common.tests.feature ............... SKIPPED
[INFO] org.eclipse.jpt.jpa.core.tests.extension.resource .. SKIPPED
[INFO] org.eclipse.jpt.jpa.core.tests ..................... SKIPPED
[INFO] org.eclipse.jpt.jpa.tests.feature .................. SKIPPED
[INFO] org.eclipse.jpt.jpa.eclipselink.core.tests ......... SKIPPED
[INFO] org.eclipse.jpt.jpa.eclipselink.tests.feature ...... SKIPPED
[INFO] org.eclipse.jpt.jaxb.core.tests .................... SKIPPED
[INFO] org.eclipse.jpt.jaxb.tests.feature ................. SKIPPED
[INFO] org.eclipse.jpt.jaxb.eclipselink.core.tests ........ SKIPPED
[INFO] org.eclipse.jpt.jaxb.eclipselink.tests.feature ..... SKIPPED
[INFO] JPA Diagram Editor Test Plug-in .................... SKIPPED
[INFO] org.eclipse.jpt.jpadiagrameditor.tests.feature ..... SKIPPED
[INFO] dali4x.tests ....................................... SKIPPED
[INFO] jst4x-sdk .......................................... SKIPPED
[INFO] jst4x.tests ........................................ SKIPPED
[INFO] org.eclipse.wst.jsdt.chromium.debug.js ............. SKIPPED
[INFO] org.eclipse.wst.jsdt.chromium.debug.jsdtbridge ..... SKIPPED
[INFO] org.eclipse.wst.jsdt.chromium.wipbackend.dev ....... SKIPPED
[INFO] org.eclipse.wst.jsdt.chromium.wipbackend.protocol_1_0 SKIPPED
[INFO] org.eclipse.wst.jsdt.chromium.debug.feature ........ SKIPPED
[INFO] org.eclipse.wst.jsdt.chromium_sdk.feature .......... SKIPPED
[INFO] wst4x-sdk .......................................... SKIPPED
[INFO] org.eclipse.wst.jsdt.chromium.debug.core.tests ..... SKIPPED
[INFO] org.eclipse.wst.jsdt.chromium.tests ................ SKIPPED
[INFO] org.eclipse.wst.jsdt.chromium_tests.feature ........ SKIPPED
[INFO] org.eclipse.wst.json.core.tests .................... SKIPPED
[INFO] org.eclipse.wst.json_tests.feature ................. SKIPPED
[INFO] wst4x.tests ........................................ SKIPPED
[INFO] repository ......................................... SKIPPED
[INFO] repositoryunittests ................................ SKIPPED
[INFO] org.eclipse.jpt.assembly.feature ................... SKIPPED
[INFO] org.eclipse.jpt_sdk.assembly.feature ............... SKIPPED
[INFO] org.eclipse.jpt.tests.assembly.feature ............. SKIPPED
[INFO] JPA Editor Update Site ............................. SKIPPED
[INFO] org.eclipse.jst.doc.user.feature ................... SKIPPED
[INFO] org.eclipse.wst.jsdt.js.common.tests ............... SKIPPED
[INFO] org.eclipse.wst.jsdt.integration.tests ............. SKIPPED
[INFO] org.eclipse.jsf.assembly.feature ................... SKIPPED
[INFO] org.eclipse.jst.jsf.doc.feature .................... SKIPPED
[INFO] org.eclipse.wst.server.http.core.tests ............. SKIPPED
[INFO] org.eclipse.wst.server.util.tests .................. SKIPPED
[INFO] PsychoPath XPath 2.0 Processor: SDK Documentation .. SKIPPED
[INFO] PsychoPath XPath 2.0 Processor: SDK Feature ........ SKIPPED
[INFO] PsychoPath XPath 2.0 Processor: Tests for WTP type support SKIPPED
[INFO] org.eclipse.jst.ws.jaxws.assembly.feature .......... SKIPPED
[INFO] wtp-aggregator ..................................... SKIPPED
[INFO] ------------------------------------------------------------------------
[INFO] BUILD FAILURE
[INFO] ------------------------------------------------------------------------
[INFO] Total time: 14:29 min
[INFO] Finished at: 2017-02-22T01:14:29-05:00
[INFO] Final Memory: 968M/11936M
[INFO] ------------------------------------------------------------------------
[INFO] o.h.m.e.h.MavenExecutionResultHandler - Build failed with exception(s)
[INFO] o.h.m.e.h.MavenExecutionResultHandler - [1] org.apache.maven.lifecycle.LifecycleExecutionException: Failed to execute goal org.eclipse.tycho:tycho-compiler-plugin:0.21.0:compile (default-compile) on project org.eclipse.jst.jsp.core: Compilation failure
[DEBUG] Closing connection to remote
[ERROR] Failed to execute goal org.eclipse.tycho:tycho-compiler-plugin:0.21.0:compile (default-compile) on project org.eclipse.jst.jsp.core: Compilation failure: Compilation failure:
[ERROR] /jobs/genie.webtools/WTP-R3_9_Integration/workspace/webtools.sourceediting/bundles/org.eclipse.jst.jsp.core/src/org/eclipse/jst/jsp/core/internal/util/CommonXML.java:[48]
[ERROR] documentBuilderFactory.setFeature("http://xml.org/sax/features/external-general-entities", resolveExternalEntities);
[ERROR] ^^^^^^^^^^
[ERROR] The method setFeature(String, boolean) is undefined for the type DocumentBuilderFactory
[ERROR] /jobs/genie.webtools/WTP-R3_9_Integration/workspace/webtools.sourceediting/bundles/org.eclipse.jst.jsp.core/src/org/eclipse/jst/jsp/core/internal/util/CommonXML.java:[49]
[ERROR] documentBuilderFactory.setFeature("http://xml.org/sax/features/external-parameter-entities", resolveExternalEntities);
[ERROR] ^^^^^^^^^^
[ERROR] The method setFeature(String, boolean) is undefined for the type DocumentBuilderFactory
[ERROR] /jobs/genie.webtools/WTP-R3_9_Integration/workspace/webtools.sourceediting/bundles/org.eclipse.jst.jsp.core/src/org/eclipse/jst/jsp/core/internal/util/CommonXML.java:[67]
[ERROR] instance.setFeature("http://xml.org/sax/features/external-general-entities", resolveExternalEntities);
[ERROR] ^^^^^^^^^^
[ERROR] The method setFeature(String, boolean) is undefined for the type DocumentBuilderFactory
[ERROR] /jobs/genie.webtools/WTP-R3_9_Integration/workspace/webtools.sourceediting/bundles/org.eclipse.jst.jsp.core/src/org/eclipse/jst/jsp/core/internal/util/CommonXML.java:[68]
[ERROR] instance.setFeature("http://xml.org/sax/features/external-parameter-entities", resolveExternalEntities);
[ERROR] ^^^^^^^^^^
[ERROR] The method setFeature(String, boolean) is undefined for the type DocumentBuilderFactory
[ERROR] -> [Help 1]
[ERROR]
[ERROR] To see the full stack trace of the errors, re-run Maven with the -e switch.
[ERROR] Re-run Maven using the -X switch to enable full debug logging.
[ERROR]
[ERROR] For more information about the errors and possible solutions, please read the following articles:
[ERROR] [Help 1] http://cwiki.apache.org/confluence/display/MAVEN/MojoFailureException
[ERROR]
[ERROR] After correcting the problems, you can resume the build with the command
[ERROR]   mvn <goals> -rf :org.eclipse.jst.jsp.core
[DEBUG] Waiting for process to finish
[DEBUG] Result: 1
Terminating xvnc.
Archiving artifacts

--
This message is automatically generated by Hudson.
For more information on Hudson, see: http://hudson-ci.org/
_______________________________________________
wtp-releng mailing list
[hidden email]
To change your delivery options, retrieve your password, or unsubscribe from this list, visit
https://dev.eclipse.org/mailman/listinfo/wtp-releng
Reply | Threaded
Open this post in threaded view
|  
Report Content as Inappropriate

[Hudson] Build failed in Hudson: WTP-R3_9_Integration #206

hudsonbuild
See <https://hudson.eclipse.org/webtools/job/WTP-R3_9_Integration/206/>

------------------------------------------
[...truncated 342042 lines...]
[INFO] org.eclipse.wst.server_core.feature ................ SKIPPED
[INFO] org.eclipse.wst.server.ui.doc.user ................. SKIPPED
[INFO] org.eclipse.wst.server_userdoc.feature ............. SKIPPED
[INFO] org.eclipse.wst.server.ui.infopop .................. SKIPPED
[INFO] org.eclipse.wst.server_ui.feature .................. SKIPPED
[INFO] org.eclipse.wst.server_sdk.feature ................. SKIPPED
[INFO] org.eclipse.wst.web_core.feature ................... SKIPPED
[INFO] org.eclipse.wst.doc.user ........................... SKIPPED
[INFO] org.eclipse.wst.webtools.doc.user .................. SKIPPED
[INFO] org.eclipse.wst.web_userdoc.feature ................ SKIPPED
[INFO] org.eclipse.wst.html.ui.infopop .................... SKIPPED
[INFO] org.eclipse.wst.web.ui.infopop ..................... SKIPPED
[INFO] org.eclipse.wst.web_ui.feature ..................... SKIPPED
[INFO] org.eclipse.wst.web_sdk.feature .................... SKIPPED
[INFO] org.eclipse.webtools.sourceediting.xpath ........... SKIPPED
[INFO] PsychoPath XPath 2.0 Processor ..................... SKIPPED
[INFO] org.eclipse.wst.xml.xpath.core ..................... SKIPPED
[INFO] PsychoPath XPath 2.0 Processor ..................... SKIPPED
[INFO] org.eclipse.wst.xml.xpath.ui ....................... SKIPPED
[INFO] PsychoPath XPath 2.0 Processor: User Documentation . SKIPPED
[INFO] PsychoPath XPath 2.0 Processor: Branding Plug-in ... SKIPPED
[INFO] PsychoPath XPath 2.0 Processor Feature ............. SKIPPED
[INFO] org.eclipse.webtools.sourceediting.xsl ............. SKIPPED
[INFO] XSLT Core Plugin ................................... SKIPPED
[INFO] XSLT Launching Plugin .............................. SKIPPED
[INFO] XSLT Debug UI Plugin ............................... SKIPPED
[INFO] org.eclipse.wst.xsl.doc ............................ SKIPPED
[INFO] XSLT EXSLT Core Plugin ............................. SKIPPED
[INFO] XSLT UI Plugin ..................................... SKIPPED
[INFO] XSLT EXSLT UI Plugin ............................... SKIPPED
[INFO] XSLT JAXP Debug Plugin ............................. SKIPPED
[INFO] XSLT Xalan Plugin .................................. SKIPPED
[INFO] XSLT Saxon Plugin .................................. SKIPPED
[INFO] XSL Tools Branding Plugin .......................... SKIPPED
[INFO] XSLT JAXP Launching UI Plugin ...................... SKIPPED
[INFO] XSLT JAXP Debug UI Plugin .......................... SKIPPED
[INFO] XSLT FeaturePlugin ................................. SKIPPED
[INFO] org.eclipse.wst.xsl.sdk.documentation .............. SKIPPED
[INFO] org.eclipse.wst.xsl_sdk.feature .................... SKIPPED
[INFO] org.eclipse.wst.server.http.core ................... SKIPPED
[INFO] org.eclipse.wst.server.http.ui ..................... SKIPPED
[INFO] org.eclipse.wst.server.preview ..................... SKIPPED
[INFO] org.eclipse.wst.server.preview.adapter ............. SKIPPED
[INFO] org.eclipse.wst.server_adapters.feature ............ SKIPPED
[INFO] org.eclipse.wst.server_adapters.sdk.feature ........ SKIPPED
[INFO] org.eclipse.wst.sdk ................................ SKIPPED
[INFO] org.eclipse.wst.common.project.facet.core.tests .... SKIPPED
[INFO] org.eclipse.wst.common.project.facet.ui.tests ...... SKIPPED
[INFO] org.eclipse.wst.common.snippets.tests .............. SKIPPED
[INFO] org.eclipse.wst.common.tests.ui .................... SKIPPED
[INFO] org.eclipse.wst.common.tests.validation ............ SKIPPED
[INFO] org.eclipse.wst.common.tests.validation.guard ...... SKIPPED
[INFO] org.eclipse.wst.internet.cache.tests ............... SKIPPED
[INFO] org.eclipse.wst.common_tests.feature ............... SKIPPED
[INFO] org.eclipse.wst.css.core.tests ..................... SKIPPED
[INFO] org.eclipse.wst.css.tests.encoding ................. SKIPPED
[INFO] org.eclipse.wst.css.ui.tests ....................... SKIPPED
[INFO] org.eclipse.wst.dtd.core.tests ..................... SKIPPED
[INFO] org.eclipse.wst.dtd.ui.tests ....................... SKIPPED
[INFO] org.eclipse.wst.html.core.tests .................... SKIPPED
[INFO] org.eclipse.wst.html.tests.encoding ................ SKIPPED
[INFO] org.eclipse.wst.html.ui.tests ...................... SKIPPED
[INFO] org.eclipse.wst.internet.monitor.core.tests ........ SKIPPED
[INFO] org.eclipse.wst.internet.monitor.ui.tests .......... SKIPPED
[INFO] tests .............................................. SKIPPED
[INFO] org.eclipse.wst.jsdt.core.tests.compiler ........... SKIPPED
[INFO] org.eclipse.wst.jsdt.core.tests.model .............. SKIPPED
[INFO] org.eclipse.wst.jsdt.debug.core.tests .............. SKIPPED
[INFO] org.eclipse.wst.jsdt.debug.rhino.tests ............. SKIPPED
[INFO] org.eclipse.wst.jsdt.js.node.common.tests .......... SKIPPED
[INFO] org.eclipse.wst.jsdt.ui.tests ...................... SKIPPED
[INFO] org.eclipse.wst.jsdt.web.core.tests ................ SKIPPED
[INFO] org.eclipse.wst.jsdt.web.ui.tests .................. SKIPPED
[INFO] org.eclipse.wtp.releng.tests ....................... SKIPPED
[INFO] org.eclipse.wst.jsdt_tests.feature ................. SKIPPED
[INFO] org.eclipse.wst.server_tests.feature ............... SKIPPED
[INFO] org.eclipse.wst.sse.core.tests ..................... SKIPPED
[INFO] org.eclipse.wst.sse.ui.tests ....................... SKIPPED
[INFO] org.eclipse.wtp.releng.fixups ...................... SKIPPED
[INFO] org.eclipse.wtp.releng.fixups.feature .............. SKIPPED
[INFO] org.eclipse.wtp.releng.tools ....................... SKIPPED
[INFO] org.eclipse.wtp.releng.tools.feature ............... SKIPPED
[INFO] org.eclipse.wtp.releng.tests.feature ............... SKIPPED
[INFO] org.eclipse.wst.xml.catalog.tests .................. SKIPPED
[INFO] org.eclipse.wst.xml.core.tests ..................... SKIPPED
[INFO] org.eclipse.wst.xml.ui.tests ....................... SKIPPED
[INFO] org.eclipse.wst.xml.validation.tests ............... SKIPPED
[INFO] org.eclipse.wst.xsd.validation.tests ............... SKIPPED
[INFO] org.eclipse.wst.xsd.core.tests ..................... SKIPPED
[INFO] org.eclipse.wst.xsd.ui.tests ....................... SKIPPED
[INFO] org.eclipse.wst.xml_tests.feature .................. SKIPPED
[INFO] org.eclipse.webtools.sourceediting.xpath.tests ..... SKIPPED
[INFO] org.eclipse.wst.xml.xpath.core.tests ............... SKIPPED
[INFO] org.eclipse.wst.xml.xpath.ui.tests ................. SKIPPED
[INFO] PsychoPath XPath 2.0 Processor: XQuery Test Suite .. SKIPPED
[INFO] PsychoPath XPath 2.0 Processor: Tests .............. SKIPPED
[INFO] org.eclipse.webtools.sourceediting.xsl.tests ....... SKIPPED
[INFO] XSLT Core Tests .................................... SKIPPED
[INFO] EXSLT Core Tests ................................... SKIPPED
[INFO] XSLT UI Tests ...................................... SKIPPED
[INFO] EXSLT UI Tests ..................................... SKIPPED
[INFO] JAXP Debug Tests ................................... SKIPPED
[INFO] XSL Launching Tests ................................ SKIPPED
[INFO] org.eclipse.wst.xsl.tests .......................... SKIPPED
[INFO] org.eclipse.wst.xsl_tests.feature .................. SKIPPED
[INFO] org.eclipse.wst.web_tests.feature .................. SKIPPED
[INFO] org.eclipse.wst.tests.feature ...................... SKIPPED
[INFO] org.eclipse.wtp.requiredpreques .................... SKIPPED
[INFO] org.eclipse.wtp.xml.dev ............................ SKIPPED
[INFO] org.eclipse.wtp.xml.dev.assembly.feature ........... SKIPPED
[INFO] org.uddi4j.feature ................................. SKIPPED
[INFO] org.eclipse.jst .................................... SKIPPED
[INFO] org.eclipse.wst .................................... SKIPPED
[INFO] org.eclipse.wst.doc.isv.feature .................... SKIPPED
[INFO] org.eclipse.wst.doc.user.feature ................... SKIPPED
[INFO] org.eclipse.wtp.epp.package.jee.intro .............. SKIPPED
[INFO] org.eclipse.wtp.epp.package.capabilities ........... SKIPPED
[INFO] org.eclipse.wtp.javascript.capabilities ............ SKIPPED
[INFO] org.eclipse.wtp.jee.capabilities ................... SKIPPED
[INFO] org.eclipse.wtp.web.capabilities ................... SKIPPED
[INFO] org.eclipse.wtp.xml.capabilities ................... SKIPPED
[INFO] org.eclipse.wtp.capabilities.feature ............... SKIPPED
[INFO] org.eclipse.wtp.capabilities ....................... SKIPPED
[INFO] org.eclipse.wtp.feature.branding.template .......... SKIPPED
[INFO] org.eclipse.wtp.jee ................................ SKIPPED
[INFO] repositories ....................................... SKIPPED
[INFO] org.eclipse.webtools.dali .......................... SKIPPED
[INFO] org.eclipse.jpt.common.utility ..................... SKIPPED
[INFO] org.eclipse.jpt.common.core ........................ SKIPPED
[INFO] org.eclipse.jpt.common.ui .......................... SKIPPED
[INFO] org.eclipse.jpt.common.branding .................... SKIPPED
[INFO] org.eclipse.jpt.common.feature ..................... SKIPPED
[INFO] org.eclipse.jpt.common_sdk.feature ................. SKIPPED
[INFO] org.eclipse.jpt.common.eclipselink.core ............ SKIPPED
[INFO] org.eclipse.jpt.common.eclipselink.branding ........ SKIPPED
[INFO] org.eclipse.jpt.common.eclipselink.feature ......... SKIPPED
[INFO] org.eclipse.jpt.common.eclipselink_sdk.feature ..... SKIPPED
[INFO] org.eclipse.jpt.doc.isv ............................ SKIPPED
[INFO] org.eclipse.jpt.jpa.db ............................. SKIPPED
[INFO] org.eclipse.jpt.jpa.core ........................... SKIPPED
[INFO] org.eclipse.jpt.jpa.annotate ....................... SKIPPED
[INFO] org.eclipse.jpt.jpa.db.ui .......................... SKIPPED
[INFO] org.eclipse.jpt.jpa.gen ............................ SKIPPED
[INFO] org.eclipse.jpt.jpa.ui ............................. SKIPPED
[INFO] org.eclipse.jpt.doc.user ........................... SKIPPED
[INFO] org.eclipse.jpt.jpa.branding ....................... SKIPPED
[INFO] org.eclipse.jpt.jpa.feature ........................ SKIPPED
[INFO] org.eclipse.jpt.jpa_sdk.feature .................... SKIPPED
[INFO] org.eclipse.jpt.jpa.eclipselink.core ............... SKIPPED
[INFO] org.eclipse.jpt.jpa.eclipselink.core.ddlgen ........ SKIPPED
[INFO] org.eclipse.jpt.jpa.eclipselink.ui ................. SKIPPED
[INFO] org.eclipse.jpt.jpa.eclipselink.branding ........... SKIPPED
[INFO] org.eclipse.jpt.jpa.eclipselink.feature ............ SKIPPED
[INFO] org.eclipse.jpt.jpa.eclipselink_sdk.feature ........ SKIPPED
[INFO] org.eclipse.jpt.jaxb.core .......................... SKIPPED
[INFO] org.eclipse.jpt.jaxb.core.schemagen ................ SKIPPED
[INFO] org.eclipse.jpt.jaxb.ui ............................ SKIPPED
[INFO] org.eclipse.jpt.jaxb.branding ...................... SKIPPED
[INFO] org.eclipse.jpt.jaxb.feature ....................... SKIPPED
[INFO] org.eclipse.jpt.jaxb_sdk.feature ................... SKIPPED
[INFO] org.eclipse.jpt.jaxb.eclipselink.core .............. SKIPPED
[INFO] org.eclipse.jpt.jaxb.eclipselink.core.schemagen .... SKIPPED
[INFO] org.eclipse.jpt.jaxb.eclipselink.ui ................ SKIPPED
[INFO] org.eclipse.jpt.jaxb.eclipselink.branding .......... SKIPPED
[INFO] org.eclipse.jpt.jaxb.eclipselink.feature ........... SKIPPED
[INFO] org.eclipse.jpt.jaxb.eclipselink_sdk.feature ....... SKIPPED
[INFO] org.eclipse.jpt.dbws.eclipselink.core.gen .......... SKIPPED
[INFO] org.eclipse.jpt.dbws.eclipselink.ui ................ SKIPPED
[INFO] org.eclipse.jpt.dbws.eclipselink.branding .......... SKIPPED
[INFO] org.eclipse.jpt.dbws.eclipselink.feature ........... SKIPPED
[INFO] org.eclipse.jpt.dbws.eclipselink_sdk.feature ....... SKIPPED
[INFO] JPA Diagram Editor Branding Plug-in ................ SKIPPED
[INFO] JPA Diagram Editor Plug-in ......................... SKIPPED
[INFO] JPA Diagram Editor Branding Plug-in ................ SKIPPED
[INFO] JPA Diagram Editor Feature ......................... SKIPPED
[INFO] org.eclipse.jpt.jpadiagrameditor_sdk.feature ....... SKIPPED
[INFO] dali4x-sdk ......................................... SKIPPED
[INFO] org.eclipse.jpt.common.utility.tests ............... SKIPPED
[INFO] org.eclipse.jpt.common.core.tests .................. SKIPPED
[INFO] org.eclipse.jpt.common.tests.feature ............... SKIPPED
[INFO] org.eclipse.jpt.jpa.core.tests.extension.resource .. SKIPPED
[INFO] org.eclipse.jpt.jpa.core.tests ..................... SKIPPED
[INFO] org.eclipse.jpt.jpa.tests.feature .................. SKIPPED
[INFO] org.eclipse.jpt.jpa.eclipselink.core.tests ......... SKIPPED
[INFO] org.eclipse.jpt.jpa.eclipselink.tests.feature ...... SKIPPED
[INFO] org.eclipse.jpt.jaxb.core.tests .................... SKIPPED
[INFO] org.eclipse.jpt.jaxb.tests.feature ................. SKIPPED
[INFO] org.eclipse.jpt.jaxb.eclipselink.core.tests ........ SKIPPED
[INFO] org.eclipse.jpt.jaxb.eclipselink.tests.feature ..... SKIPPED
[INFO] JPA Diagram Editor Test Plug-in .................... SKIPPED
[INFO] org.eclipse.jpt.jpadiagrameditor.tests.feature ..... SKIPPED
[INFO] dali4x.tests ....................................... SKIPPED
[INFO] jst4x-sdk .......................................... SKIPPED
[INFO] jst4x.tests ........................................ SKIPPED
[INFO] org.eclipse.wst.jsdt.chromium.debug.js ............. SKIPPED
[INFO] org.eclipse.wst.jsdt.chromium.debug.jsdtbridge ..... SKIPPED
[INFO] org.eclipse.wst.jsdt.chromium.wipbackend.dev ....... SKIPPED
[INFO] org.eclipse.wst.jsdt.chromium.wipbackend.protocol_1_0 SKIPPED
[INFO] org.eclipse.wst.jsdt.chromium.debug.feature ........ SKIPPED
[INFO] org.eclipse.wst.jsdt.chromium_sdk.feature .......... SKIPPED
[INFO] wst4x-sdk .......................................... SKIPPED
[INFO] org.eclipse.wst.jsdt.chromium.debug.core.tests ..... SKIPPED
[INFO] org.eclipse.wst.jsdt.chromium.tests ................ SKIPPED
[INFO] org.eclipse.wst.jsdt.chromium_tests.feature ........ SKIPPED
[INFO] org.eclipse.wst.json.core.tests .................... SKIPPED
[INFO] org.eclipse.wst.json_tests.feature ................. SKIPPED
[INFO] wst4x.tests ........................................ SKIPPED
[INFO] repository ......................................... SKIPPED
[INFO] repositoryunittests ................................ SKIPPED
[INFO] org.eclipse.jpt.assembly.feature ................... SKIPPED
[INFO] org.eclipse.jpt_sdk.assembly.feature ............... SKIPPED
[INFO] org.eclipse.jpt.tests.assembly.feature ............. SKIPPED
[INFO] JPA Editor Update Site ............................. SKIPPED
[INFO] org.eclipse.jst.doc.user.feature ................... SKIPPED
[INFO] org.eclipse.wst.jsdt.js.common.tests ............... SKIPPED
[INFO] org.eclipse.wst.jsdt.integration.tests ............. SKIPPED
[INFO] org.eclipse.jsf.assembly.feature ................... SKIPPED
[INFO] org.eclipse.jst.jsf.doc.feature .................... SKIPPED
[INFO] org.eclipse.wst.server.http.core.tests ............. SKIPPED
[INFO] org.eclipse.wst.server.util.tests .................. SKIPPED
[INFO] PsychoPath XPath 2.0 Processor: SDK Documentation .. SKIPPED
[INFO] PsychoPath XPath 2.0 Processor: SDK Feature ........ SKIPPED
[INFO] PsychoPath XPath 2.0 Processor: Tests for WTP type support SKIPPED
[INFO] org.eclipse.jst.ws.jaxws.assembly.feature .......... SKIPPED
[INFO] wtp-aggregator ..................................... SKIPPED
[INFO] ------------------------------------------------------------------------
[INFO] BUILD FAILURE
[INFO] ------------------------------------------------------------------------
[INFO] Total time: 46:32 min
[INFO] Finished at: 2017-02-22T02:18:56-05:00
[INFO] Final Memory: 1302M/12114M
[INFO] ------------------------------------------------------------------------
[INFO] o.h.m.e.h.MavenExecutionResultHandler - Build failed with exception(s)
[INFO] o.h.m.e.h.MavenExecutionResultHandler - [1] org.apache.maven.lifecycle.LifecycleExecutionException: Failed to execute goal org.eclipse.tycho:tycho-packaging-plugin:0.21.0:validate-version (default-validate-version) on project org.eclipse.wst.json.core: Unqualified OSGi version 1.0.100.qualifier must match unqualified Maven version 1.0.102-SNAPSHOT for SNAPSHOT builds
[DEBUG] Closing connection to remote
[ERROR] Failed to execute goal org.eclipse.tycho:tycho-packaging-plugin:0.21.0:validate-version (default-validate-version) on project org.eclipse.wst.json.core: Unqualified OSGi version 1.0.100.qualifier must match unqualified Maven version 1.0.102-SNAPSHOT for SNAPSHOT builds -> [Help 1]
[ERROR]
[ERROR] To see the full stack trace of the errors, re-run Maven with the -e switch.
[ERROR] Re-run Maven using the -X switch to enable full debug logging.
[ERROR]
[ERROR] For more information about the errors and possible solutions, please read the following articles:
[ERROR] [Help 1] http://cwiki.apache.org/confluence/display/MAVEN/MojoExecutionException
[ERROR]
[ERROR] After correcting the problems, you can resume the build with the command
[ERROR]   mvn <goals> -rf :org.eclipse.wst.json.core
[DEBUG] Waiting for process to finish
[DEBUG] Result: 1
Terminating xvnc.
Archiving artifacts

--
This message is automatically generated by Hudson.
For more information on Hudson, see: http://hudson-ci.org/
_______________________________________________
wtp-releng mailing list
[hidden email]
To change your delivery options, retrieve your password, or unsubscribe from this list, visit
https://dev.eclipse.org/mailman/listinfo/wtp-releng
Reply | Threaded
Open this post in threaded view
|  
Report Content as Inappropriate

[Hudson] Hudson build is back to normal : WTP-R3_9_Integration #207

hudsonbuild
See <https://hudson.eclipse.org/webtools/job/WTP-R3_9_Integration/207/>


--
This message is automatically generated by Hudson.
For more information on Hudson, see: http://hudson-ci.org/
_______________________________________________
wtp-releng mailing list
[hidden email]
To change your delivery options, retrieve your password, or unsubscribe from this list, visit
https://dev.eclipse.org/mailman/listinfo/wtp-releng
Loading...