Quantcast

[Hudson] Build failed in Hudson: WTP-R3_9_Integration #221

classic Classic list List threaded Threaded
5 messages Options
Reply | Threaded
Open this post in threaded view
|  
Report Content as Inappropriate

[Hudson] Build failed in Hudson: WTP-R3_9_Integration #221

hudsonbuild
See <https://hudson.eclipse.org/webtools/job/WTP-R3_9_Integration/221/changes>

Changes:

[Carl Anderson] Update prereqs for WTP 3.9.0

------------------------------------------
[...truncated 822 lines...]
Downloading: https://oss.sonatype.org/content/repositories/public/org/ow2/ow2/1.3/ow2-1.3.pom
Downloading: https://repo.eclipse.org/content/repositories/cbi/org/ow2/ow2/1.3/ow2-1.3.pom
Downloading: https://repo.eclipse.org/content/repositories/tycho-snapshots/org/ow2/ow2/1.3/ow2-1.3.pom
Downloading: https://repo.eclipse.org/content/repositories/maven_central/org/ow2/ow2/1.3/ow2-1.3.pom
Downloaded: https://repo.eclipse.org/content/repositories/maven_central/org/ow2/ow2/1.3/ow2-1.3.pom (10 KB at 343.9 KB/sec)
Downloading: https://oss.sonatype.org/content/repositories/public/org/eclipse/tycho/sisu-equinox-launching/0.21.0/sisu-equinox-launching-0.21.0.jar
Downloading: https://oss.sonatype.org/content/repositories/public/org/apache/commons/commons-exec/1.2/commons-exec-1.2.jar
Downloading: https://oss.sonatype.org/content/repositories/public/org/eclipse/tycho/tycho-artifactcomparator/0.21.0/tycho-artifactcomparator-0.21.0.jar
Downloading: https://oss.sonatype.org/content/repositories/public/org/ow2/asm/asm-debug-all/4.0/asm-debug-all-4.0.jar
Downloaded: https://oss.sonatype.org/content/repositories/public/org/eclipse/tycho/tycho-artifactcomparator/0.21.0/tycho-artifactcomparator-0.21.0.jar (19 KB at 34.5 KB/sec)
Downloaded: https://oss.sonatype.org/content/repositories/public/org/eclipse/tycho/sisu-equinox-launching/0.21.0/sisu-equinox-launching-0.21.0.jar (26 KB at 48.3 KB/sec)
Downloading: https://repo.eclipse.org/content/repositories/cbi/org/apache/commons/commons-exec/1.2/commons-exec-1.2.jar
Downloading: https://repo.eclipse.org/content/repositories/cbi/org/ow2/asm/asm-debug-all/4.0/asm-debug-all-4.0.jar
Downloading: https://repo.eclipse.org/content/repositories/tycho-snapshots/org/apache/commons/commons-exec/1.2/commons-exec-1.2.jar
Downloading: https://repo.eclipse.org/content/repositories/tycho-snapshots/org/ow2/asm/asm-debug-all/4.0/asm-debug-all-4.0.jar
Downloading: https://repo.eclipse.org/content/repositories/maven_central/org/apache/commons/commons-exec/1.2/commons-exec-1.2.jar
Downloading: https://repo.eclipse.org/content/repositories/maven_central/org/ow2/asm/asm-debug-all/4.0/asm-debug-all-4.0.jar
Downloaded: https://repo.eclipse.org/content/repositories/maven_central/org/apache/commons/commons-exec/1.2/commons-exec-1.2.jar (53 KB at 1097.6 KB/sec)
Downloaded: https://repo.eclipse.org/content/repositories/maven_central/org/ow2/asm/asm-debug-all/4.0/asm-debug-all-4.0.jar (314 KB at 5597.2 KB/sec)
Downloading: https://oss.sonatype.org/content/repositories/public/org/apache/maven/plugins/maven-clean-plugin/2.5/maven-clean-plugin-2.5.pom
Downloading: https://repo.eclipse.org/content/repositories/cbi/org/apache/maven/plugins/maven-clean-plugin/2.5/maven-clean-plugin-2.5.pom
Downloading: https://repo.eclipse.org/content/repositories/tycho-snapshots/org/apache/maven/plugins/maven-clean-plugin/2.5/maven-clean-plugin-2.5.pom
Downloading: https://repo.eclipse.org/content/repositories/maven_central/org/apache/maven/plugins/maven-clean-plugin/2.5/maven-clean-plugin-2.5.pom
Downloaded: https://repo.eclipse.org/content/repositories/maven_central/org/apache/maven/plugins/maven-clean-plugin/2.5/maven-clean-plugin-2.5.pom (4 KB at 136.7 KB/sec)
Downloading: https://oss.sonatype.org/content/repositories/public/org/apache/maven/plugins/maven-plugins/22/maven-plugins-22.pom
Downloading: https://repo.eclipse.org/content/repositories/cbi/org/apache/maven/plugins/maven-plugins/22/maven-plugins-22.pom
Downloading: https://repo.eclipse.org/content/repositories/tycho-snapshots/org/apache/maven/plugins/maven-plugins/22/maven-plugins-22.pom
Downloading: https://repo.eclipse.org/content/repositories/maven_central/org/apache/maven/plugins/maven-plugins/22/maven-plugins-22.pom
Downloaded: https://repo.eclipse.org/content/repositories/maven_central/org/apache/maven/plugins/maven-plugins/22/maven-plugins-22.pom (13 KB at 424.4 KB/sec)
Downloading: https://oss.sonatype.org/content/repositories/public/org/apache/maven/plugins/maven-clean-plugin/2.5/maven-clean-plugin-2.5.jar
Downloading: https://repo.eclipse.org/content/repositories/cbi/org/apache/maven/plugins/maven-clean-plugin/2.5/maven-clean-plugin-2.5.jar
Downloading: https://repo.eclipse.org/content/repositories/tycho-snapshots/org/apache/maven/plugins/maven-clean-plugin/2.5/maven-clean-plugin-2.5.jar
Downloading: https://repo.eclipse.org/content/repositories/maven_central/org/apache/maven/plugins/maven-clean-plugin/2.5/maven-clean-plugin-2.5.jar
Downloaded: https://repo.eclipse.org/content/repositories/maven_central/org/apache/maven/plugins/maven-clean-plugin/2.5/maven-clean-plugin-2.5.jar (25 KB at 925.2 KB/sec)
Downloading: https://oss.sonatype.org/content/repositories/public/org/apache/maven/plugins/maven-resources-plugin/2.4.3/maven-resources-plugin-2.4.3.pom
Downloading: https://repo.eclipse.org/content/repositories/cbi/org/apache/maven/plugins/maven-resources-plugin/2.4.3/maven-resources-plugin-2.4.3.pom
Downloading: https://repo.eclipse.org/content/repositories/tycho-snapshots/org/apache/maven/plugins/maven-resources-plugin/2.4.3/maven-resources-plugin-2.4.3.pom
Downloading: https://repo.eclipse.org/content/repositories/maven_central/org/apache/maven/plugins/maven-resources-plugin/2.4.3/maven-resources-plugin-2.4.3.pom
Downloaded: https://repo.eclipse.org/content/repositories/maven_central/org/apache/maven/plugins/maven-resources-plugin/2.4.3/maven-resources-plugin-2.4.3.pom (6 KB at 207.6 KB/sec)
Downloading: https://oss.sonatype.org/content/repositories/public/org/apache/maven/plugins/maven-plugins/18/maven-plugins-18.pom
Downloading: https://repo.eclipse.org/content/repositories/cbi/org/apache/maven/plugins/maven-plugins/18/maven-plugins-18.pom
Downloading: https://repo.eclipse.org/content/repositories/tycho-snapshots/org/apache/maven/plugins/maven-plugins/18/maven-plugins-18.pom
Downloading: https://repo.eclipse.org/content/repositories/maven_central/org/apache/maven/plugins/maven-plugins/18/maven-plugins-18.pom
Downloaded: https://repo.eclipse.org/content/repositories/maven_central/org/apache/maven/plugins/maven-plugins/18/maven-plugins-18.pom (13 KB at 453.4 KB/sec)
Downloading: https://oss.sonatype.org/content/repositories/public/org/apache/maven/maven-parent/16/maven-parent-16.pom
Downloading: https://repo.eclipse.org/content/repositories/cbi/org/apache/maven/maven-parent/16/maven-parent-16.pom
Downloading: https://repo.eclipse.org/content/repositories/tycho-snapshots/org/apache/maven/maven-parent/16/maven-parent-16.pom
Downloading: https://repo.eclipse.org/content/repositories/maven_central/org/apache/maven/maven-parent/16/maven-parent-16.pom
Downloaded: https://repo.eclipse.org/content/repositories/maven_central/org/apache/maven/maven-parent/16/maven-parent-16.pom (23 KB at 841.7 KB/sec)
Downloading: https://oss.sonatype.org/content/repositories/public/org/apache/apache/7/apache-7.pom
Downloading: https://repo.eclipse.org/content/repositories/cbi/org/apache/apache/7/apache-7.pom
Downloading: https://repo.eclipse.org/content/repositories/tycho-snapshots/org/apache/apache/7/apache-7.pom
Downloading: https://repo.eclipse.org/content/repositories/maven_central/org/apache/apache/7/apache-7.pom
Downloaded: https://repo.eclipse.org/content/repositories/maven_central/org/apache/apache/7/apache-7.pom (15 KB at 469.7 KB/sec)
Downloading: https://oss.sonatype.org/content/repositories/public/org/apache/maven/plugins/maven-resources-plugin/2.4.3/maven-resources-plugin-2.4.3.jar
Downloading: https://repo.eclipse.org/content/repositories/cbi/org/apache/maven/plugins/maven-resources-plugin/2.4.3/maven-resources-plugin-2.4.3.jar
Downloading: https://repo.eclipse.org/content/repositories/tycho-snapshots/org/apache/maven/plugins/maven-resources-plugin/2.4.3/maven-resources-plugin-2.4.3.jar
Downloading: https://repo.eclipse.org/content/repositories/maven_central/org/apache/maven/plugins/maven-resources-plugin/2.4.3/maven-resources-plugin-2.4.3.jar
Downloaded: https://repo.eclipse.org/content/repositories/maven_central/org/apache/maven/plugins/maven-resources-plugin/2.4.3/maven-resources-plugin-2.4.3.jar (24 KB at 851.9 KB/sec)
Downloading: https://oss.sonatype.org/content/repositories/public/org/eclipse/tycho/tycho-compiler-plugin/0.21.0/tycho-compiler-plugin-0.21.0.pom
Downloaded: https://oss.sonatype.org/content/repositories/public/org/eclipse/tycho/tycho-compiler-plugin/0.21.0/tycho-compiler-plugin-0.21.0.pom (3 KB at 7.3 KB/sec)
Downloading: https://oss.sonatype.org/content/repositories/public/org/eclipse/tycho/tycho-compiler-plugin/0.21.0/tycho-compiler-plugin-0.21.0.jar
Downloaded: https://oss.sonatype.org/content/repositories/public/org/eclipse/tycho/tycho-compiler-plugin/0.21.0/tycho-compiler-plugin-0.21.0.jar (31 KB at 64.5 KB/sec)
Downloading: https://oss.sonatype.org/content/repositories/public/org/apache/maven/plugins/maven-install-plugin/2.3.1/maven-install-plugin-2.3.1.pom
Downloading: https://repo.eclipse.org/content/repositories/cbi/org/apache/maven/plugins/maven-install-plugin/2.3.1/maven-install-plugin-2.3.1.pom
Downloading: https://repo.eclipse.org/content/repositories/tycho-snapshots/org/apache/maven/plugins/maven-install-plugin/2.3.1/maven-install-plugin-2.3.1.pom
Downloading: https://repo.eclipse.org/content/repositories/maven_central/org/apache/maven/plugins/maven-install-plugin/2.3.1/maven-install-plugin-2.3.1.pom
Downloaded: https://repo.eclipse.org/content/repositories/maven_central/org/apache/maven/plugins/maven-install-plugin/2.3.1/maven-install-plugin-2.3.1.pom (5 KB at 183.4 KB/sec)
Downloading: https://oss.sonatype.org/content/repositories/public/org/apache/maven/plugins/maven-install-plugin/2.3.1/maven-install-plugin-2.3.1.jar
Downloading: https://repo.eclipse.org/content/repositories/cbi/org/apache/maven/plugins/maven-install-plugin/2.3.1/maven-install-plugin-2.3.1.jar
Downloading: https://repo.eclipse.org/content/repositories/tycho-snapshots/org/apache/maven/plugins/maven-install-plugin/2.3.1/maven-install-plugin-2.3.1.jar
Downloading: https://repo.eclipse.org/content/repositories/maven_central/org/apache/maven/plugins/maven-install-plugin/2.3.1/maven-install-plugin-2.3.1.jar
Downloaded: https://repo.eclipse.org/content/repositories/maven_central/org/apache/maven/plugins/maven-install-plugin/2.3.1/maven-install-plugin-2.3.1.jar (23 KB at 529.2 KB/sec)
Downloading: https://oss.sonatype.org/content/repositories/public/org/apache/maven/plugins/maven-deploy-plugin/2.5/maven-deploy-plugin-2.5.pom
Downloading: https://repo.eclipse.org/content/repositories/cbi/org/apache/maven/plugins/maven-deploy-plugin/2.5/maven-deploy-plugin-2.5.pom
Downloading: https://repo.eclipse.org/content/repositories/tycho-snapshots/org/apache/maven/plugins/maven-deploy-plugin/2.5/maven-deploy-plugin-2.5.pom
Downloading: https://repo.eclipse.org/content/repositories/maven_central/org/apache/maven/plugins/maven-deploy-plugin/2.5/maven-deploy-plugin-2.5.pom
Downloaded: https://repo.eclipse.org/content/repositories/maven_central/org/apache/maven/plugins/maven-deploy-plugin/2.5/maven-deploy-plugin-2.5.pom (6 KB at 214.4 KB/sec)
Downloading: https://oss.sonatype.org/content/repositories/public/org/apache/maven/plugins/maven-plugins/16/maven-plugins-16.pom
Downloading: https://repo.eclipse.org/content/repositories/cbi/org/apache/maven/plugins/maven-plugins/16/maven-plugins-16.pom
Downloading: https://repo.eclipse.org/content/repositories/tycho-snapshots/org/apache/maven/plugins/maven-plugins/16/maven-plugins-16.pom
Downloading: https://repo.eclipse.org/content/repositories/maven_central/org/apache/maven/plugins/maven-plugins/16/maven-plugins-16.pom
Downloaded: https://repo.eclipse.org/content/repositories/maven_central/org/apache/maven/plugins/maven-plugins/16/maven-plugins-16.pom (13 KB at 468.4 KB/sec)
Downloading: https://oss.sonatype.org/content/repositories/public/org/apache/maven/plugins/maven-deploy-plugin/2.5/maven-deploy-plugin-2.5.jar
Downloading: https://repo.eclipse.org/content/repositories/cbi/org/apache/maven/plugins/maven-deploy-plugin/2.5/maven-deploy-plugin-2.5.jar
Downloading: https://repo.eclipse.org/content/repositories/tycho-snapshots/org/apache/maven/plugins/maven-deploy-plugin/2.5/maven-deploy-plugin-2.5.jar
Downloading: https://repo.eclipse.org/content/repositories/maven_central/org/apache/maven/plugins/maven-deploy-plugin/2.5/maven-deploy-plugin-2.5.jar
Downloaded: https://repo.eclipse.org/content/repositories/maven_central/org/apache/maven/plugins/maven-deploy-plugin/2.5/maven-deploy-plugin-2.5.jar (23 KB at 835.1 KB/sec)
Downloading: https://oss.sonatype.org/content/repositories/public/org/apache/maven/plugins/maven-site-plugin/3.3/maven-site-plugin-3.3.pom
Downloading: https://repo.eclipse.org/content/repositories/cbi/org/apache/maven/plugins/maven-site-plugin/3.3/maven-site-plugin-3.3.pom
Downloading: https://repo.eclipse.org/content/repositories/tycho-snapshots/org/apache/maven/plugins/maven-site-plugin/3.3/maven-site-plugin-3.3.pom
Downloading: https://repo.eclipse.org/content/repositories/maven_central/org/apache/maven/plugins/maven-site-plugin/3.3/maven-site-plugin-3.3.pom
Downloaded: https://repo.eclipse.org/content/repositories/maven_central/org/apache/maven/plugins/maven-site-plugin/3.3/maven-site-plugin-3.3.pom (21 KB at 752.8 KB/sec)
Downloading: https://oss.sonatype.org/content/repositories/public/org/apache/maven/plugins/maven-plugins/24/maven-plugins-24.pom
Downloading: https://repo.eclipse.org/content/repositories/cbi/org/apache/maven/plugins/maven-plugins/24/maven-plugins-24.pom
Downloading: https://repo.eclipse.org/content/repositories/tycho-snapshots/org/apache/maven/plugins/maven-plugins/24/maven-plugins-24.pom
Downloading: https://repo.eclipse.org/content/repositories/maven_central/org/apache/maven/plugins/maven-plugins/24/maven-plugins-24.pom
Downloaded: https://repo.eclipse.org/content/repositories/maven_central/org/apache/maven/plugins/maven-plugins/24/maven-plugins-24.pom (11 KB at 422.1 KB/sec)
Downloading: https://oss.sonatype.org/content/repositories/public/org/apache/maven/maven-parent/23/maven-parent-23.pom
Downloading: https://repo.eclipse.org/content/repositories/cbi/org/apache/maven/maven-parent/23/maven-parent-23.pom
Downloading: https://repo.eclipse.org/content/repositories/tycho-snapshots/org/apache/maven/maven-parent/23/maven-parent-23.pom
Downloading: https://repo.eclipse.org/content/repositories/maven_central/org/apache/maven/maven-parent/23/maven-parent-23.pom
Downloaded: https://repo.eclipse.org/content/repositories/maven_central/org/apache/maven/maven-parent/23/maven-parent-23.pom (32 KB at 1178.6 KB/sec)
Downloading: https://oss.sonatype.org/content/repositories/public/org/apache/maven/plugins/maven-site-plugin/3.3/maven-site-plugin-3.3.jar
Downloading: https://repo.eclipse.org/content/repositories/cbi/org/apache/maven/plugins/maven-site-plugin/3.3/maven-site-plugin-3.3.jar
Downloading: https://repo.eclipse.org/content/repositories/tycho-snapshots/org/apache/maven/plugins/maven-site-plugin/3.3/maven-site-plugin-3.3.jar
Downloading: https://repo.eclipse.org/content/repositories/maven_central/org/apache/maven/plugins/maven-site-plugin/3.3/maven-site-plugin-3.3.jar
Downloaded: https://repo.eclipse.org/content/repositories/maven_central/org/apache/maven/plugins/maven-site-plugin/3.3/maven-site-plugin-3.3.jar (122 KB at 4337.2 KB/sec)
Downloading: https://oss.sonatype.org/content/repositories/public/org/eclipse/tycho/tycho-p2-repository-plugin/0.21.0/tycho-p2-repository-plugin-0.21.0.pom
Downloaded: https://oss.sonatype.org/content/repositories/public/org/eclipse/tycho/tycho-p2-repository-plugin/0.21.0/tycho-p2-repository-plugin-0.21.0.pom (2 KB at 3.2 KB/sec)
Downloading: https://oss.sonatype.org/content/repositories/public/org/eclipse/tycho/tycho-p2-repository-plugin/0.21.0/tycho-p2-repository-plugin-0.21.0.jar
Downloaded: https://oss.sonatype.org/content/repositories/public/org/eclipse/tycho/tycho-p2-repository-plugin/0.21.0/tycho-p2-repository-plugin-0.21.0.jar (13 KB at 38.4 KB/sec)
Downloading: https://oss.sonatype.org/content/repositories/public/org/eclipse/tycho/tycho-p2-publisher-plugin/0.21.0/tycho-p2-publisher-plugin-0.21.0.pom
Downloaded: https://oss.sonatype.org/content/repositories/public/org/eclipse/tycho/tycho-p2-publisher-plugin/0.21.0/tycho-p2-publisher-plugin-0.21.0.pom (2 KB at 8.0 KB/sec)
Downloading: https://oss.sonatype.org/content/repositories/public/org/eclipse/tycho/tycho-p2-publisher-plugin/0.21.0/tycho-p2-publisher-plugin-0.21.0.jar
Downloaded: https://oss.sonatype.org/content/repositories/public/org/eclipse/tycho/tycho-p2-publisher-plugin/0.21.0/tycho-p2-publisher-plugin-0.21.0.jar (23 KB at 37.4 KB/sec)
Downloading: https://oss.sonatype.org/content/repositories/public/org/eclipse/tycho/extras/tycho-p2-extras-plugin/0.21.0/tycho-p2-extras-plugin-0.21.0.pom
Downloaded: https://oss.sonatype.org/content/repositories/public/org/eclipse/tycho/extras/tycho-p2-extras-plugin/0.21.0/tycho-p2-extras-plugin-0.21.0.pom (5 KB at 3.4 KB/sec)
Downloading: https://oss.sonatype.org/content/repositories/public/org/eclipse/tycho/extras/tycho-p2-extras-plugin/0.21.0/tycho-p2-extras-plugin-0.21.0.jar
Downloaded: https://oss.sonatype.org/content/repositories/public/org/eclipse/tycho/extras/tycho-p2-extras-plugin/0.21.0/tycho-p2-extras-plugin-0.21.0.jar (19 KB at 56.5 KB/sec)
Downloading: https://oss.sonatype.org/content/repositories/public/org/codehaus/plexus/plexus-utils/2.0.4/plexus-utils-2.0.4.pom
Downloading: https://repo.eclipse.org/content/repositories/cbi/org/codehaus/plexus/plexus-utils/2.0.4/plexus-utils-2.0.4.pom
Downloading: https://repo.eclipse.org/content/repositories/tycho-snapshots/org/codehaus/plexus/plexus-utils/2.0.4/plexus-utils-2.0.4.pom
Downloading: https://repo.eclipse.org/content/repositories/maven_central/org/codehaus/plexus/plexus-utils/2.0.4/plexus-utils-2.0.4.pom
Downloaded: https://repo.eclipse.org/content/repositories/maven_central/org/codehaus/plexus/plexus-utils/2.0.4/plexus-utils-2.0.4.pom (4 KB at 116.3 KB/sec)
Downloading: https://oss.sonatype.org/content/repositories/public/org/codehaus/plexus/plexus-utils/1.5.5/plexus-utils-1.5.5.pom
Downloading: https://repo.eclipse.org/content/repositories/cbi/org/codehaus/plexus/plexus-utils/1.5.5/plexus-utils-1.5.5.pom
Downloading: https://repo.eclipse.org/content/repositories/tycho-snapshots/org/codehaus/plexus/plexus-utils/1.5.5/plexus-utils-1.5.5.pom
Downloading: https://repo.eclipse.org/content/repositories/maven_central/org/codehaus/plexus/plexus-utils/1.5.5/plexus-utils-1.5.5.pom
Downloaded: https://repo.eclipse.org/content/repositories/maven_central/org/codehaus/plexus/plexus-utils/1.5.5/plexus-utils-1.5.5.pom (6 KB at 193.3 KB/sec)
Downloading: https://oss.sonatype.org/content/repositories/public/org/codehaus/plexus/plexus/1.0.11/plexus-1.0.11.pom
Downloading: https://repo.eclipse.org/content/repositories/cbi/org/codehaus/plexus/plexus/1.0.11/plexus-1.0.11.pom
Downloading: https://repo.eclipse.org/content/repositories/tycho-snapshots/org/codehaus/plexus/plexus/1.0.11/plexus-1.0.11.pom
Downloading: https://repo.eclipse.org/content/repositories/maven_central/org/codehaus/plexus/plexus/1.0.11/plexus-1.0.11.pom
Downloaded: https://repo.eclipse.org/content/repositories/maven_central/org/codehaus/plexus/plexus/1.0.11/plexus-1.0.11.pom (9 KB at 324.4 KB/sec)
Downloading: https://oss.sonatype.org/content/repositories/public/org/sonatype/plexus/plexus-cipher/1.4/plexus-cipher-1.4.pom
Downloading: https://repo.eclipse.org/content/repositories/cbi/org/sonatype/plexus/plexus-cipher/1.4/plexus-cipher-1.4.pom
Downloading: https://repo.eclipse.org/content/repositories/tycho-snapshots/org/sonatype/plexus/plexus-cipher/1.4/plexus-cipher-1.4.pom
Downloading: https://repo.eclipse.org/content/repositories/maven_central/org/sonatype/plexus/plexus-cipher/1.4/plexus-cipher-1.4.pom
Downloaded: https://repo.eclipse.org/content/repositories/maven_central/org/sonatype/plexus/plexus-cipher/1.4/plexus-cipher-1.4.pom (3 KB at 72.0 KB/sec)
Downloading: https://oss.sonatype.org/content/repositories/public/org/codehaus/plexus/plexus-component-annotations/1.5.4/plexus-component-annotations-1.5.4.pom
Downloading: https://repo.eclipse.org/content/repositories/cbi/org/codehaus/plexus/plexus-component-annotations/1.5.4/plexus-component-annotations-1.5.4.pom
Downloading: https://repo.eclipse.org/content/repositories/tycho-snapshots/org/codehaus/plexus/plexus-component-annotations/1.5.4/plexus-component-annotations-1.5.4.pom
Downloading: https://repo.eclipse.org/content/repositories/maven_central/org/codehaus/plexus/plexus-component-annotations/1.5.4/plexus-component-annotations-1.5.4.pom
Downloaded: https://repo.eclipse.org/content/repositories/maven_central/org/codehaus/plexus/plexus-component-annotations/1.5.4/plexus-component-annotations-1.5.4.pom (815 B at 30.6 KB/sec)
Downloading: https://oss.sonatype.org/content/repositories/public/org/codehaus/plexus/plexus-containers/1.5.4/plexus-containers-1.5.4.pom
Downloading: https://repo.eclipse.org/content/repositories/cbi/org/codehaus/plexus/plexus-containers/1.5.4/plexus-containers-1.5.4.pom
Downloading: https://repo.eclipse.org/content/repositories/tycho-snapshots/org/codehaus/plexus/plexus-containers/1.5.4/plexus-containers-1.5.4.pom
Downloading: https://repo.eclipse.org/content/repositories/maven_central/org/codehaus/plexus/plexus-containers/1.5.4/plexus-containers-1.5.4.pom
Downloaded: https://repo.eclipse.org/content/repositories/maven_central/org/codehaus/plexus/plexus-containers/1.5.4/plexus-containers-1.5.4.pom (5 KB at 101.0 KB/sec)
Downloading: https://oss.sonatype.org/content/repositories/public/org/codehaus/plexus/plexus/2.0.5/plexus-2.0.5.pom
Downloading: https://repo.eclipse.org/content/repositories/cbi/org/codehaus/plexus/plexus/2.0.5/plexus-2.0.5.pom
Downloading: https://repo.eclipse.org/content/repositories/tycho-snapshots/org/codehaus/plexus/plexus/2.0.5/plexus-2.0.5.pom
Downloading: https://repo.eclipse.org/content/repositories/maven_central/org/codehaus/plexus/plexus/2.0.5/plexus-2.0.5.pom
Downloaded: https://repo.eclipse.org/content/repositories/maven_central/org/codehaus/plexus/plexus/2.0.5/plexus-2.0.5.pom (17 KB at 627.5 KB/sec)
Downloading: https://oss.sonatype.org/content/repositories/public/org/codehaus/plexus/plexus-utils/2.0.5/plexus-utils-2.0.5.pom
Downloading: https://repo.eclipse.org/content/repositories/cbi/org/codehaus/plexus/plexus-utils/2.0.5/plexus-utils-2.0.5.pom
Downloading: https://repo.eclipse.org/content/repositories/tycho-snapshots/org/codehaus/plexus/plexus-utils/2.0.5/plexus-utils-2.0.5.pom
Downloading: https://repo.eclipse.org/content/repositories/maven_central/org/codehaus/plexus/plexus-utils/2.0.5/plexus-utils-2.0.5.pom
Downloaded: https://repo.eclipse.org/content/repositories/maven_central/org/codehaus/plexus/plexus-utils/2.0.5/plexus-utils-2.0.5.pom (4 KB at 120.6 KB/sec)
Downloading: https://oss.sonatype.org/content/repositories/public/org/codehaus/plexus/plexus-io/2.0.4/plexus-io-2.0.4.pom
Downloading: https://repo.eclipse.org/content/repositories/cbi/org/codehaus/plexus/plexus-io/2.0.4/plexus-io-2.0.4.pom
Downloading: https://repo.eclipse.org/content/repositories/tycho-snapshots/org/codehaus/plexus/plexus-io/2.0.4/plexus-io-2.0.4.pom
Downloading: https://repo.eclipse.org/content/repositories/maven_central/org/codehaus/plexus/plexus-io/2.0.4/plexus-io-2.0.4.pom
Downloaded: https://repo.eclipse.org/content/repositories/maven_central/org/codehaus/plexus/plexus-io/2.0.4/plexus-io-2.0.4.pom (2 KB at 52.9 KB/sec)
Downloading: https://oss.sonatype.org/content/repositories/public/org/codehaus/plexus/plexus-components/1.1.19/plexus-components-1.1.19.pom
Downloading: https://repo.eclipse.org/content/repositories/cbi/org/codehaus/plexus/plexus-components/1.1.19/plexus-components-1.1.19.pom
Downloading: https://repo.eclipse.org/content/repositories/tycho-snapshots/org/codehaus/plexus/plexus-components/1.1.19/plexus-components-1.1.19.pom
Downloading: https://repo.eclipse.org/content/repositories/maven_central/org/codehaus/plexus/plexus-components/1.1.19/plexus-components-1.1.19.pom
Downloaded: https://repo.eclipse.org/content/repositories/maven_central/org/codehaus/plexus/plexus-components/1.1.19/plexus-components-1.1.19.pom (3 KB at 101.3 KB/sec)
Downloading: https://oss.sonatype.org/content/repositories/public/org/codehaus/plexus/plexus-utils/3.0/plexus-utils-3.0.pom
Downloading: https://repo.eclipse.org/content/repositories/cbi/org/codehaus/plexus/plexus-utils/3.0/plexus-utils-3.0.pom
Downloading: https://repo.eclipse.org/content/repositories/tycho-snapshots/org/codehaus/plexus/plexus-utils/3.0/plexus-utils-3.0.pom
Downloading: https://repo.eclipse.org/content/repositories/maven_central/org/codehaus/plexus/plexus-utils/3.0/plexus-utils-3.0.pom
Downloaded: https://repo.eclipse.org/content/repositories/maven_central/org/codehaus/plexus/plexus-utils/3.0/plexus-utils-3.0.pom (4 KB at 152.8 KB/sec)
Downloading: https://oss.sonatype.org/content/repositories/public/org/sonatype/spice/spice-parent/16/spice-parent-16.pom
Downloading: https://repo.eclipse.org/content/repositories/cbi/org/sonatype/spice/spice-parent/16/spice-parent-16.pom
Downloading: https://repo.eclipse.org/content/repositories/tycho-snapshots/org/sonatype/spice/spice-parent/16/spice-parent-16.pom
Downloading: https://repo.eclipse.org/content/repositories/maven_central/org/sonatype/spice/spice-parent/16/spice-parent-16.pom
Downloaded: https://repo.eclipse.org/content/repositories/maven_central/org/sonatype/spice/spice-parent/16/spice-parent-16.pom (9 KB at 291.5 KB/sec)
Downloading: https://oss.sonatype.org/content/repositories/public/org/sonatype/plexus/plexus-cipher/1.4/plexus-cipher-1.4.jar
Downloading: https://oss.sonatype.org/content/repositories/public/org/codehaus/plexus/plexus-io/2.0.4/plexus-io-2.0.4.jar
Downloading: https://repo.eclipse.org/content/repositories/cbi/org/sonatype/plexus/plexus-cipher/1.4/plexus-cipher-1.4.jar
Downloading: https://repo.eclipse.org/content/repositories/cbi/org/codehaus/plexus/plexus-io/2.0.4/plexus-io-2.0.4.jar
Downloading: https://repo.eclipse.org/content/repositories/tycho-snapshots/org/sonatype/plexus/plexus-cipher/1.4/plexus-cipher-1.4.jar
Downloading: https://repo.eclipse.org/content/repositories/tycho-snapshots/org/codehaus/plexus/plexus-io/2.0.4/plexus-io-2.0.4.jar
Downloading: https://repo.eclipse.org/content/repositories/maven_central/org/sonatype/plexus/plexus-cipher/1.4/plexus-cipher-1.4.jar
Downloading: https://repo.eclipse.org/content/repositories/maven_central/org/codehaus/plexus/plexus-io/2.0.4/plexus-io-2.0.4.jar
Downloaded: https://repo.eclipse.org/content/repositories/maven_central/org/codehaus/plexus/plexus-io/2.0.4/plexus-io-2.0.4.jar (57 KB at 1835.9 KB/sec)
[INFO] o.h.m.e.h.MavenExecutionResultHandler - Build failed with exception(s)
[INFO] o.h.m.e.h.MavenExecutionResultHandler - [1] org.apache.maven.InternalErrorException: Internal error: java.lang.RuntimeException: org.apache.maven.MavenExecutionException: Could not setup plugin ClassRealm
[DEBUG] Closing connection to remote
[ERROR] Internal error: java.lang.RuntimeException: org.apache.maven.MavenExecutionException: Could not setup plugin ClassRealm: Plugin org.eclipse.tycho.extras:tycho-p2-extras-plugin:0.21.0 or one of its dependencies could not be resolved: Could not find artifact org.sonatype.plexus:plexus-cipher:jar:1.4 in tycho (https://oss.sonatype.org/content/repositories/public/) -> [Help 1]
org.apache.maven.InternalErrorException: Internal error: java.lang.RuntimeException: org.apache.maven.MavenExecutionException: Could not setup plugin ClassRealm
        at org.apache.maven.DefaultMaven.execute(DefaultMaven.java:167)
        at org.apache.maven.cli.MavenCli.execute(MavenCli.java:584)
        at org.apache.maven.cli.MavenCli.doMain(MavenCli.java:216)
        at org.apache.maven.cli.MavenCli.main(MavenCli.java:160)
        at sun.reflect.NativeMethodAccessorImpl.invoke0(Native Method)
        at sun.reflect.NativeMethodAccessorImpl.invoke(NativeMethodAccessorImpl.java:62)
        at sun.reflect.DelegatingMethodAccessorImpl.invoke(DelegatingMethodAccessorImpl.java:43)
        at java.lang.reflect.Method.invoke(Method.java:498)
        at org.codehaus.plexus.classworlds.launcher.Launcher.launchEnhanced(Launcher.java:289)
        at org.codehaus.plexus.classworlds.launcher.Launcher.launch(Launcher.java:229)
        at org.codehaus.plexus.classworlds.launcher.Launcher.mainWithExitCode(Launcher.java:415)
        at org.codehaus.plexus.classworlds.launcher.Launcher.main(Launcher.java:356)
Caused by: java.lang.RuntimeException: org.apache.maven.MavenExecutionException: Could not setup plugin ClassRealm
        at org.eclipse.tycho.p2.resolver.P2DependencyResolver.getDependencyMetadata(P2DependencyResolver.java:168)
        at org.eclipse.tycho.p2.resolver.P2DependencyResolver.setupProjects(P2DependencyResolver.java:126)
        at org.eclipse.tycho.core.resolver.DefaultTychoResolver.setupProject(DefaultTychoResolver.java:87)
        at org.eclipse.tycho.core.maven.TychoMavenLifecycleParticipant.afterProjectsRead(TychoMavenLifecycleParticipant.java:70)
        at org.apache.maven.DefaultMaven.doExecute(DefaultMaven.java:318)
        at org.apache.maven.DefaultMaven.execute(DefaultMaven.java:155)
        ... 11 more
Caused by: org.apache.maven.MavenExecutionException: Could not setup plugin ClassRealm
        at org.eclipse.tycho.core.maven.utils.PluginRealmHelper.newMavenExecutionException(PluginRealmHelper.java:143)
        at org.eclipse.tycho.core.maven.utils.PluginRealmHelper.execute(PluginRealmHelper.java:130)
        at org.eclipse.tycho.p2.resolver.P2DependencyResolver.getDependencyMetadata(P2DependencyResolver.java:148)
        ... 16 more
Caused by: org.apache.maven.plugin.PluginResolutionException: Plugin org.eclipse.tycho.extras:tycho-p2-extras-plugin:0.21.0 or one of its dependencies could not be resolved: Could not find artifact org.sonatype.plexus:plexus-cipher:jar:1.4 in tycho (https://oss.sonatype.org/content/repositories/public/)
        at org.apache.maven.plugin.internal.DefaultPluginDependenciesResolver.resolve(DefaultPluginDependenciesResolver.java:208)
        at org.apache.maven.plugin.internal.DefaultMavenPluginManager.createPluginRealm(DefaultMavenPluginManager.java:361)
        at org.apache.maven.plugin.internal.DefaultMavenPluginManager.setupPluginRealm(DefaultMavenPluginManager.java:329)
        at org.apache.maven.plugin.DefaultBuildPluginManager.getPluginRealm(DefaultBuildPluginManager.java:229)
        at org.eclipse.tycho.core.maven.utils.PluginRealmHelper.execute(PluginRealmHelper.java:112)
        ... 17 more
Caused by: org.eclipse.aether.resolution.ArtifactResolutionException: Could not find artifact org.sonatype.plexus:plexus-cipher:jar:1.4 in tycho (https://oss.sonatype.org/content/repositories/public/)
        at org.eclipse.aether.internal.impl.DefaultArtifactResolver.resolve(DefaultArtifactResolver.java:444)
        at org.eclipse.aether.internal.impl.DefaultArtifactResolver.resolveArtifacts(DefaultArtifactResolver.java:246)
        at org.eclipse.aether.internal.impl.DefaultRepositorySystem.resolveDependencies(DefaultRepositorySystem.java:367)
        at org.apache.maven.plugin.internal.DefaultPluginDependenciesResolver.resolve(DefaultPluginDependenciesResolver.java:200)
        ... 21 more
Caused by: org.eclipse.aether.transfer.ArtifactNotFoundException: Could not find artifact org.sonatype.plexus:plexus-cipher:jar:1.4 in tycho (https://oss.sonatype.org/content/repositories/public/)
        at org.eclipse.aether.connector.basic.ArtifactTransportListener.transferFailed(ArtifactTransportListener.java:39)
        at org.eclipse.aether.connector.basic.BasicRepositoryConnector$TaskRunner.run(BasicRepositoryConnector.java:355)
        at org.eclipse.aether.util.concurrency.RunnableErrorForwarder$1.run(RunnableErrorForwarder.java:67)
        at java.util.concurrent.ThreadPoolExecutor.runWorker(ThreadPoolExecutor.java:1142)
        at java.util.concurrent.ThreadPoolExecutor$Worker.run(ThreadPoolExecutor.java:617)
        at java.lang.Thread.run(Thread.java:745)
[ERROR]
[ERROR] To see the full stack trace of the errors, re-run Maven with the -e switch.
[ERROR] Re-run Maven using the -X switch to enable full debug logging.
[ERROR]
[ERROR] For more information about the errors and possible solutions, please read the following articles:
[ERROR] [Help 1] http://cwiki.apache.org/confluence/display/MAVEN/InternalErrorException
[DEBUG] Waiting for process to finish
[DEBUG] Result: 1
Terminating xvnc.
Archiving artifacts

--
This message is automatically generated by Hudson.
For more information on Hudson, see: http://hudson-ci.org/
_______________________________________________
wtp-releng mailing list
[hidden email]
To change your delivery options, retrieve your password, or unsubscribe from this list, visit
https://dev.eclipse.org/mailman/listinfo/wtp-releng
Reply | Threaded
Open this post in threaded view
|  
Report Content as Inappropriate

[Hudson] Build failed in Hudson: WTP-R3_9_Integration #222

hudsonbuild
See <https://hudson.eclipse.org/webtools/job/WTP-R3_9_Integration/222/>

------------------------------------------
[...truncated 822 lines...]
Downloading: https://oss.sonatype.org/content/repositories/public/org/ow2/ow2/1.3/ow2-1.3.pom
Downloading: https://repo.eclipse.org/content/repositories/cbi/org/ow2/ow2/1.3/ow2-1.3.pom
Downloading: https://repo.eclipse.org/content/repositories/tycho-snapshots/org/ow2/ow2/1.3/ow2-1.3.pom
Downloading: https://repo.eclipse.org/content/repositories/maven_central/org/ow2/ow2/1.3/ow2-1.3.pom
Downloaded: https://repo.eclipse.org/content/repositories/maven_central/org/ow2/ow2/1.3/ow2-1.3.pom (10 KB at 309.5 KB/sec)
Downloading: https://oss.sonatype.org/content/repositories/public/org/apache/commons/commons-exec/1.2/commons-exec-1.2.jar
Downloading: https://oss.sonatype.org/content/repositories/public/org/eclipse/tycho/tycho-artifactcomparator/0.21.0/tycho-artifactcomparator-0.21.0.jar
Downloading: https://oss.sonatype.org/content/repositories/public/org/eclipse/tycho/sisu-equinox-launching/0.21.0/sisu-equinox-launching-0.21.0.jar
Downloading: https://oss.sonatype.org/content/repositories/public/org/ow2/asm/asm-debug-all/4.0/asm-debug-all-4.0.jar
Downloaded: https://oss.sonatype.org/content/repositories/public/org/eclipse/tycho/sisu-equinox-launching/0.21.0/sisu-equinox-launching-0.21.0.jar (26 KB at 139.0 KB/sec)
Downloaded: https://oss.sonatype.org/content/repositories/public/org/eclipse/tycho/tycho-artifactcomparator/0.21.0/tycho-artifactcomparator-0.21.0.jar (19 KB at 76.1 KB/sec)
Downloading: https://repo.eclipse.org/content/repositories/cbi/org/apache/commons/commons-exec/1.2/commons-exec-1.2.jar
Downloading: https://repo.eclipse.org/content/repositories/cbi/org/ow2/asm/asm-debug-all/4.0/asm-debug-all-4.0.jar
Downloading: https://repo.eclipse.org/content/repositories/tycho-snapshots/org/apache/commons/commons-exec/1.2/commons-exec-1.2.jar
Downloading: https://repo.eclipse.org/content/repositories/tycho-snapshots/org/ow2/asm/asm-debug-all/4.0/asm-debug-all-4.0.jar
Downloading: https://repo.eclipse.org/content/repositories/maven_central/org/apache/commons/commons-exec/1.2/commons-exec-1.2.jar
Downloading: https://repo.eclipse.org/content/repositories/maven_central/org/ow2/asm/asm-debug-all/4.0/asm-debug-all-4.0.jar
Downloaded: https://repo.eclipse.org/content/repositories/maven_central/org/apache/commons/commons-exec/1.2/commons-exec-1.2.jar (53 KB at 878.0 KB/sec)
Downloaded: https://repo.eclipse.org/content/repositories/maven_central/org/ow2/asm/asm-debug-all/4.0/asm-debug-all-4.0.jar (314 KB at 5312.6 KB/sec)
Downloading: https://oss.sonatype.org/content/repositories/public/org/apache/maven/plugins/maven-clean-plugin/2.5/maven-clean-plugin-2.5.pom
Downloading: https://repo.eclipse.org/content/repositories/cbi/org/apache/maven/plugins/maven-clean-plugin/2.5/maven-clean-plugin-2.5.pom
Downloading: https://repo.eclipse.org/content/repositories/tycho-snapshots/org/apache/maven/plugins/maven-clean-plugin/2.5/maven-clean-plugin-2.5.pom
Downloading: https://repo.eclipse.org/content/repositories/maven_central/org/apache/maven/plugins/maven-clean-plugin/2.5/maven-clean-plugin-2.5.pom
Downloaded: https://repo.eclipse.org/content/repositories/maven_central/org/apache/maven/plugins/maven-clean-plugin/2.5/maven-clean-plugin-2.5.pom (4 KB at 141.7 KB/sec)
Downloading: https://oss.sonatype.org/content/repositories/public/org/apache/maven/plugins/maven-plugins/22/maven-plugins-22.pom
Downloading: https://repo.eclipse.org/content/repositories/cbi/org/apache/maven/plugins/maven-plugins/22/maven-plugins-22.pom
Downloading: https://repo.eclipse.org/content/repositories/tycho-snapshots/org/apache/maven/plugins/maven-plugins/22/maven-plugins-22.pom
Downloading: https://repo.eclipse.org/content/repositories/maven_central/org/apache/maven/plugins/maven-plugins/22/maven-plugins-22.pom
Downloaded: https://repo.eclipse.org/content/repositories/maven_central/org/apache/maven/plugins/maven-plugins/22/maven-plugins-22.pom (13 KB at 454.8 KB/sec)
Downloading: https://oss.sonatype.org/content/repositories/public/org/apache/maven/plugins/maven-clean-plugin/2.5/maven-clean-plugin-2.5.jar
Downloading: https://repo.eclipse.org/content/repositories/cbi/org/apache/maven/plugins/maven-clean-plugin/2.5/maven-clean-plugin-2.5.jar
Downloading: https://repo.eclipse.org/content/repositories/tycho-snapshots/org/apache/maven/plugins/maven-clean-plugin/2.5/maven-clean-plugin-2.5.jar
Downloading: https://repo.eclipse.org/content/repositories/maven_central/org/apache/maven/plugins/maven-clean-plugin/2.5/maven-clean-plugin-2.5.jar
Downloaded: https://repo.eclipse.org/content/repositories/maven_central/org/apache/maven/plugins/maven-clean-plugin/2.5/maven-clean-plugin-2.5.jar (25 KB at 687.3 KB/sec)
Downloading: https://oss.sonatype.org/content/repositories/public/org/apache/maven/plugins/maven-resources-plugin/2.4.3/maven-resources-plugin-2.4.3.pom
Downloading: https://repo.eclipse.org/content/repositories/cbi/org/apache/maven/plugins/maven-resources-plugin/2.4.3/maven-resources-plugin-2.4.3.pom
Downloading: https://repo.eclipse.org/content/repositories/tycho-snapshots/org/apache/maven/plugins/maven-resources-plugin/2.4.3/maven-resources-plugin-2.4.3.pom
Downloading: https://repo.eclipse.org/content/repositories/maven_central/org/apache/maven/plugins/maven-resources-plugin/2.4.3/maven-resources-plugin-2.4.3.pom
Downloaded: https://repo.eclipse.org/content/repositories/maven_central/org/apache/maven/plugins/maven-resources-plugin/2.4.3/maven-resources-plugin-2.4.3.pom (6 KB at 252.7 KB/sec)
Downloading: https://oss.sonatype.org/content/repositories/public/org/apache/maven/plugins/maven-plugins/18/maven-plugins-18.pom
Downloading: https://repo.eclipse.org/content/repositories/cbi/org/apache/maven/plugins/maven-plugins/18/maven-plugins-18.pom
Downloading: https://repo.eclipse.org/content/repositories/tycho-snapshots/org/apache/maven/plugins/maven-plugins/18/maven-plugins-18.pom
Downloading: https://repo.eclipse.org/content/repositories/maven_central/org/apache/maven/plugins/maven-plugins/18/maven-plugins-18.pom
Downloaded: https://repo.eclipse.org/content/repositories/maven_central/org/apache/maven/plugins/maven-plugins/18/maven-plugins-18.pom (13 KB at 362.8 KB/sec)
Downloading: https://oss.sonatype.org/content/repositories/public/org/apache/maven/maven-parent/16/maven-parent-16.pom
Downloading: https://repo.eclipse.org/content/repositories/cbi/org/apache/maven/maven-parent/16/maven-parent-16.pom
Downloading: https://repo.eclipse.org/content/repositories/tycho-snapshots/org/apache/maven/maven-parent/16/maven-parent-16.pom
Downloading: https://repo.eclipse.org/content/repositories/maven_central/org/apache/maven/maven-parent/16/maven-parent-16.pom
Downloaded: https://repo.eclipse.org/content/repositories/maven_central/org/apache/maven/maven-parent/16/maven-parent-16.pom (23 KB at 733.1 KB/sec)
Downloading: https://oss.sonatype.org/content/repositories/public/org/apache/apache/7/apache-7.pom
Downloading: https://repo.eclipse.org/content/repositories/cbi/org/apache/apache/7/apache-7.pom
Downloading: https://repo.eclipse.org/content/repositories/tycho-snapshots/org/apache/apache/7/apache-7.pom
Downloading: https://repo.eclipse.org/content/repositories/maven_central/org/apache/apache/7/apache-7.pom
Downloaded: https://repo.eclipse.org/content/repositories/maven_central/org/apache/apache/7/apache-7.pom (15 KB at 454.6 KB/sec)
Downloading: https://oss.sonatype.org/content/repositories/public/org/apache/maven/plugins/maven-resources-plugin/2.4.3/maven-resources-plugin-2.4.3.jar
Downloading: https://repo.eclipse.org/content/repositories/cbi/org/apache/maven/plugins/maven-resources-plugin/2.4.3/maven-resources-plugin-2.4.3.jar
Downloading: https://repo.eclipse.org/content/repositories/tycho-snapshots/org/apache/maven/plugins/maven-resources-plugin/2.4.3/maven-resources-plugin-2.4.3.jar
Downloading: https://repo.eclipse.org/content/repositories/maven_central/org/apache/maven/plugins/maven-resources-plugin/2.4.3/maven-resources-plugin-2.4.3.jar
Downloaded: https://repo.eclipse.org/content/repositories/maven_central/org/apache/maven/plugins/maven-resources-plugin/2.4.3/maven-resources-plugin-2.4.3.jar (24 KB at 745.4 KB/sec)
Downloading: https://oss.sonatype.org/content/repositories/public/org/eclipse/tycho/tycho-compiler-plugin/0.21.0/tycho-compiler-plugin-0.21.0.pom
Downloaded: https://oss.sonatype.org/content/repositories/public/org/eclipse/tycho/tycho-compiler-plugin/0.21.0/tycho-compiler-plugin-0.21.0.pom (3 KB at 15.0 KB/sec)
Downloading: https://oss.sonatype.org/content/repositories/public/org/eclipse/tycho/tycho-compiler-plugin/0.21.0/tycho-compiler-plugin-0.21.0.jar
Downloaded: https://oss.sonatype.org/content/repositories/public/org/eclipse/tycho/tycho-compiler-plugin/0.21.0/tycho-compiler-plugin-0.21.0.jar (31 KB at 196.9 KB/sec)
Downloading: https://oss.sonatype.org/content/repositories/public/org/apache/maven/plugins/maven-install-plugin/2.3.1/maven-install-plugin-2.3.1.pom
Downloading: https://repo.eclipse.org/content/repositories/cbi/org/apache/maven/plugins/maven-install-plugin/2.3.1/maven-install-plugin-2.3.1.pom
Downloading: https://repo.eclipse.org/content/repositories/tycho-snapshots/org/apache/maven/plugins/maven-install-plugin/2.3.1/maven-install-plugin-2.3.1.pom
Downloading: https://repo.eclipse.org/content/repositories/maven_central/org/apache/maven/plugins/maven-install-plugin/2.3.1/maven-install-plugin-2.3.1.pom
Downloaded: https://repo.eclipse.org/content/repositories/maven_central/org/apache/maven/plugins/maven-install-plugin/2.3.1/maven-install-plugin-2.3.1.pom (5 KB at 190.8 KB/sec)
Downloading: https://oss.sonatype.org/content/repositories/public/org/apache/maven/plugins/maven-install-plugin/2.3.1/maven-install-plugin-2.3.1.jar
Downloading: https://repo.eclipse.org/content/repositories/cbi/org/apache/maven/plugins/maven-install-plugin/2.3.1/maven-install-plugin-2.3.1.jar
Downloading: https://repo.eclipse.org/content/repositories/tycho-snapshots/org/apache/maven/plugins/maven-install-plugin/2.3.1/maven-install-plugin-2.3.1.jar
Downloading: https://repo.eclipse.org/content/repositories/maven_central/org/apache/maven/plugins/maven-install-plugin/2.3.1/maven-install-plugin-2.3.1.jar
Downloaded: https://repo.eclipse.org/content/repositories/maven_central/org/apache/maven/plugins/maven-install-plugin/2.3.1/maven-install-plugin-2.3.1.jar (23 KB at 542.1 KB/sec)
Downloading: https://oss.sonatype.org/content/repositories/public/org/apache/maven/plugins/maven-deploy-plugin/2.5/maven-deploy-plugin-2.5.pom
Downloading: https://repo.eclipse.org/content/repositories/cbi/org/apache/maven/plugins/maven-deploy-plugin/2.5/maven-deploy-plugin-2.5.pom
Downloading: https://repo.eclipse.org/content/repositories/tycho-snapshots/org/apache/maven/plugins/maven-deploy-plugin/2.5/maven-deploy-plugin-2.5.pom
Downloading: https://repo.eclipse.org/content/repositories/maven_central/org/apache/maven/plugins/maven-deploy-plugin/2.5/maven-deploy-plugin-2.5.pom
Downloaded: https://repo.eclipse.org/content/repositories/maven_central/org/apache/maven/plugins/maven-deploy-plugin/2.5/maven-deploy-plugin-2.5.pom (6 KB at 199.0 KB/sec)
Downloading: https://oss.sonatype.org/content/repositories/public/org/apache/maven/plugins/maven-plugins/16/maven-plugins-16.pom
Downloading: https://repo.eclipse.org/content/repositories/cbi/org/apache/maven/plugins/maven-plugins/16/maven-plugins-16.pom
Downloading: https://repo.eclipse.org/content/repositories/tycho-snapshots/org/apache/maven/plugins/maven-plugins/16/maven-plugins-16.pom
Downloading: https://repo.eclipse.org/content/repositories/maven_central/org/apache/maven/plugins/maven-plugins/16/maven-plugins-16.pom
Downloaded: https://repo.eclipse.org/content/repositories/maven_central/org/apache/maven/plugins/maven-plugins/16/maven-plugins-16.pom (13 KB at 451.6 KB/sec)
Downloading: https://oss.sonatype.org/content/repositories/public/org/apache/maven/plugins/maven-deploy-plugin/2.5/maven-deploy-plugin-2.5.jar
Downloading: https://repo.eclipse.org/content/repositories/cbi/org/apache/maven/plugins/maven-deploy-plugin/2.5/maven-deploy-plugin-2.5.jar
Downloading: https://repo.eclipse.org/content/repositories/tycho-snapshots/org/apache/maven/plugins/maven-deploy-plugin/2.5/maven-deploy-plugin-2.5.jar
Downloading: https://repo.eclipse.org/content/repositories/maven_central/org/apache/maven/plugins/maven-deploy-plugin/2.5/maven-deploy-plugin-2.5.jar
Downloaded: https://repo.eclipse.org/content/repositories/maven_central/org/apache/maven/plugins/maven-deploy-plugin/2.5/maven-deploy-plugin-2.5.jar (23 KB at 751.6 KB/sec)
Downloading: https://oss.sonatype.org/content/repositories/public/org/apache/maven/plugins/maven-site-plugin/3.3/maven-site-plugin-3.3.pom
Downloading: https://repo.eclipse.org/content/repositories/cbi/org/apache/maven/plugins/maven-site-plugin/3.3/maven-site-plugin-3.3.pom
Downloading: https://repo.eclipse.org/content/repositories/tycho-snapshots/org/apache/maven/plugins/maven-site-plugin/3.3/maven-site-plugin-3.3.pom
Downloading: https://repo.eclipse.org/content/repositories/maven_central/org/apache/maven/plugins/maven-site-plugin/3.3/maven-site-plugin-3.3.pom
Downloaded: https://repo.eclipse.org/content/repositories/maven_central/org/apache/maven/plugins/maven-site-plugin/3.3/maven-site-plugin-3.3.pom (21 KB at 5.4 KB/sec)
Downloading: https://oss.sonatype.org/content/repositories/public/org/apache/maven/plugins/maven-plugins/24/maven-plugins-24.pom
Downloading: https://repo.eclipse.org/content/repositories/cbi/org/apache/maven/plugins/maven-plugins/24/maven-plugins-24.pom
Downloading: https://repo.eclipse.org/content/repositories/tycho-snapshots/org/apache/maven/plugins/maven-plugins/24/maven-plugins-24.pom
Downloading: https://repo.eclipse.org/content/repositories/maven_central/org/apache/maven/plugins/maven-plugins/24/maven-plugins-24.pom
Downloaded: https://repo.eclipse.org/content/repositories/maven_central/org/apache/maven/plugins/maven-plugins/24/maven-plugins-24.pom (11 KB at 458.8 KB/sec)
Downloading: https://oss.sonatype.org/content/repositories/public/org/apache/maven/maven-parent/23/maven-parent-23.pom
Downloading: https://repo.eclipse.org/content/repositories/cbi/org/apache/maven/maven-parent/23/maven-parent-23.pom
Downloading: https://repo.eclipse.org/content/repositories/tycho-snapshots/org/apache/maven/maven-parent/23/maven-parent-23.pom
Downloading: https://repo.eclipse.org/content/repositories/maven_central/org/apache/maven/maven-parent/23/maven-parent-23.pom
Downloaded: https://repo.eclipse.org/content/repositories/maven_central/org/apache/maven/maven-parent/23/maven-parent-23.pom (32 KB at 1446.5 KB/sec)
Downloading: https://oss.sonatype.org/content/repositories/public/org/apache/maven/plugins/maven-site-plugin/3.3/maven-site-plugin-3.3.jar
Downloading: https://repo.eclipse.org/content/repositories/cbi/org/apache/maven/plugins/maven-site-plugin/3.3/maven-site-plugin-3.3.jar
Downloading: https://repo.eclipse.org/content/repositories/tycho-snapshots/org/apache/maven/plugins/maven-site-plugin/3.3/maven-site-plugin-3.3.jar
Downloading: https://repo.eclipse.org/content/repositories/maven_central/org/apache/maven/plugins/maven-site-plugin/3.3/maven-site-plugin-3.3.jar
Downloaded: https://repo.eclipse.org/content/repositories/maven_central/org/apache/maven/plugins/maven-site-plugin/3.3/maven-site-plugin-3.3.jar (122 KB at 4337.2 KB/sec)
Downloading: https://oss.sonatype.org/content/repositories/public/org/eclipse/tycho/tycho-p2-repository-plugin/0.21.0/tycho-p2-repository-plugin-0.21.0.pom
Downloaded: https://oss.sonatype.org/content/repositories/public/org/eclipse/tycho/tycho-p2-repository-plugin/0.21.0/tycho-p2-repository-plugin-0.21.0.pom (2 KB at 4.1 KB/sec)
Downloading: https://oss.sonatype.org/content/repositories/public/org/eclipse/tycho/tycho-p2-repository-plugin/0.21.0/tycho-p2-repository-plugin-0.21.0.jar
Downloaded: https://oss.sonatype.org/content/repositories/public/org/eclipse/tycho/tycho-p2-repository-plugin/0.21.0/tycho-p2-repository-plugin-0.21.0.jar (13 KB at 73.2 KB/sec)
Downloading: https://oss.sonatype.org/content/repositories/public/org/eclipse/tycho/tycho-p2-publisher-plugin/0.21.0/tycho-p2-publisher-plugin-0.21.0.pom
Downloaded: https://oss.sonatype.org/content/repositories/public/org/eclipse/tycho/tycho-p2-publisher-plugin/0.21.0/tycho-p2-publisher-plugin-0.21.0.pom (2 KB at 18.8 KB/sec)
Downloading: https://oss.sonatype.org/content/repositories/public/org/eclipse/tycho/tycho-p2-publisher-plugin/0.21.0/tycho-p2-publisher-plugin-0.21.0.jar
Downloaded: https://oss.sonatype.org/content/repositories/public/org/eclipse/tycho/tycho-p2-publisher-plugin/0.21.0/tycho-p2-publisher-plugin-0.21.0.jar (23 KB at 155.3 KB/sec)
Downloading: https://oss.sonatype.org/content/repositories/public/org/eclipse/tycho/extras/tycho-p2-extras-plugin/0.21.0/tycho-p2-extras-plugin-0.21.0.pom
Downloaded: https://oss.sonatype.org/content/repositories/public/org/eclipse/tycho/extras/tycho-p2-extras-plugin/0.21.0/tycho-p2-extras-plugin-0.21.0.pom (5 KB at 42.5 KB/sec)
Downloading: https://oss.sonatype.org/content/repositories/public/org/eclipse/tycho/extras/tycho-p2-extras-plugin/0.21.0/tycho-p2-extras-plugin-0.21.0.jar
Downloaded: https://oss.sonatype.org/content/repositories/public/org/eclipse/tycho/extras/tycho-p2-extras-plugin/0.21.0/tycho-p2-extras-plugin-0.21.0.jar (19 KB at 136.5 KB/sec)
Downloading: https://oss.sonatype.org/content/repositories/public/org/codehaus/plexus/plexus-utils/2.0.4/plexus-utils-2.0.4.pom
Downloading: https://repo.eclipse.org/content/repositories/cbi/org/codehaus/plexus/plexus-utils/2.0.4/plexus-utils-2.0.4.pom
Downloading: https://repo.eclipse.org/content/repositories/tycho-snapshots/org/codehaus/plexus/plexus-utils/2.0.4/plexus-utils-2.0.4.pom
Downloading: https://repo.eclipse.org/content/repositories/maven_central/org/codehaus/plexus/plexus-utils/2.0.4/plexus-utils-2.0.4.pom
Downloaded: https://repo.eclipse.org/content/repositories/maven_central/org/codehaus/plexus/plexus-utils/2.0.4/plexus-utils-2.0.4.pom (4 KB at 98.7 KB/sec)
Downloading: https://oss.sonatype.org/content/repositories/public/org/codehaus/plexus/plexus-utils/1.5.5/plexus-utils-1.5.5.pom
Downloading: https://repo.eclipse.org/content/repositories/cbi/org/codehaus/plexus/plexus-utils/1.5.5/plexus-utils-1.5.5.pom
Downloading: https://repo.eclipse.org/content/repositories/tycho-snapshots/org/codehaus/plexus/plexus-utils/1.5.5/plexus-utils-1.5.5.pom
Downloading: https://repo.eclipse.org/content/repositories/maven_central/org/codehaus/plexus/plexus-utils/1.5.5/plexus-utils-1.5.5.pom
Downloaded: https://repo.eclipse.org/content/repositories/maven_central/org/codehaus/plexus/plexus-utils/1.5.5/plexus-utils-1.5.5.pom (6 KB at 209.4 KB/sec)
Downloading: https://oss.sonatype.org/content/repositories/public/org/codehaus/plexus/plexus/1.0.11/plexus-1.0.11.pom
Downloading: https://repo.eclipse.org/content/repositories/cbi/org/codehaus/plexus/plexus/1.0.11/plexus-1.0.11.pom
Downloading: https://repo.eclipse.org/content/repositories/tycho-snapshots/org/codehaus/plexus/plexus/1.0.11/plexus-1.0.11.pom
Downloading: https://repo.eclipse.org/content/repositories/maven_central/org/codehaus/plexus/plexus/1.0.11/plexus-1.0.11.pom
Downloaded: https://repo.eclipse.org/content/repositories/maven_central/org/codehaus/plexus/plexus/1.0.11/plexus-1.0.11.pom (9 KB at 302.0 KB/sec)
Downloading: https://oss.sonatype.org/content/repositories/public/org/sonatype/plexus/plexus-cipher/1.4/plexus-cipher-1.4.pom
Downloading: https://repo.eclipse.org/content/repositories/cbi/org/sonatype/plexus/plexus-cipher/1.4/plexus-cipher-1.4.pom
Downloading: https://repo.eclipse.org/content/repositories/tycho-snapshots/org/sonatype/plexus/plexus-cipher/1.4/plexus-cipher-1.4.pom
Downloading: https://repo.eclipse.org/content/repositories/maven_central/org/sonatype/plexus/plexus-cipher/1.4/plexus-cipher-1.4.pom
Downloaded: https://repo.eclipse.org/content/repositories/maven_central/org/sonatype/plexus/plexus-cipher/1.4/plexus-cipher-1.4.pom (3 KB at 87.7 KB/sec)
Downloading: https://oss.sonatype.org/content/repositories/public/org/codehaus/plexus/plexus-component-annotations/1.5.4/plexus-component-annotations-1.5.4.pom
Downloading: https://repo.eclipse.org/content/repositories/cbi/org/codehaus/plexus/plexus-component-annotations/1.5.4/plexus-component-annotations-1.5.4.pom
Downloading: https://repo.eclipse.org/content/repositories/tycho-snapshots/org/codehaus/plexus/plexus-component-annotations/1.5.4/plexus-component-annotations-1.5.4.pom
Downloading: https://repo.eclipse.org/content/repositories/maven_central/org/codehaus/plexus/plexus-component-annotations/1.5.4/plexus-component-annotations-1.5.4.pom
Downloaded: https://repo.eclipse.org/content/repositories/maven_central/org/codehaus/plexus/plexus-component-annotations/1.5.4/plexus-component-annotations-1.5.4.pom (815 B at 31.8 KB/sec)
Downloading: https://oss.sonatype.org/content/repositories/public/org/codehaus/plexus/plexus-containers/1.5.4/plexus-containers-1.5.4.pom
Downloading: https://repo.eclipse.org/content/repositories/cbi/org/codehaus/plexus/plexus-containers/1.5.4/plexus-containers-1.5.4.pom
Downloading: https://repo.eclipse.org/content/repositories/tycho-snapshots/org/codehaus/plexus/plexus-containers/1.5.4/plexus-containers-1.5.4.pom
Downloading: https://repo.eclipse.org/content/repositories/maven_central/org/codehaus/plexus/plexus-containers/1.5.4/plexus-containers-1.5.4.pom
Downloaded: https://repo.eclipse.org/content/repositories/maven_central/org/codehaus/plexus/plexus-containers/1.5.4/plexus-containers-1.5.4.pom (5 KB at 147.9 KB/sec)
Downloading: https://oss.sonatype.org/content/repositories/public/org/codehaus/plexus/plexus/2.0.5/plexus-2.0.5.pom
Downloading: https://repo.eclipse.org/content/repositories/cbi/org/codehaus/plexus/plexus/2.0.5/plexus-2.0.5.pom
Downloading: https://repo.eclipse.org/content/repositories/tycho-snapshots/org/codehaus/plexus/plexus/2.0.5/plexus-2.0.5.pom
Downloading: https://repo.eclipse.org/content/repositories/maven_central/org/codehaus/plexus/plexus/2.0.5/plexus-2.0.5.pom
Downloaded: https://repo.eclipse.org/content/repositories/maven_central/org/codehaus/plexus/plexus/2.0.5/plexus-2.0.5.pom (17 KB at 605.1 KB/sec)
Downloading: https://oss.sonatype.org/content/repositories/public/org/codehaus/plexus/plexus-utils/2.0.5/plexus-utils-2.0.5.pom
Downloading: https://repo.eclipse.org/content/repositories/cbi/org/codehaus/plexus/plexus-utils/2.0.5/plexus-utils-2.0.5.pom
Downloading: https://repo.eclipse.org/content/repositories/tycho-snapshots/org/codehaus/plexus/plexus-utils/2.0.5/plexus-utils-2.0.5.pom
Downloading: https://repo.eclipse.org/content/repositories/maven_central/org/codehaus/plexus/plexus-utils/2.0.5/plexus-utils-2.0.5.pom
Downloaded: https://repo.eclipse.org/content/repositories/maven_central/org/codehaus/plexus/plexus-utils/2.0.5/plexus-utils-2.0.5.pom (4 KB at 125.2 KB/sec)
Downloading: https://oss.sonatype.org/content/repositories/public/org/codehaus/plexus/plexus-io/2.0.4/plexus-io-2.0.4.pom
Downloading: https://repo.eclipse.org/content/repositories/cbi/org/codehaus/plexus/plexus-io/2.0.4/plexus-io-2.0.4.pom
Downloading: https://repo.eclipse.org/content/repositories/tycho-snapshots/org/codehaus/plexus/plexus-io/2.0.4/plexus-io-2.0.4.pom
Downloading: https://repo.eclipse.org/content/repositories/maven_central/org/codehaus/plexus/plexus-io/2.0.4/plexus-io-2.0.4.pom
Downloaded: https://repo.eclipse.org/content/repositories/maven_central/org/codehaus/plexus/plexus-io/2.0.4/plexus-io-2.0.4.pom (2 KB at 52.9 KB/sec)
Downloading: https://oss.sonatype.org/content/repositories/public/org/codehaus/plexus/plexus-components/1.1.19/plexus-components-1.1.19.pom
Downloading: https://repo.eclipse.org/content/repositories/cbi/org/codehaus/plexus/plexus-components/1.1.19/plexus-components-1.1.19.pom
Downloading: https://repo.eclipse.org/content/repositories/tycho-snapshots/org/codehaus/plexus/plexus-components/1.1.19/plexus-components-1.1.19.pom
Downloading: https://repo.eclipse.org/content/repositories/maven_central/org/codehaus/plexus/plexus-components/1.1.19/plexus-components-1.1.19.pom
Downloaded: https://repo.eclipse.org/content/repositories/maven_central/org/codehaus/plexus/plexus-components/1.1.19/plexus-components-1.1.19.pom (3 KB at 114.6 KB/sec)
Downloading: https://oss.sonatype.org/content/repositories/public/org/codehaus/plexus/plexus-utils/3.0/plexus-utils-3.0.pom
Downloading: https://repo.eclipse.org/content/repositories/cbi/org/codehaus/plexus/plexus-utils/3.0/plexus-utils-3.0.pom
Downloading: https://repo.eclipse.org/content/repositories/tycho-snapshots/org/codehaus/plexus/plexus-utils/3.0/plexus-utils-3.0.pom
Downloading: https://repo.eclipse.org/content/repositories/maven_central/org/codehaus/plexus/plexus-utils/3.0/plexus-utils-3.0.pom
Downloaded: https://repo.eclipse.org/content/repositories/maven_central/org/codehaus/plexus/plexus-utils/3.0/plexus-utils-3.0.pom (4 KB at 152.8 KB/sec)
Downloading: https://oss.sonatype.org/content/repositories/public/org/sonatype/spice/spice-parent/16/spice-parent-16.pom
Downloading: https://repo.eclipse.org/content/repositories/cbi/org/sonatype/spice/spice-parent/16/spice-parent-16.pom
Downloading: https://repo.eclipse.org/content/repositories/tycho-snapshots/org/sonatype/spice/spice-parent/16/spice-parent-16.pom
Downloading: https://repo.eclipse.org/content/repositories/maven_central/org/sonatype/spice/spice-parent/16/spice-parent-16.pom
Downloaded: https://repo.eclipse.org/content/repositories/maven_central/org/sonatype/spice/spice-parent/16/spice-parent-16.pom (9 KB at 302.3 KB/sec)
Downloading: https://oss.sonatype.org/content/repositories/public/org/sonatype/plexus/plexus-cipher/1.4/plexus-cipher-1.4.jar
Downloading: https://oss.sonatype.org/content/repositories/public/org/codehaus/plexus/plexus-io/2.0.4/plexus-io-2.0.4.jar
Downloading: https://repo.eclipse.org/content/repositories/cbi/org/sonatype/plexus/plexus-cipher/1.4/plexus-cipher-1.4.jar
Downloading: https://repo.eclipse.org/content/repositories/cbi/org/codehaus/plexus/plexus-io/2.0.4/plexus-io-2.0.4.jar
Downloading: https://repo.eclipse.org/content/repositories/tycho-snapshots/org/sonatype/plexus/plexus-cipher/1.4/plexus-cipher-1.4.jar
Downloading: https://repo.eclipse.org/content/repositories/tycho-snapshots/org/codehaus/plexus/plexus-io/2.0.4/plexus-io-2.0.4.jar
Downloading: https://repo.eclipse.org/content/repositories/maven_central/org/sonatype/plexus/plexus-cipher/1.4/plexus-cipher-1.4.jar
Downloading: https://repo.eclipse.org/content/repositories/maven_central/org/codehaus/plexus/plexus-io/2.0.4/plexus-io-2.0.4.jar
Downloaded: https://repo.eclipse.org/content/repositories/maven_central/org/codehaus/plexus/plexus-io/2.0.4/plexus-io-2.0.4.jar (57 KB at 1835.9 KB/sec)
[INFO] o.h.m.e.h.MavenExecutionResultHandler - Build failed with exception(s)
[INFO] o.h.m.e.h.MavenExecutionResultHandler - [1] org.apache.maven.InternalErrorException: Internal error: java.lang.RuntimeException: org.apache.maven.MavenExecutionException: Could not setup plugin ClassRealm
[DEBUG] Closing connection to remote
[ERROR] Internal error: java.lang.RuntimeException: org.apache.maven.MavenExecutionException: Could not setup plugin ClassRealm: Plugin org.eclipse.tycho.extras:tycho-p2-extras-plugin:0.21.0 or one of its dependencies could not be resolved: Could not find artifact org.sonatype.plexus:plexus-cipher:jar:1.4 in tycho (https://oss.sonatype.org/content/repositories/public/) -> [Help 1]
org.apache.maven.InternalErrorException: Internal error: java.lang.RuntimeException: org.apache.maven.MavenExecutionException: Could not setup plugin ClassRealm
        at org.apache.maven.DefaultMaven.execute(DefaultMaven.java:167)
        at org.apache.maven.cli.MavenCli.execute(MavenCli.java:584)
        at org.apache.maven.cli.MavenCli.doMain(MavenCli.java:216)
        at org.apache.maven.cli.MavenCli.main(MavenCli.java:160)
        at sun.reflect.NativeMethodAccessorImpl.invoke0(Native Method)
        at sun.reflect.NativeMethodAccessorImpl.invoke(NativeMethodAccessorImpl.java:62)
        at sun.reflect.DelegatingMethodAccessorImpl.invoke(DelegatingMethodAccessorImpl.java:43)
        at java.lang.reflect.Method.invoke(Method.java:498)
        at org.codehaus.plexus.classworlds.launcher.Launcher.launchEnhanced(Launcher.java:289)
        at org.codehaus.plexus.classworlds.launcher.Launcher.launch(Launcher.java:229)
        at org.codehaus.plexus.classworlds.launcher.Launcher.mainWithExitCode(Launcher.java:415)
        at org.codehaus.plexus.classworlds.launcher.Launcher.main(Launcher.java:356)
Caused by: java.lang.RuntimeException: org.apache.maven.MavenExecutionException: Could not setup plugin ClassRealm
        at org.eclipse.tycho.p2.resolver.P2DependencyResolver.getDependencyMetadata(P2DependencyResolver.java:168)
        at org.eclipse.tycho.p2.resolver.P2DependencyResolver.setupProjects(P2DependencyResolver.java:126)
        at org.eclipse.tycho.core.resolver.DefaultTychoResolver.setupProject(DefaultTychoResolver.java:87)
        at org.eclipse.tycho.core.maven.TychoMavenLifecycleParticipant.afterProjectsRead(TychoMavenLifecycleParticipant.java:70)
        at org.apache.maven.DefaultMaven.doExecute(DefaultMaven.java:318)
        at org.apache.maven.DefaultMaven.execute(DefaultMaven.java:155)
        ... 11 more
Caused by: org.apache.maven.MavenExecutionException: Could not setup plugin ClassRealm
        at org.eclipse.tycho.core.maven.utils.PluginRealmHelper.newMavenExecutionException(PluginRealmHelper.java:143)
        at org.eclipse.tycho.core.maven.utils.PluginRealmHelper.execute(PluginRealmHelper.java:130)
        at org.eclipse.tycho.p2.resolver.P2DependencyResolver.getDependencyMetadata(P2DependencyResolver.java:148)
        ... 16 more
Caused by: org.apache.maven.plugin.PluginResolutionException: Plugin org.eclipse.tycho.extras:tycho-p2-extras-plugin:0.21.0 or one of its dependencies could not be resolved: Could not find artifact org.sonatype.plexus:plexus-cipher:jar:1.4 in tycho (https://oss.sonatype.org/content/repositories/public/)
        at org.apache.maven.plugin.internal.DefaultPluginDependenciesResolver.resolve(DefaultPluginDependenciesResolver.java:208)
        at org.apache.maven.plugin.internal.DefaultMavenPluginManager.createPluginRealm(DefaultMavenPluginManager.java:361)
        at org.apache.maven.plugin.internal.DefaultMavenPluginManager.setupPluginRealm(DefaultMavenPluginManager.java:329)
        at org.apache.maven.plugin.DefaultBuildPluginManager.getPluginRealm(DefaultBuildPluginManager.java:229)
        at org.eclipse.tycho.core.maven.utils.PluginRealmHelper.execute(PluginRealmHelper.java:112)
        ... 17 more
Caused by: org.eclipse.aether.resolution.ArtifactResolutionException: Could not find artifact org.sonatype.plexus:plexus-cipher:jar:1.4 in tycho (https://oss.sonatype.org/content/repositories/public/)
        at org.eclipse.aether.internal.impl.DefaultArtifactResolver.resolve(DefaultArtifactResolver.java:444)
        at org.eclipse.aether.internal.impl.DefaultArtifactResolver.resolveArtifacts(DefaultArtifactResolver.java:246)
        at org.eclipse.aether.internal.impl.DefaultRepositorySystem.resolveDependencies(DefaultRepositorySystem.java:367)
        at org.apache.maven.plugin.internal.DefaultPluginDependenciesResolver.resolve(DefaultPluginDependenciesResolver.java:200)
        ... 21 more
Caused by: org.eclipse.aether.transfer.ArtifactNotFoundException: Could not find artifact org.sonatype.plexus:plexus-cipher:jar:1.4 in tycho (https://oss.sonatype.org/content/repositories/public/)
        at org.eclipse.aether.connector.basic.ArtifactTransportListener.transferFailed(ArtifactTransportListener.java:39)
        at org.eclipse.aether.connector.basic.BasicRepositoryConnector$TaskRunner.run(BasicRepositoryConnector.java:355)
        at org.eclipse.aether.util.concurrency.RunnableErrorForwarder$1.run(RunnableErrorForwarder.java:67)
        at java.util.concurrent.ThreadPoolExecutor.runWorker(ThreadPoolExecutor.java:1142)
        at java.util.concurrent.ThreadPoolExecutor$Worker.run(ThreadPoolExecutor.java:617)
        at java.lang.Thread.run(Thread.java:745)
[ERROR]
[ERROR] To see the full stack trace of the errors, re-run Maven with the -e switch.
[ERROR] Re-run Maven using the -X switch to enable full debug logging.
[ERROR]
[ERROR] For more information about the errors and possible solutions, please read the following articles:
[ERROR] [Help 1] http://cwiki.apache.org/confluence/display/MAVEN/InternalErrorException
[DEBUG] Waiting for process to finish
[DEBUG] Result: 1
Terminating xvnc.
Archiving artifacts

--
This message is automatically generated by Hudson.
For more information on Hudson, see: http://hudson-ci.org/
_______________________________________________
wtp-releng mailing list
[hidden email]
To change your delivery options, retrieve your password, or unsubscribe from this list, visit
https://dev.eclipse.org/mailman/listinfo/wtp-releng
Reply | Threaded
Open this post in threaded view
|  
Report Content as Inappropriate

[Hudson] Build failed in Hudson: WTP-R3_9_Integration #223

hudsonbuild
See <https://hudson.eclipse.org/webtools/job/WTP-R3_9_Integration/223/>

------------------------------------------
[...truncated 94053 lines...]
[INFO] XSLT EXSLT UI Plugin ............................... SKIPPED
[INFO] XSLT JAXP Debug Plugin ............................. SKIPPED
[INFO] XSLT Xalan Plugin .................................. SKIPPED
[INFO] XSLT Saxon Plugin .................................. SKIPPED
[INFO] XSL Tools Branding Plugin .......................... SKIPPED
[INFO] XSLT JAXP Launching UI Plugin ...................... SKIPPED
[INFO] XSLT JAXP Debug UI Plugin .......................... SKIPPED
[INFO] XSLT FeaturePlugin ................................. SKIPPED
[INFO] org.eclipse.wst.xsl.sdk.documentation .............. SKIPPED
[INFO] org.eclipse.wst.xsl_sdk.feature .................... SKIPPED
[INFO] org.eclipse.wst.server.http.core ................... SKIPPED
[INFO] org.eclipse.wst.server.http.ui ..................... SKIPPED
[INFO] org.eclipse.wst.server.preview ..................... SKIPPED
[INFO] org.eclipse.wst.server.preview.adapter ............. SKIPPED
[INFO] org.eclipse.wst.server_adapters.feature ............ SKIPPED
[INFO] org.eclipse.wst.server_adapters.sdk.feature ........ SKIPPED
[INFO] org.eclipse.wst.sdk ................................ SKIPPED
[INFO] org.eclipse.wst.common.project.facet.core.tests .... SKIPPED
[INFO] org.eclipse.wst.common.project.facet.ui.tests ...... SKIPPED
[INFO] org.eclipse.wst.common.snippets.tests .............. SKIPPED
[INFO] org.eclipse.wst.common.tests.ui .................... SKIPPED
[INFO] org.eclipse.wst.common.tests.validation ............ SKIPPED
[INFO] org.eclipse.wst.common.tests.validation.guard ...... SKIPPED
[INFO] org.eclipse.wst.internet.cache.tests ............... SKIPPED
[INFO] org.eclipse.wst.common_tests.feature ............... SKIPPED
[INFO] org.eclipse.wst.css.core.tests ..................... SKIPPED
[INFO] org.eclipse.wst.css.tests.encoding ................. SKIPPED
[INFO] org.eclipse.wst.css.ui.tests ....................... SKIPPED
[INFO] org.eclipse.wst.dtd.core.tests ..................... SKIPPED
[INFO] org.eclipse.wst.dtd.ui.tests ....................... SKIPPED
[INFO] org.eclipse.wst.html.core.tests .................... SKIPPED
[INFO] org.eclipse.wst.html.tests.encoding ................ SKIPPED
[INFO] org.eclipse.wst.html.ui.tests ...................... SKIPPED
[INFO] org.eclipse.wst.internet.monitor.core.tests ........ SKIPPED
[INFO] org.eclipse.wst.internet.monitor.ui.tests .......... SKIPPED
[INFO] tests .............................................. SKIPPED
[INFO] org.eclipse.wst.jsdt.core.tests.compiler ........... SKIPPED
[INFO] org.eclipse.wst.jsdt.core.tests.model .............. SKIPPED
[INFO] org.eclipse.wst.jsdt.debug.core.tests .............. SKIPPED
[INFO] org.eclipse.wst.jsdt.debug.rhino.tests ............. SKIPPED
[INFO] org.eclipse.wst.jsdt.js.node.common.tests .......... SKIPPED
[INFO] org.eclipse.wst.jsdt.ui.tests ...................... SKIPPED
[INFO] org.eclipse.wst.jsdt.web.core.tests ................ SKIPPED
[INFO] org.eclipse.wst.jsdt.web.ui.tests .................. SKIPPED
[INFO] org.eclipse.wtp.releng.tests ....................... SKIPPED
[INFO] org.eclipse.wst.jsdt_tests.feature ................. SKIPPED
[INFO] org.eclipse.wst.server_tests.feature ............... SKIPPED
[INFO] org.eclipse.wst.sse.core.tests ..................... SKIPPED
[INFO] org.eclipse.wst.sse.ui.tests ....................... SKIPPED
[INFO] org.eclipse.wtp.releng.fixups ...................... SKIPPED
[INFO] org.eclipse.wtp.releng.fixups.feature .............. SKIPPED
[INFO] org.eclipse.wtp.releng.tools ....................... SKIPPED
[INFO] org.eclipse.wtp.releng.tools.feature ............... SKIPPED
[INFO] org.eclipse.wtp.releng.tests.feature ............... SKIPPED
[INFO] org.eclipse.wst.xml.catalog.tests .................. SKIPPED
[INFO] org.eclipse.wst.xml.core.tests ..................... SKIPPED
[INFO] org.eclipse.wst.xml.ui.tests ....................... SKIPPED
[INFO] org.eclipse.wst.xml.validation.tests ............... SKIPPED
[INFO] org.eclipse.wst.xsd.validation.tests ............... SKIPPED
[INFO] org.eclipse.wst.xsd.core.tests ..................... SKIPPED
[INFO] org.eclipse.wst.xsd.ui.tests ....................... SKIPPED
[INFO] org.eclipse.wst.xml_tests.feature .................. SKIPPED
[INFO] org.eclipse.webtools.sourceediting.xpath.tests ..... SKIPPED
[INFO] org.eclipse.wst.xml.xpath.core.tests ............... SKIPPED
[INFO] org.eclipse.wst.xml.xpath.ui.tests ................. SKIPPED
[INFO] PsychoPath XPath 2.0 Processor: XQuery Test Suite .. SKIPPED
[INFO] PsychoPath XPath 2.0 Processor: Tests .............. SKIPPED
[INFO] org.eclipse.webtools.sourceediting.xsl.tests ....... SKIPPED
[INFO] XSLT Core Tests .................................... SKIPPED
[INFO] EXSLT Core Tests ................................... SKIPPED
[INFO] XSLT UI Tests ...................................... SKIPPED
[INFO] EXSLT UI Tests ..................................... SKIPPED
[INFO] JAXP Debug Tests ................................... SKIPPED
[INFO] XSL Launching Tests ................................ SKIPPED
[INFO] org.eclipse.wst.xsl.tests .......................... SKIPPED
[INFO] org.eclipse.wst.xsl_tests.feature .................. SKIPPED
[INFO] org.eclipse.wst.web_tests.feature .................. SKIPPED
[INFO] org.eclipse.wst.tests.feature ...................... SKIPPED
[INFO] org.eclipse.wtp.requiredpreques .................... SKIPPED
[INFO] org.eclipse.wtp.xml.dev ............................ SKIPPED
[INFO] org.eclipse.wtp.xml.dev.assembly.feature ........... SKIPPED
[INFO] org.uddi4j.feature ................................. SKIPPED
[INFO] org.eclipse.jst .................................... SKIPPED
[INFO] org.eclipse.wst .................................... SKIPPED
[INFO] org.eclipse.wst.doc.isv.feature .................... SKIPPED
[INFO] org.eclipse.wst.doc.user.feature ................... SKIPPED
[INFO] org.eclipse.wtp.epp.package.jee.intro .............. SKIPPED
[INFO] org.eclipse.wtp.epp.package.capabilities ........... SKIPPED
[INFO] org.eclipse.wtp.javascript.capabilities ............ SKIPPED
[INFO] org.eclipse.wtp.jee.capabilities ................... SKIPPED
[INFO] org.eclipse.wtp.web.capabilities ................... SKIPPED
[INFO] org.eclipse.wtp.xml.capabilities ................... SKIPPED
[INFO] org.eclipse.wtp.capabilities.feature ............... SKIPPED
[INFO] org.eclipse.wtp.capabilities ....................... SKIPPED
[INFO] org.eclipse.wtp.feature.branding.template .......... SKIPPED
[INFO] org.eclipse.wtp.jee ................................ SKIPPED
[INFO] repositories ....................................... SKIPPED
[INFO] org.eclipse.webtools.dali .......................... SKIPPED
[INFO] org.eclipse.jpt.common.utility ..................... SKIPPED
[INFO] org.eclipse.jpt.common.core ........................ SKIPPED
[INFO] org.eclipse.jpt.common.ui .......................... SKIPPED
[INFO] org.eclipse.jpt.common.branding .................... SKIPPED
[INFO] org.eclipse.jpt.common.feature ..................... SKIPPED
[INFO] org.eclipse.jpt.common_sdk.feature ................. SKIPPED
[INFO] org.eclipse.jpt.common.eclipselink.core ............ SKIPPED
[INFO] org.eclipse.jpt.common.eclipselink.branding ........ SKIPPED
[INFO] org.eclipse.jpt.common.eclipselink.feature ......... SKIPPED
[INFO] org.eclipse.jpt.common.eclipselink_sdk.feature ..... SKIPPED
[INFO] org.eclipse.jpt.doc.isv ............................ SKIPPED
[INFO] org.eclipse.jpt.jpa.db ............................. SKIPPED
[INFO] org.eclipse.jpt.jpa.core ........................... SKIPPED
[INFO] org.eclipse.jpt.jpa.annotate ....................... SKIPPED
[INFO] org.eclipse.jpt.jpa.db.ui .......................... SKIPPED
[INFO] org.eclipse.jpt.jpa.gen ............................ SKIPPED
[INFO] org.eclipse.jpt.jpa.ui ............................. SKIPPED
[INFO] org.eclipse.jpt.doc.user ........................... SKIPPED
[INFO] org.eclipse.jpt.jpa.branding ....................... SKIPPED
[INFO] org.eclipse.jpt.jpa.feature ........................ SKIPPED
[INFO] org.eclipse.jpt.jpa_sdk.feature .................... SKIPPED
[INFO] org.eclipse.jpt.jpa.eclipselink.core ............... SKIPPED
[INFO] org.eclipse.jpt.jpa.eclipselink.core.ddlgen ........ SKIPPED
[INFO] org.eclipse.jpt.jpa.eclipselink.ui ................. SKIPPED
[INFO] org.eclipse.jpt.jpa.eclipselink.branding ........... SKIPPED
[INFO] org.eclipse.jpt.jpa.eclipselink.feature ............ SKIPPED
[INFO] org.eclipse.jpt.jpa.eclipselink_sdk.feature ........ SKIPPED
[INFO] org.eclipse.jpt.jaxb.core .......................... SKIPPED
[INFO] org.eclipse.jpt.jaxb.core.schemagen ................ SKIPPED
[INFO] org.eclipse.jpt.jaxb.ui ............................ SKIPPED
[INFO] org.eclipse.jpt.jaxb.branding ...................... SKIPPED
[INFO] org.eclipse.jpt.jaxb.feature ....................... SKIPPED
[INFO] org.eclipse.jpt.jaxb_sdk.feature ................... SKIPPED
[INFO] org.eclipse.jpt.jaxb.eclipselink.core .............. SKIPPED
[INFO] org.eclipse.jpt.jaxb.eclipselink.core.schemagen .... SKIPPED
[INFO] org.eclipse.jpt.jaxb.eclipselink.ui ................ SKIPPED
[INFO] org.eclipse.jpt.jaxb.eclipselink.branding .......... SKIPPED
[INFO] org.eclipse.jpt.jaxb.eclipselink.feature ........... SKIPPED
[INFO] org.eclipse.jpt.jaxb.eclipselink_sdk.feature ....... SKIPPED
[INFO] org.eclipse.jpt.dbws.eclipselink.core.gen .......... SKIPPED
[INFO] org.eclipse.jpt.dbws.eclipselink.ui ................ SKIPPED
[INFO] org.eclipse.jpt.dbws.eclipselink.branding .......... SKIPPED
[INFO] org.eclipse.jpt.dbws.eclipselink.feature ........... SKIPPED
[INFO] org.eclipse.jpt.dbws.eclipselink_sdk.feature ....... SKIPPED
[INFO] JPA Diagram Editor Branding Plug-in ................ SKIPPED
[INFO] JPA Diagram Editor Plug-in ......................... SKIPPED
[INFO] JPA Diagram Editor Branding Plug-in ................ SKIPPED
[INFO] JPA Diagram Editor Feature ......................... SKIPPED
[INFO] org.eclipse.jpt.jpadiagrameditor_sdk.feature ....... SKIPPED
[INFO] dali4x-sdk ......................................... SKIPPED
[INFO] org.eclipse.jpt.common.utility.tests ............... SKIPPED
[INFO] org.eclipse.jpt.common.core.tests .................. SKIPPED
[INFO] org.eclipse.jpt.common.tests.feature ............... SKIPPED
[INFO] org.eclipse.jpt.jpa.core.tests.extension.resource .. SKIPPED
[INFO] org.eclipse.jpt.jpa.core.tests ..................... SKIPPED
[INFO] org.eclipse.jpt.jpa.tests.feature .................. SKIPPED
[INFO] org.eclipse.jpt.jpa.eclipselink.core.tests ......... SKIPPED
[INFO] org.eclipse.jpt.jpa.eclipselink.tests.feature ...... SKIPPED
[INFO] org.eclipse.jpt.jaxb.core.tests .................... SKIPPED
[INFO] org.eclipse.jpt.jaxb.tests.feature ................. SKIPPED
[INFO] org.eclipse.jpt.jaxb.eclipselink.core.tests ........ SKIPPED
[INFO] org.eclipse.jpt.jaxb.eclipselink.tests.feature ..... SKIPPED
[INFO] JPA Diagram Editor Test Plug-in .................... SKIPPED
[INFO] org.eclipse.jpt.jpadiagrameditor.tests.feature ..... SKIPPED
[INFO] dali4x.tests ....................................... SKIPPED
[INFO] jst4x-sdk .......................................... SKIPPED
[INFO] jst4x.tests ........................................ SKIPPED
[INFO] org.eclipse.wst.jsdt.chromium.debug.js ............. SKIPPED
[INFO] org.eclipse.wst.jsdt.chromium.debug.jsdtbridge ..... SKIPPED
[INFO] org.eclipse.wst.jsdt.chromium.wipbackend.dev ....... SKIPPED
[INFO] org.eclipse.wst.jsdt.chromium.wipbackend.protocol_1_0 SKIPPED
[INFO] org.eclipse.wst.jsdt.chromium.debug.feature ........ SKIPPED
[INFO] org.eclipse.wst.jsdt.chromium_sdk.feature .......... SKIPPED
[INFO] wst4x-sdk .......................................... SKIPPED
[INFO] org.eclipse.wst.jsdt.chromium.debug.core.tests ..... SKIPPED
[INFO] org.eclipse.wst.jsdt.chromium.tests ................ SKIPPED
[INFO] org.eclipse.wst.jsdt.chromium_tests.feature ........ SKIPPED
[INFO] org.eclipse.wst.json.core.tests .................... SKIPPED
[INFO] org.eclipse.wst.json_tests.feature ................. SKIPPED
[INFO] wst4x.tests ........................................ SKIPPED
[INFO] repository ......................................... SKIPPED
[INFO] repositoryunittests ................................ SKIPPED
[INFO] org.eclipse.jpt.assembly.feature ................... SKIPPED
[INFO] org.eclipse.jpt_sdk.assembly.feature ............... SKIPPED
[INFO] org.eclipse.jpt.tests.assembly.feature ............. SKIPPED
[INFO] JPA Editor Update Site ............................. SKIPPED
[INFO] org.eclipse.jst.doc.user.feature ................... SKIPPED
[INFO] org.eclipse.wst.jsdt.js.common.tests ............... SKIPPED
[INFO] org.eclipse.wst.jsdt.integration.tests ............. SKIPPED
[INFO] org.eclipse.jsf.assembly.feature ................... SKIPPED
[INFO] org.eclipse.jst.jsf.doc.feature .................... SKIPPED
[INFO] org.eclipse.wst.server.http.core.tests ............. SKIPPED
[INFO] org.eclipse.wst.server.util.tests .................. SKIPPED
[INFO] PsychoPath XPath 2.0 Processor: SDK Documentation .. SKIPPED
[INFO] PsychoPath XPath 2.0 Processor: SDK Feature ........ SKIPPED
[INFO] PsychoPath XPath 2.0 Processor: Tests for WTP type support SKIPPED
[INFO] org.eclipse.jst.ws.jaxws.assembly.feature .......... SKIPPED
[INFO] wtp-aggregator ..................................... SKIPPED
[INFO] ------------------------------------------------------------------------
[INFO] BUILD FAILURE
[INFO] ------------------------------------------------------------------------
[INFO] Total time: 18:22 min
[INFO] Finished at: 2017-03-08T00:51:30-05:00
[INFO] Final Memory: 988M/11603M
[INFO] ------------------------------------------------------------------------
[INFO] o.h.m.e.h.MavenExecutionResultHandler - Build failed with exception(s)
[INFO] o.h.m.e.h.MavenExecutionResultHandler - [1] org.apache.maven.lifecycle.LifecycleExecutionException: Failed to execute goal org.eclipse.tycho:tycho-compiler-plugin:0.21.0:compile (default-compile) on project org.eclipse.wst.sse.ui: Compilation failure
[DEBUG] Closing connection to remote
[ERROR] Failed to execute goal org.eclipse.tycho:tycho-compiler-plugin:0.21.0:compile (default-compile) on project org.eclipse.wst.sse.ui: Compilation failure: Compilation failure:
[ERROR] /jobs/genie.webtools/WTP-R3_9_Integration/workspace/webtools.sourceediting/bundles/org.eclipse.wst.sse.ui/src/org/eclipse/wst/sse/ui/internal/extension/ExtendedEditorActionProxyForDelayLoading.java:[22]
[ERROR] import org.eclipse.jface.util.ListenerList;
[ERROR] ^^^^^^^^^^^^^^^^^^^^^^^^^^^^^^^^^^^
[ERROR] The import org.eclipse.jface.util.ListenerList cannot be resolved
[ERROR] /jobs/genie.webtools/WTP-R3_9_Integration/workspace/webtools.sourceediting/bundles/org.eclipse.wst.sse.ui/src/org/eclipse/wst/sse/ui/internal/extension/ExtendedEditorActionProxyForDelayLoading.java:[61]
[ERROR] private ListenerList p_listeners = new ListenerList(3);
[ERROR] ^^^^^^^^^^^^
[ERROR] ListenerList cannot be resolved to a type
[ERROR] /jobs/genie.webtools/WTP-R3_9_Integration/workspace/webtools.sourceediting/bundles/org.eclipse.wst.sse.ui/src/org/eclipse/wst/sse/ui/internal/extension/ExtendedEditorActionProxyForDelayLoading.java:[61]
[ERROR] private ListenerList p_listeners = new ListenerList(3);
[ERROR] ^^^^^^^^^^^^
[ERROR] ListenerList cannot be resolved to a type
[ERROR] /jobs/genie.webtools/WTP-R3_9_Integration/workspace/webtools.sourceediting/bundles/org.eclipse.wst.sse.ui/src/org/eclipse/wst/sse/ui/internal/extension/ExtendedEditorActionProxyForDelayLoading.java:[78]
[ERROR] p_listeners.add(listener);
[ERROR] ^^^^^^^^^^^
[ERROR] ListenerList cannot be resolved to a type
[ERROR] /jobs/genie.webtools/WTP-R3_9_Integration/workspace/webtools.sourceediting/bundles/org.eclipse.wst.sse.ui/src/org/eclipse/wst/sse/ui/internal/extension/ExtendedEditorActionProxyForDelayLoading.java:[306]
[ERROR] p_listeners.remove(listener);
[ERROR] ^^^^^^^^^^^
[ERROR] ListenerList cannot be resolved to a type
[ERROR] /jobs/genie.webtools/WTP-R3_9_Integration/workspace/webtools.sourceediting/bundles/org.eclipse.wst.sse.ui/src/org/eclipse/wst/sse/ui/internal/extension/ExtendedEditorActionProxyForDelayLoading.java:[659]
[ERROR] if (p_listeners.size() > 0) {
[ERROR] ^^^^^^^^^^^
[ERROR] ListenerList cannot be resolved to a type
[ERROR] /jobs/genie.webtools/WTP-R3_9_Integration/workspace/webtools.sourceediting/bundles/org.eclipse.wst.sse.ui/src/org/eclipse/wst/sse/ui/internal/extension/ExtendedEditorActionProxyForDelayLoading.java:[660]
[ERROR] Object[] l = p_listeners.getListeners();
[ERROR] ^^^^^^^^^^^
[ERROR] ListenerList cannot be resolved to a type
[ERROR] -> [Help 1]
[ERROR]
[ERROR] To see the full stack trace of the errors, re-run Maven with the -e switch.
[ERROR] Re-run Maven using the -X switch to enable full debug logging.
[ERROR]
[ERROR] For more information about the errors and possible solutions, please read the following articles:
[ERROR] [Help 1] http://cwiki.apache.org/confluence/display/MAVEN/MojoFailureException
[ERROR]
[ERROR] After correcting the problems, you can resume the build with the command
[ERROR]   mvn <goals> -rf :org.eclipse.wst.sse.ui
[DEBUG] Waiting for process to finish
[DEBUG] Result: 1
Terminating xvnc.
Archiving artifacts

--
This message is automatically generated by Hudson.
For more information on Hudson, see: http://hudson-ci.org/
_______________________________________________
wtp-releng mailing list
[hidden email]
To change your delivery options, retrieve your password, or unsubscribe from this list, visit
https://dev.eclipse.org/mailman/listinfo/wtp-releng
Reply | Threaded
Open this post in threaded view
|  
Report Content as Inappropriate

[Hudson] Build failed in Hudson: WTP-R3_9_Integration #224

hudsonbuild
See <https://hudson.eclipse.org/webtools/job/WTP-R3_9_Integration/224/>

------------------------------------------
[...truncated 94053 lines...]
[INFO] XSLT EXSLT UI Plugin ............................... SKIPPED
[INFO] XSLT JAXP Debug Plugin ............................. SKIPPED
[INFO] XSLT Xalan Plugin .................................. SKIPPED
[INFO] XSLT Saxon Plugin .................................. SKIPPED
[INFO] XSL Tools Branding Plugin .......................... SKIPPED
[INFO] XSLT JAXP Launching UI Plugin ...................... SKIPPED
[INFO] XSLT JAXP Debug UI Plugin .......................... SKIPPED
[INFO] XSLT FeaturePlugin ................................. SKIPPED
[INFO] org.eclipse.wst.xsl.sdk.documentation .............. SKIPPED
[INFO] org.eclipse.wst.xsl_sdk.feature .................... SKIPPED
[INFO] org.eclipse.wst.server.http.core ................... SKIPPED
[INFO] org.eclipse.wst.server.http.ui ..................... SKIPPED
[INFO] org.eclipse.wst.server.preview ..................... SKIPPED
[INFO] org.eclipse.wst.server.preview.adapter ............. SKIPPED
[INFO] org.eclipse.wst.server_adapters.feature ............ SKIPPED
[INFO] org.eclipse.wst.server_adapters.sdk.feature ........ SKIPPED
[INFO] org.eclipse.wst.sdk ................................ SKIPPED
[INFO] org.eclipse.wst.common.project.facet.core.tests .... SKIPPED
[INFO] org.eclipse.wst.common.project.facet.ui.tests ...... SKIPPED
[INFO] org.eclipse.wst.common.snippets.tests .............. SKIPPED
[INFO] org.eclipse.wst.common.tests.ui .................... SKIPPED
[INFO] org.eclipse.wst.common.tests.validation ............ SKIPPED
[INFO] org.eclipse.wst.common.tests.validation.guard ...... SKIPPED
[INFO] org.eclipse.wst.internet.cache.tests ............... SKIPPED
[INFO] org.eclipse.wst.common_tests.feature ............... SKIPPED
[INFO] org.eclipse.wst.css.core.tests ..................... SKIPPED
[INFO] org.eclipse.wst.css.tests.encoding ................. SKIPPED
[INFO] org.eclipse.wst.css.ui.tests ....................... SKIPPED
[INFO] org.eclipse.wst.dtd.core.tests ..................... SKIPPED
[INFO] org.eclipse.wst.dtd.ui.tests ....................... SKIPPED
[INFO] org.eclipse.wst.html.core.tests .................... SKIPPED
[INFO] org.eclipse.wst.html.tests.encoding ................ SKIPPED
[INFO] org.eclipse.wst.html.ui.tests ...................... SKIPPED
[INFO] org.eclipse.wst.internet.monitor.core.tests ........ SKIPPED
[INFO] org.eclipse.wst.internet.monitor.ui.tests .......... SKIPPED
[INFO] tests .............................................. SKIPPED
[INFO] org.eclipse.wst.jsdt.core.tests.compiler ........... SKIPPED
[INFO] org.eclipse.wst.jsdt.core.tests.model .............. SKIPPED
[INFO] org.eclipse.wst.jsdt.debug.core.tests .............. SKIPPED
[INFO] org.eclipse.wst.jsdt.debug.rhino.tests ............. SKIPPED
[INFO] org.eclipse.wst.jsdt.js.node.common.tests .......... SKIPPED
[INFO] org.eclipse.wst.jsdt.ui.tests ...................... SKIPPED
[INFO] org.eclipse.wst.jsdt.web.core.tests ................ SKIPPED
[INFO] org.eclipse.wst.jsdt.web.ui.tests .................. SKIPPED
[INFO] org.eclipse.wtp.releng.tests ....................... SKIPPED
[INFO] org.eclipse.wst.jsdt_tests.feature ................. SKIPPED
[INFO] org.eclipse.wst.server_tests.feature ............... SKIPPED
[INFO] org.eclipse.wst.sse.core.tests ..................... SKIPPED
[INFO] org.eclipse.wst.sse.ui.tests ....................... SKIPPED
[INFO] org.eclipse.wtp.releng.fixups ...................... SKIPPED
[INFO] org.eclipse.wtp.releng.fixups.feature .............. SKIPPED
[INFO] org.eclipse.wtp.releng.tools ....................... SKIPPED
[INFO] org.eclipse.wtp.releng.tools.feature ............... SKIPPED
[INFO] org.eclipse.wtp.releng.tests.feature ............... SKIPPED
[INFO] org.eclipse.wst.xml.catalog.tests .................. SKIPPED
[INFO] org.eclipse.wst.xml.core.tests ..................... SKIPPED
[INFO] org.eclipse.wst.xml.ui.tests ....................... SKIPPED
[INFO] org.eclipse.wst.xml.validation.tests ............... SKIPPED
[INFO] org.eclipse.wst.xsd.validation.tests ............... SKIPPED
[INFO] org.eclipse.wst.xsd.core.tests ..................... SKIPPED
[INFO] org.eclipse.wst.xsd.ui.tests ....................... SKIPPED
[INFO] org.eclipse.wst.xml_tests.feature .................. SKIPPED
[INFO] org.eclipse.webtools.sourceediting.xpath.tests ..... SKIPPED
[INFO] org.eclipse.wst.xml.xpath.core.tests ............... SKIPPED
[INFO] org.eclipse.wst.xml.xpath.ui.tests ................. SKIPPED
[INFO] PsychoPath XPath 2.0 Processor: XQuery Test Suite .. SKIPPED
[INFO] PsychoPath XPath 2.0 Processor: Tests .............. SKIPPED
[INFO] org.eclipse.webtools.sourceediting.xsl.tests ....... SKIPPED
[INFO] XSLT Core Tests .................................... SKIPPED
[INFO] EXSLT Core Tests ................................... SKIPPED
[INFO] XSLT UI Tests ...................................... SKIPPED
[INFO] EXSLT UI Tests ..................................... SKIPPED
[INFO] JAXP Debug Tests ................................... SKIPPED
[INFO] XSL Launching Tests ................................ SKIPPED
[INFO] org.eclipse.wst.xsl.tests .......................... SKIPPED
[INFO] org.eclipse.wst.xsl_tests.feature .................. SKIPPED
[INFO] org.eclipse.wst.web_tests.feature .................. SKIPPED
[INFO] org.eclipse.wst.tests.feature ...................... SKIPPED
[INFO] org.eclipse.wtp.requiredpreques .................... SKIPPED
[INFO] org.eclipse.wtp.xml.dev ............................ SKIPPED
[INFO] org.eclipse.wtp.xml.dev.assembly.feature ........... SKIPPED
[INFO] org.uddi4j.feature ................................. SKIPPED
[INFO] org.eclipse.jst .................................... SKIPPED
[INFO] org.eclipse.wst .................................... SKIPPED
[INFO] org.eclipse.wst.doc.isv.feature .................... SKIPPED
[INFO] org.eclipse.wst.doc.user.feature ................... SKIPPED
[INFO] org.eclipse.wtp.epp.package.jee.intro .............. SKIPPED
[INFO] org.eclipse.wtp.epp.package.capabilities ........... SKIPPED
[INFO] org.eclipse.wtp.javascript.capabilities ............ SKIPPED
[INFO] org.eclipse.wtp.jee.capabilities ................... SKIPPED
[INFO] org.eclipse.wtp.web.capabilities ................... SKIPPED
[INFO] org.eclipse.wtp.xml.capabilities ................... SKIPPED
[INFO] org.eclipse.wtp.capabilities.feature ............... SKIPPED
[INFO] org.eclipse.wtp.capabilities ....................... SKIPPED
[INFO] org.eclipse.wtp.feature.branding.template .......... SKIPPED
[INFO] org.eclipse.wtp.jee ................................ SKIPPED
[INFO] repositories ....................................... SKIPPED
[INFO] org.eclipse.webtools.dali .......................... SKIPPED
[INFO] org.eclipse.jpt.common.utility ..................... SKIPPED
[INFO] org.eclipse.jpt.common.core ........................ SKIPPED
[INFO] org.eclipse.jpt.common.ui .......................... SKIPPED
[INFO] org.eclipse.jpt.common.branding .................... SKIPPED
[INFO] org.eclipse.jpt.common.feature ..................... SKIPPED
[INFO] org.eclipse.jpt.common_sdk.feature ................. SKIPPED
[INFO] org.eclipse.jpt.common.eclipselink.core ............ SKIPPED
[INFO] org.eclipse.jpt.common.eclipselink.branding ........ SKIPPED
[INFO] org.eclipse.jpt.common.eclipselink.feature ......... SKIPPED
[INFO] org.eclipse.jpt.common.eclipselink_sdk.feature ..... SKIPPED
[INFO] org.eclipse.jpt.doc.isv ............................ SKIPPED
[INFO] org.eclipse.jpt.jpa.db ............................. SKIPPED
[INFO] org.eclipse.jpt.jpa.core ........................... SKIPPED
[INFO] org.eclipse.jpt.jpa.annotate ....................... SKIPPED
[INFO] org.eclipse.jpt.jpa.db.ui .......................... SKIPPED
[INFO] org.eclipse.jpt.jpa.gen ............................ SKIPPED
[INFO] org.eclipse.jpt.jpa.ui ............................. SKIPPED
[INFO] org.eclipse.jpt.doc.user ........................... SKIPPED
[INFO] org.eclipse.jpt.jpa.branding ....................... SKIPPED
[INFO] org.eclipse.jpt.jpa.feature ........................ SKIPPED
[INFO] org.eclipse.jpt.jpa_sdk.feature .................... SKIPPED
[INFO] org.eclipse.jpt.jpa.eclipselink.core ............... SKIPPED
[INFO] org.eclipse.jpt.jpa.eclipselink.core.ddlgen ........ SKIPPED
[INFO] org.eclipse.jpt.jpa.eclipselink.ui ................. SKIPPED
[INFO] org.eclipse.jpt.jpa.eclipselink.branding ........... SKIPPED
[INFO] org.eclipse.jpt.jpa.eclipselink.feature ............ SKIPPED
[INFO] org.eclipse.jpt.jpa.eclipselink_sdk.feature ........ SKIPPED
[INFO] org.eclipse.jpt.jaxb.core .......................... SKIPPED
[INFO] org.eclipse.jpt.jaxb.core.schemagen ................ SKIPPED
[INFO] org.eclipse.jpt.jaxb.ui ............................ SKIPPED
[INFO] org.eclipse.jpt.jaxb.branding ...................... SKIPPED
[INFO] org.eclipse.jpt.jaxb.feature ....................... SKIPPED
[INFO] org.eclipse.jpt.jaxb_sdk.feature ................... SKIPPED
[INFO] org.eclipse.jpt.jaxb.eclipselink.core .............. SKIPPED
[INFO] org.eclipse.jpt.jaxb.eclipselink.core.schemagen .... SKIPPED
[INFO] org.eclipse.jpt.jaxb.eclipselink.ui ................ SKIPPED
[INFO] org.eclipse.jpt.jaxb.eclipselink.branding .......... SKIPPED
[INFO] org.eclipse.jpt.jaxb.eclipselink.feature ........... SKIPPED
[INFO] org.eclipse.jpt.jaxb.eclipselink_sdk.feature ....... SKIPPED
[INFO] org.eclipse.jpt.dbws.eclipselink.core.gen .......... SKIPPED
[INFO] org.eclipse.jpt.dbws.eclipselink.ui ................ SKIPPED
[INFO] org.eclipse.jpt.dbws.eclipselink.branding .......... SKIPPED
[INFO] org.eclipse.jpt.dbws.eclipselink.feature ........... SKIPPED
[INFO] org.eclipse.jpt.dbws.eclipselink_sdk.feature ....... SKIPPED
[INFO] JPA Diagram Editor Branding Plug-in ................ SKIPPED
[INFO] JPA Diagram Editor Plug-in ......................... SKIPPED
[INFO] JPA Diagram Editor Branding Plug-in ................ SKIPPED
[INFO] JPA Diagram Editor Feature ......................... SKIPPED
[INFO] org.eclipse.jpt.jpadiagrameditor_sdk.feature ....... SKIPPED
[INFO] dali4x-sdk ......................................... SKIPPED
[INFO] org.eclipse.jpt.common.utility.tests ............... SKIPPED
[INFO] org.eclipse.jpt.common.core.tests .................. SKIPPED
[INFO] org.eclipse.jpt.common.tests.feature ............... SKIPPED
[INFO] org.eclipse.jpt.jpa.core.tests.extension.resource .. SKIPPED
[INFO] org.eclipse.jpt.jpa.core.tests ..................... SKIPPED
[INFO] org.eclipse.jpt.jpa.tests.feature .................. SKIPPED
[INFO] org.eclipse.jpt.jpa.eclipselink.core.tests ......... SKIPPED
[INFO] org.eclipse.jpt.jpa.eclipselink.tests.feature ...... SKIPPED
[INFO] org.eclipse.jpt.jaxb.core.tests .................... SKIPPED
[INFO] org.eclipse.jpt.jaxb.tests.feature ................. SKIPPED
[INFO] org.eclipse.jpt.jaxb.eclipselink.core.tests ........ SKIPPED
[INFO] org.eclipse.jpt.jaxb.eclipselink.tests.feature ..... SKIPPED
[INFO] JPA Diagram Editor Test Plug-in .................... SKIPPED
[INFO] org.eclipse.jpt.jpadiagrameditor.tests.feature ..... SKIPPED
[INFO] dali4x.tests ....................................... SKIPPED
[INFO] jst4x-sdk .......................................... SKIPPED
[INFO] jst4x.tests ........................................ SKIPPED
[INFO] org.eclipse.wst.jsdt.chromium.debug.js ............. SKIPPED
[INFO] org.eclipse.wst.jsdt.chromium.debug.jsdtbridge ..... SKIPPED
[INFO] org.eclipse.wst.jsdt.chromium.wipbackend.dev ....... SKIPPED
[INFO] org.eclipse.wst.jsdt.chromium.wipbackend.protocol_1_0 SKIPPED
[INFO] org.eclipse.wst.jsdt.chromium.debug.feature ........ SKIPPED
[INFO] org.eclipse.wst.jsdt.chromium_sdk.feature .......... SKIPPED
[INFO] wst4x-sdk .......................................... SKIPPED
[INFO] org.eclipse.wst.jsdt.chromium.debug.core.tests ..... SKIPPED
[INFO] org.eclipse.wst.jsdt.chromium.tests ................ SKIPPED
[INFO] org.eclipse.wst.jsdt.chromium_tests.feature ........ SKIPPED
[INFO] org.eclipse.wst.json.core.tests .................... SKIPPED
[INFO] org.eclipse.wst.json_tests.feature ................. SKIPPED
[INFO] wst4x.tests ........................................ SKIPPED
[INFO] repository ......................................... SKIPPED
[INFO] repositoryunittests ................................ SKIPPED
[INFO] org.eclipse.jpt.assembly.feature ................... SKIPPED
[INFO] org.eclipse.jpt_sdk.assembly.feature ............... SKIPPED
[INFO] org.eclipse.jpt.tests.assembly.feature ............. SKIPPED
[INFO] JPA Editor Update Site ............................. SKIPPED
[INFO] org.eclipse.jst.doc.user.feature ................... SKIPPED
[INFO] org.eclipse.wst.jsdt.js.common.tests ............... SKIPPED
[INFO] org.eclipse.wst.jsdt.integration.tests ............. SKIPPED
[INFO] org.eclipse.jsf.assembly.feature ................... SKIPPED
[INFO] org.eclipse.jst.jsf.doc.feature .................... SKIPPED
[INFO] org.eclipse.wst.server.http.core.tests ............. SKIPPED
[INFO] org.eclipse.wst.server.util.tests .................. SKIPPED
[INFO] PsychoPath XPath 2.0 Processor: SDK Documentation .. SKIPPED
[INFO] PsychoPath XPath 2.0 Processor: SDK Feature ........ SKIPPED
[INFO] PsychoPath XPath 2.0 Processor: Tests for WTP type support SKIPPED
[INFO] org.eclipse.jst.ws.jaxws.assembly.feature .......... SKIPPED
[INFO] wtp-aggregator ..................................... SKIPPED
[INFO] ------------------------------------------------------------------------
[INFO] BUILD FAILURE
[INFO] ------------------------------------------------------------------------
[INFO] Total time: 18:08 min
[INFO] Finished at: 2017-03-09T01:02:04-05:00
[INFO] Final Memory: 977M/11456M
[INFO] ------------------------------------------------------------------------
[INFO] o.h.m.e.h.MavenExecutionResultHandler - Build failed with exception(s)
[INFO] o.h.m.e.h.MavenExecutionResultHandler - [1] org.apache.maven.lifecycle.LifecycleExecutionException: Failed to execute goal org.eclipse.tycho:tycho-compiler-plugin:0.21.0:compile (default-compile) on project org.eclipse.wst.sse.ui: Compilation failure
[DEBUG] Closing connection to remote
[ERROR] Failed to execute goal org.eclipse.tycho:tycho-compiler-plugin:0.21.0:compile (default-compile) on project org.eclipse.wst.sse.ui: Compilation failure: Compilation failure:
[ERROR] /jobs/genie.webtools/WTP-R3_9_Integration/workspace/webtools.sourceediting/bundles/org.eclipse.wst.sse.ui/src/org/eclipse/wst/sse/ui/internal/extension/ExtendedEditorActionProxyForDelayLoading.java:[22]
[ERROR] import org.eclipse.jface.util.ListenerList;
[ERROR] ^^^^^^^^^^^^^^^^^^^^^^^^^^^^^^^^^^^
[ERROR] The import org.eclipse.jface.util.ListenerList cannot be resolved
[ERROR] /jobs/genie.webtools/WTP-R3_9_Integration/workspace/webtools.sourceediting/bundles/org.eclipse.wst.sse.ui/src/org/eclipse/wst/sse/ui/internal/extension/ExtendedEditorActionProxyForDelayLoading.java:[61]
[ERROR] private ListenerList p_listeners = new ListenerList(3);
[ERROR] ^^^^^^^^^^^^
[ERROR] ListenerList cannot be resolved to a type
[ERROR] /jobs/genie.webtools/WTP-R3_9_Integration/workspace/webtools.sourceediting/bundles/org.eclipse.wst.sse.ui/src/org/eclipse/wst/sse/ui/internal/extension/ExtendedEditorActionProxyForDelayLoading.java:[61]
[ERROR] private ListenerList p_listeners = new ListenerList(3);
[ERROR] ^^^^^^^^^^^^
[ERROR] ListenerList cannot be resolved to a type
[ERROR] /jobs/genie.webtools/WTP-R3_9_Integration/workspace/webtools.sourceediting/bundles/org.eclipse.wst.sse.ui/src/org/eclipse/wst/sse/ui/internal/extension/ExtendedEditorActionProxyForDelayLoading.java:[78]
[ERROR] p_listeners.add(listener);
[ERROR] ^^^^^^^^^^^
[ERROR] ListenerList cannot be resolved to a type
[ERROR] /jobs/genie.webtools/WTP-R3_9_Integration/workspace/webtools.sourceediting/bundles/org.eclipse.wst.sse.ui/src/org/eclipse/wst/sse/ui/internal/extension/ExtendedEditorActionProxyForDelayLoading.java:[306]
[ERROR] p_listeners.remove(listener);
[ERROR] ^^^^^^^^^^^
[ERROR] ListenerList cannot be resolved to a type
[ERROR] /jobs/genie.webtools/WTP-R3_9_Integration/workspace/webtools.sourceediting/bundles/org.eclipse.wst.sse.ui/src/org/eclipse/wst/sse/ui/internal/extension/ExtendedEditorActionProxyForDelayLoading.java:[659]
[ERROR] if (p_listeners.size() > 0) {
[ERROR] ^^^^^^^^^^^
[ERROR] ListenerList cannot be resolved to a type
[ERROR] /jobs/genie.webtools/WTP-R3_9_Integration/workspace/webtools.sourceediting/bundles/org.eclipse.wst.sse.ui/src/org/eclipse/wst/sse/ui/internal/extension/ExtendedEditorActionProxyForDelayLoading.java:[660]
[ERROR] Object[] l = p_listeners.getListeners();
[ERROR] ^^^^^^^^^^^
[ERROR] ListenerList cannot be resolved to a type
[ERROR] -> [Help 1]
[ERROR]
[ERROR] To see the full stack trace of the errors, re-run Maven with the -e switch.
[ERROR] Re-run Maven using the -X switch to enable full debug logging.
[ERROR]
[ERROR] For more information about the errors and possible solutions, please read the following articles:
[ERROR] [Help 1] http://cwiki.apache.org/confluence/display/MAVEN/MojoFailureException
[ERROR]
[ERROR] After correcting the problems, you can resume the build with the command
[ERROR]   mvn <goals> -rf :org.eclipse.wst.sse.ui
[DEBUG] Waiting for process to finish
[DEBUG] Result: 1
Terminating xvnc.
Archiving artifacts

--
This message is automatically generated by Hudson.
For more information on Hudson, see: http://hudson-ci.org/
_______________________________________________
wtp-releng mailing list
[hidden email]
To change your delivery options, retrieve your password, or unsubscribe from this list, visit
https://dev.eclipse.org/mailman/listinfo/wtp-releng
Reply | Threaded
Open this post in threaded view
|  
Report Content as Inappropriate

[Hudson] Hudson build is back to normal : WTP-R3_9_Integration #225

hudsonbuild
See <https://hudson.eclipse.org/webtools/job/WTP-R3_9_Integration/225/>


--
This message is automatically generated by Hudson.
For more information on Hudson, see: http://hudson-ci.org/
_______________________________________________
wtp-releng mailing list
[hidden email]
To change your delivery options, retrieve your password, or unsubscribe from this list, visit
https://dev.eclipse.org/mailman/listinfo/wtp-releng
Loading...