[Hudson] Build failed in Hudson: WTP-R3_9_Integration #231

classic Classic list List threaded Threaded
3 messages Options
Reply | Threaded
Open this post in threaded view
|  
Report Content as Inappropriate

[Hudson] Build failed in Hudson: WTP-R3_9_Integration #231

hudsonbuild
See <https://hudson.eclipse.org/webtools/job/WTP-R3_9_Integration/231/>

------------------------------------------
[...truncated 266 lines...]
/jobs/genie.webtools/WTP-R3_9_Integration/workspace/webtools.servertools.tests /jobs/genie.webtools/WTP-R3_9_Integration/workspace
Previous HEAD position was 2d70da7... [442420] org.eclipse.jst.server.core.tests is not completed due to a timeout
Switched to branch 'master'
Your branch is up-to-date with 'origin/master'.
Already up-to-date.
/jobs/genie.webtools/WTP-R3_9_Integration/workspace
/jobs/genie.webtools/WTP-R3_9_Integration/workspace/webtools.sourceediting /jobs/genie.webtools/WTP-R3_9_Integration/workspace
Previous HEAD position was 360e004... [443836] Source Editing Components that require version increase
Switched to branch 'master'
Your branch is up-to-date with 'origin/master'.
Already up-to-date.
/jobs/genie.webtools/WTP-R3_9_Integration/workspace
/jobs/genie.webtools/WTP-R3_9_Integration/workspace/webtools.sourceediting.xpath /jobs/genie.webtools/WTP-R3_9_Integration/workspace
Previous HEAD position was de85043... [443836] Source Editing Components that require version increase
Switched to branch 'master'
Your branch is up-to-date with 'origin/master'.
Already up-to-date.
/jobs/genie.webtools/WTP-R3_9_Integration/workspace
/jobs/genie.webtools/WTP-R3_9_Integration/workspace/webtools.sourceediting.xpath.tests /jobs/genie.webtools/WTP-R3_9_Integration/workspace
Previous HEAD position was 74e7562... [435968] [CBI] Set Eclipse-SourceReferences for sourceediting.xpath
Switched to branch 'master'
Your branch is up-to-date with 'origin/master'.
Already up-to-date.
/jobs/genie.webtools/WTP-R3_9_Integration/workspace
/jobs/genie.webtools/WTP-R3_9_Integration/workspace/webtools.sourceediting.xsl /jobs/genie.webtools/WTP-R3_9_Integration/workspace
Switched to branch 'master'
Your branch is up-to-date with 'origin/master'.
Already up-to-date.
/jobs/genie.webtools/WTP-R3_9_Integration/workspace
/jobs/genie.webtools/WTP-R3_9_Integration/workspace/webtools.sourceediting.xsl.tests /jobs/genie.webtools/WTP-R3_9_Integration/workspace
Switched to branch 'master'
Your branch is up-to-date with 'origin/master'.
Already up-to-date.
/jobs/genie.webtools/WTP-R3_9_Integration/workspace
/jobs/genie.webtools/WTP-R3_9_Integration/workspace/webtools.webservices /jobs/genie.webtools/WTP-R3_9_Integration/workspace
Previous HEAD position was 68a2057... [443846] Version updates needed for WTP 3.6.1
Switched to branch 'master'
Your branch is up-to-date with 'origin/master'.
Already up-to-date.
/jobs/genie.webtools/WTP-R3_9_Integration/workspace
/jobs/genie.webtools/WTP-R3_9_Integration/workspace/webtools.webservices.axis2 /jobs/genie.webtools/WTP-R3_9_Integration/workspace
Previous HEAD position was eeeafe4... [433929] Update the Web Services license features to 1.0.1 for Luna
Switched to branch 'master'
Your branch is up-to-date with 'origin/master'.
Already up-to-date.
/jobs/genie.webtools/WTP-R3_9_Integration/workspace
/jobs/genie.webtools/WTP-R3_9_Integration/workspace/webtools.webservices.jaxws /jobs/genie.webtools/WTP-R3_9_Integration/workspace
Previous HEAD position was 5ea598f... [443846] Version updates needed for WTP 3.6.1
Switched to branch 'master'
Your branch is up-to-date with 'origin/master'.
Already up-to-date.
/jobs/genie.webtools/WTP-R3_9_Integration/workspace
[INFO] Using Maven 3 installation: Maven 3.2.5
[INFO] Checking Maven 3 installation environment
[workspace] $ /shared/common/apache-maven-3.2.5/bin/mvn --help
[INFO] Checking Maven 3 installation version
[INFO] Detected Maven 3 installation version: 3.2.5
[workspace] $ /shared/common/apache-maven-3.2.5/bin/mvn clean install -V -B -Dmaven.test.skip=true -Dmaven.test.error.ignore=true -Dmaven.test.failure.ignore=true -Dsurefire.timeout=1800 -DskipWithIssues=false -Dmaven.ext.class.path=/home/hudson/genie.webtools/.hudson/maven/slavebundle/resources:/home/hudson/genie.webtools/.hudson/maven/slavebundle/lib/maven3-eventspy-3.1.jar:/home/hudson/genie.webtools/.hudson/war/webapp/WEB-INF/lib/hudson-remoting-3.0.3.jar -Dhudson.eventspy.port=37630 -Dmaven.repo.local=<https://hudson.eclipse.org/webtools/job/WTP-R3_9_Integration/ws/.maven/repo> -f pom.xml -P bree-libs -P eclipse-sign -ff
[DEBUG] Waiting for connection on port: 37630
Apache Maven 3.2.5 (12a6b3acb947671f09b81f49094c53f426d8cea1; 2014-12-14T12:29:23-05:00)
Maven home: /shared/common/apache-maven-3.2.5
Java version: 1.8.0_121, vendor: Oracle Corporation
Java home: /opt/public/common/jdk1.8.0_121.x64/jre
Default locale: en_US, platform encoding: UTF-8
OS name: "linux", version: "3.12.51-52.39-default", arch: "amd64", family: "unix"
SLF4J: Class path contains multiple SLF4J bindings.
SLF4J: Found binding in [jar:file:/home/hudson/genie.webtools/.hudson/maven/slavebundle/lib/maven3-eventspy-runtime.jar!/org/slf4j/impl/StaticLoggerBinder.class]
SLF4J: Found binding in [jar:file:/shared/common/apache-maven-3.2.5/lib/slf4j-simple-1.7.5.jar!/org/slf4j/impl/StaticLoggerBinder.class]
SLF4J: See http://www.slf4j.org/codes.html#multiple_bindings for an explanation.
[DEBUG] Connected to remote
[INFO] o.h.m.e.h.SettingsBuildingRequestHandler - Using settings document ID: e23a0b6a-ab36-4ea3-8d97-c6ce7ba3db90
[INFO] o.h.m.e.h.MavenExecutionRequestHandler - Using tool-chains document ID: f1492191-c1d9-4caa-a6bf-44160486454d
[INFO] Scanning for projects...
Downloading: https://oss.sonatype.org/content/repositories/public/org/eclipse/tycho/tycho-maven-plugin/0.21.0/tycho-maven-plugin-0.21.0.pom
Downloaded: https://oss.sonatype.org/content/repositories/public/org/eclipse/tycho/tycho-maven-plugin/0.21.0/tycho-maven-plugin-0.21.0.pom (3 KB at 5.8 KB/sec)
Downloading: https://oss.sonatype.org/content/repositories/public/org/eclipse/tycho/tycho/0.21.0/tycho-0.21.0.pom
Downloaded: https://oss.sonatype.org/content/repositories/public/org/eclipse/tycho/tycho/0.21.0/tycho-0.21.0.pom (18 KB at 102.5 KB/sec)
Downloading: https://oss.sonatype.org/content/repositories/public/org/eclipse/tycho/tycho-core/0.21.0/tycho-core-0.21.0.pom
Downloaded: https://oss.sonatype.org/content/repositories/public/org/eclipse/tycho/tycho-core/0.21.0/tycho-core-0.21.0.pom (5 KB at 32.2 KB/sec)
Downloading: https://oss.sonatype.org/content/repositories/public/org/apache/maven/maven-core/3.0/maven-core-3.0.pom
Downloading: https://repo.eclipse.org/content/repositories/cbi/org/apache/maven/maven-core/3.0/maven-core-3.0.pom
Downloading: https://repo.eclipse.org/content/repositories/tycho-snapshots/org/apache/maven/maven-core/3.0/maven-core-3.0.pom
Downloading: https://repo.eclipse.org/content/repositories/maven_central/org/apache/maven/maven-core/3.0/maven-core-3.0.pom
Downloading: https://oss.sonatype.org/content/repositories/public/org/apache/maven/maven-plugin-api/3.0/maven-plugin-api-3.0.pom
Downloading: https://repo.eclipse.org/content/repositories/cbi/org/apache/maven/maven-plugin-api/3.0/maven-plugin-api-3.0.pom
Downloading: https://repo.eclipse.org/content/repositories/tycho-snapshots/org/apache/maven/maven-plugin-api/3.0/maven-plugin-api-3.0.pom
Downloading: https://repo.eclipse.org/content/repositories/maven_central/org/apache/maven/maven-plugin-api/3.0/maven-plugin-api-3.0.pom
Downloading: https://oss.sonatype.org/content/repositories/public/org/codehaus/plexus/plexus-utils/3.0.7/plexus-utils-3.0.7.pom
Downloading: https://repo.eclipse.org/content/repositories/cbi/org/codehaus/plexus/plexus-utils/3.0.7/plexus-utils-3.0.7.pom
Downloading: https://repo.eclipse.org/content/repositories/tycho-snapshots/org/codehaus/plexus/plexus-utils/3.0.7/plexus-utils-3.0.7.pom
Downloading: https://repo.eclipse.org/content/repositories/maven_central/org/codehaus/plexus/plexus-utils/3.0.7/plexus-utils-3.0.7.pom
Downloading: https://oss.sonatype.org/content/repositories/public/org/codehaus/plexus/plexus-archiver/2.2/plexus-archiver-2.2.pom
Downloading: https://repo.eclipse.org/content/repositories/cbi/org/codehaus/plexus/plexus-archiver/2.2/plexus-archiver-2.2.pom
Downloading: https://repo.eclipse.org/content/repositories/tycho-snapshots/org/codehaus/plexus/plexus-archiver/2.2/plexus-archiver-2.2.pom
Downloading: https://repo.eclipse.org/content/repositories/maven_central/org/codehaus/plexus/plexus-archiver/2.2/plexus-archiver-2.2.pom
Downloading: https://oss.sonatype.org/content/repositories/public/org/eclipse/tycho/org.eclipse.osgi.compatibility.state/1.0.0.v20140403-1907/org.eclipse.osgi.compatibility.state-1.0.0.v20140403-1907.pom
Downloaded: https://oss.sonatype.org/content/repositories/public/org/eclipse/tycho/org.eclipse.osgi.compatibility.state/1.0.0.v20140403-1907/org.eclipse.osgi.compatibility.state-1.0.0.v20140403-1907.pom (2 KB at 3.8 KB/sec)
Downloading: https://oss.sonatype.org/content/repositories/public/org/eclipse/tycho/sisu-equinox-embedder/0.21.0/sisu-equinox-embedder-0.21.0.pom
Downloaded: https://oss.sonatype.org/content/repositories/public/org/eclipse/tycho/sisu-equinox-embedder/0.21.0/sisu-equinox-embedder-0.21.0.pom (2 KB at 12.9 KB/sec)
Downloading: https://oss.sonatype.org/content/repositories/public/org/eclipse/tycho/sisu-equinox/0.21.0/sisu-equinox-0.21.0.pom
Downloaded: https://oss.sonatype.org/content/repositories/public/org/eclipse/tycho/sisu-equinox/0.21.0/sisu-equinox-0.21.0.pom (2 KB at 7.4 KB/sec)
Downloading: https://oss.sonatype.org/content/repositories/public/org/codehaus/plexus/plexus-component-annotations/1.5.5/plexus-component-annotations-1.5.5.pom
Downloading: https://repo.eclipse.org/content/repositories/cbi/org/codehaus/plexus/plexus-component-annotations/1.5.5/plexus-component-annotations-1.5.5.pom
Downloading: https://repo.eclipse.org/content/repositories/tycho-snapshots/org/codehaus/plexus/plexus-component-annotations/1.5.5/plexus-component-annotations-1.5.5.pom
Downloading: https://repo.eclipse.org/content/repositories/maven_central/org/codehaus/plexus/plexus-component-annotations/1.5.5/plexus-component-annotations-1.5.5.pom
Downloading: https://oss.sonatype.org/content/repositories/public/org/eclipse/tycho/org.eclipse.osgi/3.10.0.v20140606-1445/org.eclipse.osgi-3.10.0.v20140606-1445.pom
Downloaded: https://oss.sonatype.org/content/repositories/public/org/eclipse/tycho/org.eclipse.osgi/3.10.0.v20140606-1445/org.eclipse.osgi-3.10.0.v20140606-1445.pom (2 KB at 4.0 KB/sec)
Downloading: https://oss.sonatype.org/content/repositories/public/org/eclipse/tycho/sisu-equinox-api/0.21.0/sisu-equinox-api-0.21.0.pom
Downloaded: https://oss.sonatype.org/content/repositories/public/org/eclipse/tycho/sisu-equinox-api/0.21.0/sisu-equinox-api-0.21.0.pom (2 KB at 15.7 KB/sec)
Downloading: https://oss.sonatype.org/content/repositories/public/org/eclipse/tycho/tycho-metadata-model/0.21.0/tycho-metadata-model-0.21.0.pom
Downloaded: https://oss.sonatype.org/content/repositories/public/org/eclipse/tycho/tycho-metadata-model/0.21.0/tycho-metadata-model-0.21.0.pom (2 KB at 10.8 KB/sec)
Downloading: https://oss.sonatype.org/content/repositories/public/de/pdark/decentxml/1.3/decentxml-1.3.pom
Downloaded: https://oss.sonatype.org/content/repositories/public/de/pdark/decentxml/1.3/decentxml-1.3.pom (7 KB at 44.1 KB/sec)
Downloading: https://oss.sonatype.org/content/repositories/public/org/eclipse/tycho/tycho-embedder-api/0.21.0/tycho-embedder-api-0.21.0.pom
Downloaded: https://oss.sonatype.org/content/repositories/public/org/eclipse/tycho/tycho-embedder-api/0.21.0/tycho-embedder-api-0.21.0.pom (3 KB at 18.2 KB/sec)
Downloading: https://oss.sonatype.org/content/repositories/public/org/eclipse/tycho/org.eclipse.tycho.embedder.shared/0.21.0/org.eclipse.tycho.embedder.shared-0.21.0.pom
Downloaded: https://oss.sonatype.org/content/repositories/public/org/eclipse/tycho/org.eclipse.tycho.embedder.shared/0.21.0/org.eclipse.tycho.embedder.shared-0.21.0.pom (2 KB at 9.7 KB/sec)
Downloading: https://oss.sonatype.org/content/repositories/public/org/eclipse/tycho/tycho-bundles/0.21.0/tycho-bundles-0.21.0.pom
Downloaded: https://oss.sonatype.org/content/repositories/public/org/eclipse/tycho/tycho-bundles/0.21.0/tycho-bundles-0.21.0.pom (3 KB at 25.8 KB/sec)
Downloading: https://oss.sonatype.org/content/repositories/public/org/eclipse/tycho/org.eclipse.tycho.core.shared/0.21.0/org.eclipse.tycho.core.shared-0.21.0.pom
Downloaded: https://oss.sonatype.org/content/repositories/public/org/eclipse/tycho/org.eclipse.tycho.core.shared/0.21.0/org.eclipse.tycho.core.shared-0.21.0.pom (2 KB at 8.9 KB/sec)
Downloading: https://oss.sonatype.org/content/repositories/public/org/eclipse/tycho/tycho-p2-facade/0.21.0/tycho-p2-facade-0.21.0.pom
Downloaded: https://oss.sonatype.org/content/repositories/public/org/eclipse/tycho/tycho-p2-facade/0.21.0/tycho-p2-facade-0.21.0.pom (3 KB at 18.9 KB/sec)
Downloading: https://oss.sonatype.org/content/repositories/public/org/eclipse/tycho/tycho-p2/0.21.0/tycho-p2-0.21.0.pom
Downloaded: https://oss.sonatype.org/content/repositories/public/org/eclipse/tycho/tycho-p2/0.21.0/tycho-p2-0.21.0.pom (2 KB at 10.5 KB/sec)
Downloading: https://oss.sonatype.org/content/repositories/public/org/eclipse/tycho/org.eclipse.tycho.p2.resolver.shared/0.21.0/org.eclipse.tycho.p2.resolver.shared-0.21.0.pom
Downloaded: https://oss.sonatype.org/content/repositories/public/org/eclipse/tycho/org.eclipse.tycho.p2.resolver.shared/0.21.0/org.eclipse.tycho.p2.resolver.shared-0.21.0.pom (2 KB at 9.0 KB/sec)
Downloading: https://oss.sonatype.org/content/repositories/public/org/eclipse/tycho/org.eclipse.tycho.p2.tools.shared/0.21.0/org.eclipse.tycho.p2.tools.shared-0.21.0.pom
Downloaded: https://oss.sonatype.org/content/repositories/public/org/eclipse/tycho/org.eclipse.tycho.p2.tools.shared/0.21.0/org.eclipse.tycho.p2.tools.shared-0.21.0.pom (2 KB at 9.4 KB/sec)
[INFO] o.h.m.e.h.MavenExecutionResultHandler - Build failed with exception(s)
[INFO] o.h.m.e.h.MavenExecutionResultHandler - [1] org.apache.maven.project.ProjectBuildingException: Some problems were encountered while processing the POMs:
[ERROR] Unresolveable build extension: Plugin org.eclipse.tycho:tycho-maven-plugin:0.21.0 or one of its dependencies could not be resolved: Failed to collect dependencies at org.eclipse.tycho:tycho-maven-plugin:jar:0.21.0 -> org.eclipse.tycho:tycho-core:jar:0.21.0 -> org.apache.maven:maven-core:jar:3.0 @
[ERROR] Unresolveable build extension: Plugin org.eclipse.tycho:tycho-maven-plugin:0.21.0 or one of its dependencies could not be resolved: Failed to collect dependencies at org.eclipse.tycho:tycho-maven-plugin:jar:0.21.0 -> org.eclipse.tycho:tycho-core:jar:0.21.0 -> org.apache.maven:maven-core:jar:3.0 @
[ERROR] Unresolveable build extension: Plugin org.eclipse.tycho:tycho-maven-plugin:0.21.0 or one of its dependencies could not be resolved: Failed to collect dependencies at org.eclipse.tycho:tycho-maven-plugin:jar:0.21.0 -> org.eclipse.tycho:tycho-core:jar:0.21.0 -> org.apache.maven:maven-core:jar:3.0 @
[ERROR] Unresolveable build extension: Plugin org.eclipse.tycho:tycho-maven-plugin:0.21.0 or one of its dependencies could not be resolved: Failed to collect dependencies at org.eclipse.tycho:tycho-maven-plugin:jar:0.21.0 -> org.eclipse.tycho:tycho-core:jar:0.21.0 -> org.apache.maven:maven-core:jar:3.0 @
[ERROR] Unresolveable build extension: Plugin org.eclipse.tycho:tycho-maven-plugin:0.21.0 or one of its dependencies could not be resolved: Failed to collect dependencies at org.eclipse.tycho:tycho-maven-plugin:jar:0.21.0 -> org.eclipse.tycho:tycho-core:jar:0.21.0 -> org.apache.maven:maven-core:jar:3.0 @
[ERROR] Unresolveable build extension: Plugin org.eclipse.tycho:tycho-maven-plugin:0.21.0 or one of its dependencies could not be resolved: Failed to collect dependencies at org.eclipse.tycho:tycho-maven-plugin:jar:0.21.0 -> org.eclipse.tycho:tycho-core:jar:0.21.0 -> org.apache.maven:maven-core:jar:3.0 @
[ERROR] Unresolveable build extension: Plugin org.eclipse.tycho:tycho-maven-plugin:0.21.0 or one of its dependencies could not be resolved: Failed to collect dependencies at org.eclipse.tycho:tycho-maven-plugin:jar:0.21.0 -> org.eclipse.tycho:tycho-core:jar:0.21.0 -> org.apache.maven:maven-core:jar:3.0 @
[ERROR] Unresolveable build extension: Plugin org.eclipse.tycho:tycho-maven-plugin:0.21.0 or one of its dependencies could not be resolved: Failed to collect dependencies at org.eclipse.tycho:tycho-maven-plugin:jar:0.21.0 -> org.eclipse.tycho:tycho-core:jar:0.21.0 -> org.apache.maven:maven-core:jar:3.0 @
[ERROR] Unresolveable build extension: Plugin org.eclipse.tycho:tycho-maven-plugin:0.21.0 or one of its dependencies could not be resolved: Failed to collect dependencies at org.eclipse.tycho:tycho-maven-plugin:jar:0.21.0 -> org.eclipse.tycho:tycho-core:jar:0.21.0 -> org.apache.maven:maven-core:jar:3.0 @
[ERROR] Unresolveable build extension: Plugin org.eclipse.tycho:tycho-maven-plugin:0.21.0 or one of its dependencies could not be resolved: Failed to collect dependencies at org.eclipse.tycho:tycho-maven-plugin:jar:0.21.0 -> org.eclipse.tycho:tycho-core:jar:0.21.0 -> org.apache.maven:maven-core:jar:3.0 @
[ERROR] Unresolveable build extension: Plugin org.eclipse.tycho:tycho-maven-plugin:0.21.0 or one of its dependencies could not be resolved: Failed to collect dependencies at org.eclipse.tycho:tycho-maven-plugin:jar:0.21.0 -> org.eclipse.tycho:tycho-core:jar:0.21.0 -> org.apache.maven:maven-core:jar:3.0 @
[ERROR] Unresolveable build extension: Plugin org.eclipse.tycho:tycho-maven-plugin:0.21.0 or one of its dependencies could not be resolved: Failed to collect dependencies at org.eclipse.tycho:tycho-maven-plugin:jar:0.21.0 -> org.eclipse.tycho:tycho-core:jar:0.21.0 -> org.apache.maven:maven-core:jar:3.0 @
[ERROR] Unresolveable build extension: Plugin org.eclipse.tycho:tycho-maven-plugin:0.21.0 or one of its dependencies could not be resolved: Failed to collect dependencies at org.eclipse.tycho:tycho-maven-plugin:jar:0.21.0 -> org.eclipse.tycho:tycho-core:jar:0.21.0 -> org.apache.maven:maven-core:jar:3.0 @
[ERROR] Unresolveable build extension: Plugin org.eclipse.tycho:tycho-maven-plugin:0.21.0 or one of its dependencies could not be resolved: Failed to collect dependencies at org.eclipse.tycho:tycho-maven-plugin:jar:0.21.0 -> org.eclipse.tycho:tycho-core:jar:0.21.0 -> org.apache.maven:maven-core:jar:3.0 @
[ERROR] Unresolveable build extension: Plugin org.eclipse.tycho:tycho-maven-plugin:0.21.0 or one of its dependencies could not be resolved: Failed to collect dependencies at org.eclipse.tycho:tycho-maven-plugin:jar:0.21.0 -> org.eclipse.tycho:tycho-core:jar:0.21.0 -> org.apache.maven:maven-core:jar:3.0 @
[ERROR] Unresolveable build extension: Plugin org.eclipse.tycho:tycho-maven-plugin:0.21.0 or one of its dependencies could not be resolved: Failed to collect dependencies at org.eclipse.tycho:tycho-maven-plugin:jar:0.21.0 -> org.eclipse.tycho:tycho-core:jar:0.21.0 -> org.apache.maven:maven-core:jar:3.0 @
[ERROR] Unresolveable build extension: Plugin org.eclipse.tycho:tycho-maven-plugin:0.21.0 or one of its dependencies could not be resolved: Failed to collect dependencies at org.eclipse.tycho:tycho-maven-plugin:jar:0.21.0 -> org.eclipse.tycho:tycho-core:jar:0.21.0 -> org.apache.maven:maven-core:jar:3.0 @
[ERROR] Unresolveable build extension: Plugin org.eclipse.tycho:tycho-maven-plugin:0.21.0 or one of its dependencies could not be resolved: Failed to collect dependencies at org.eclipse.tycho:tycho-maven-plugin:jar:0.21.0 -> org.eclipse.tycho:tycho-core:jar:0.21.0 -> org.apache.maven:maven-core:jar:3.0 @
[ERROR] Unresolveable build extension: Plugin org.eclipse.tycho:tycho-maven-plugin:0.21.0 or one of its dependencies could not be resolved: Failed to collect dependencies at org.eclipse.tycho:tycho-maven-plugin:jar:0.21.0 -> org.eclipse.tycho:tycho-core:jar:0.21.0 -> org.apache.maven:maven-core:jar:3.0 @
[ERROR] Unresolveable build extension: Plugin org.eclipse.tycho:tycho-maven-plugin:0.21.0 or one of its dependencies could not be resolved: Failed to collect dependencies at org.eclipse.tycho:tycho-maven-plugin:jar:0.21.0 -> org.eclipse.tycho:tycho-core:jar:0.21.0 -> org.apache.maven:maven-core:jar:3.0 @
[ERROR] Unresolveable build extension: Plugin org.eclipse.tycho:tycho-maven-plugin:0.21.0 or one of its dependencies could not be resolved: Failed to collect dependencies at org.eclipse.tycho:tycho-maven-plugin:jar:0.21.0 -> org.eclipse.tycho:tycho-core:jar:0.21.0 -> org.apache.maven:maven-core:jar:3.0 @
[ERROR] Unresolveable build extension: Plugin org.eclipse.tycho:tycho-maven-plugin:0.21.0 or one of its dependencies could not be resolved: Failed to collect dependencies at org.eclipse.tycho:tycho-maven-plugin:jar:0.21.0 -> org.eclipse.tycho:tycho-core:jar:0.21.0 -> org.apache.maven:maven-core:jar:3.0 @
[ERROR] Unresolveable build extension: Plugin org.eclipse.tycho:tycho-maven-plugin:0.21.0 or one of its dependencies could not be resolved: Failed to collect dependencies at org.eclipse.tycho:tycho-maven-plugin:jar:0.21.0 -> org.eclipse.tycho:tycho-core:jar:0.21.0 -> org.apache.maven:maven-core:jar:3.0 @
[ERROR] Unresolveable build extension: Plugin org.eclipse.tycho:tycho-maven-plugin:0.21.0 or one of its dependencies could not be resolved: Failed to collect dependencies at org.eclipse.tycho:tycho-maven-plugin:jar:0.21.0 -> org.eclipse.tycho:tycho-core:jar:0.21.0 -> org.apache.maven:maven-core:jar:3.0 @
[ERROR] Unresolveable build extension: Plugin org.eclipse.tycho:tycho-maven-plugin:0.21.0 or one of its dependencies could not be resolved: Failed to collect dependencies at org.eclipse.tycho:tycho-maven-plugin:jar:0.21.0 -> org.eclipse.tycho:tycho-core:jar:0.21.0 -> org.apache.maven:maven-core:jar:3.0 @
[ERROR] Unresolveable build extension: Plugin org.eclipse.tycho:tycho-maven-plugin:0.21.0 or one of its dependencies could not be resolved: Failed to collect dependencies at org.eclipse.tycho:tycho-maven-plugin:jar:0.21.0 -> org.eclipse.tycho:tycho-core:jar:0.21.0 -> org.apache.maven:maven-core:jar:3.0 @

[DEBUG] Closing connection to remote
[ERROR] The build could not read 26 projects -> [Help 1]
[ERROR]  
[ERROR]   The project org.eclipse:wtp-parent:3.6.0-SNAPSHOT (/jobs/genie.webtools/WTP-R3_9_Integration/workspace/wtp-parent/pom.xml) has 1 error
[ERROR]     Unresolveable build extension: Plugin org.eclipse.tycho:tycho-maven-plugin:0.21.0 or one of its dependencies could not be resolved: Failed to collect dependencies at org.eclipse.tycho:tycho-maven-plugin:jar:0.21.0 -> org.eclipse.tycho:tycho-core:jar:0.21.0 -> org.apache.maven:maven-core:jar:3.0: Failed to read artifact descriptor for org.apache.maven:maven-core:jar:3.0: Could not transfer artifact org.apache.maven:maven-core:pom:3.0 from/to cbi-repo (https://repo.eclipse.org/content/repositories/cbi/): Connect to repo.eclipse.org:443 [repo.eclipse.org/198.41.30.233] failed: Connection timed out (Connection timed out) -> [Help 2]
[ERROR]  
[ERROR]   The project org.eclipse.webtools.releng:org.eclipse.webtools.releng:3.6.0-SNAPSHOT (/jobs/genie.webtools/WTP-R3_9_Integration/workspace/webtools.releng/pom.xml) has 1 error
[ERROR]     Unresolveable build extension: Plugin org.eclipse.tycho:tycho-maven-plugin:0.21.0 or one of its dependencies could not be resolved: Failed to collect dependencies at org.eclipse.tycho:tycho-maven-plugin:jar:0.21.0 -> org.eclipse.tycho:tycho-core:jar:0.21.0 -> org.apache.maven:maven-core:jar:3.0: Failed to read artifact descriptor for org.apache.maven:maven-core:jar:3.0: Could not transfer artifact org.apache.maven:maven-core:pom:3.0 from/to cbi-repo (https://repo.eclipse.org/content/repositories/cbi/): Connect to repo.eclipse.org:443 [repo.eclipse.org/198.41.30.233] failed: Connection timed out (Connection timed out) -> [Help 2]
[ERROR]  
[ERROR]   The project org.eclipse.webtools:repositories:3.6.0-SNAPSHOT (/jobs/genie.webtools/WTP-R3_9_Integration/workspace/webtools.repositories/pom.xml) has 1 error
[ERROR]     Unresolveable build extension: Plugin org.eclipse.tycho:tycho-maven-plugin:0.21.0 or one of its dependencies could not be resolved: Failed to collect dependencies at org.eclipse.tycho:tycho-maven-plugin:jar:0.21.0 -> org.eclipse.tycho:tycho-core:jar:0.21.0 -> org.apache.maven:maven-core:jar:3.0: Failed to read artifact descriptor for org.apache.maven:maven-core:jar:3.0: Could not transfer artifact org.apache.maven:maven-core:pom:3.0 from/to cbi-repo (https://repo.eclipse.org/content/repositories/cbi/): Connect to repo.eclipse.org:443 [repo.eclipse.org/198.41.30.233] failed: Connection timed out (Connection timed out) -> [Help 2]
[ERROR]  
[ERROR]   The project org.eclipse.webtools.common:org.eclipse.webtools.common:3.6.0-SNAPSHOT (/jobs/genie.webtools/WTP-R3_9_Integration/workspace/webtools.common/pom.xml) has 1 error
[ERROR]     Unresolveable build extension: Plugin org.eclipse.tycho:tycho-maven-plugin:0.21.0 or one of its dependencies could not be resolved: Failed to collect dependencies at org.eclipse.tycho:tycho-maven-plugin:jar:0.21.0 -> org.eclipse.tycho:tycho-core:jar:0.21.0 -> org.apache.maven:maven-core:jar:3.0: Failed to read artifact descriptor for org.apache.maven:maven-core:jar:3.0: Could not transfer artifact org.apache.maven:maven-core:pom:3.0 from/to cbi-repo (https://repo.eclipse.org/content/repositories/cbi/): Connect to repo.eclipse.org:443 [repo.eclipse.org/198.41.30.233] failed: Connection timed out (Connection timed out) -> [Help 2]
[ERROR]  
[ERROR]   The project org.eclipse.webtools.common:org.eclipse.webtools.common.fproj:3.6.0-SNAPSHOT (/jobs/genie.webtools/WTP-R3_9_Integration/workspace/webtools.common.fproj/pom.xml) has 1 error
[ERROR]     Unresolveable build extension: Plugin org.eclipse.tycho:tycho-maven-plugin:0.21.0 or one of its dependencies could not be resolved: Failed to collect dependencies at org.eclipse.tycho:tycho-maven-plugin:jar:0.21.0 -> org.eclipse.tycho:tycho-core:jar:0.21.0 -> org.apache.maven:maven-core:jar:3.0: Failed to read artifact descriptor for org.apache.maven:maven-core:jar:3.0: Could not transfer artifact org.apache.maven:maven-core:pom:3.0 from/to cbi-repo (https://repo.eclipse.org/content/repositories/cbi/): Connect to repo.eclipse.org:443 [repo.eclipse.org/198.41.30.233] failed: Connection timed out (Connection timed out) -> [Help 2]
[ERROR]  
[ERROR]   The project org.eclipse.webtools.common:org.eclipse.webtools.common.snippets:3.6.0-SNAPSHOT (/jobs/genie.webtools/WTP-R3_9_Integration/workspace/webtools.common.snippets/pom.xml) has 1 error
[ERROR]     Unresolveable build extension: Plugin org.eclipse.tycho:tycho-maven-plugin:0.21.0 or one of its dependencies could not be resolved: Failed to collect dependencies at org.eclipse.tycho:tycho-maven-plugin:jar:0.21.0 -> org.eclipse.tycho:tycho-core:jar:0.21.0 -> org.apache.maven:maven-core:jar:3.0: Failed to read artifact descriptor for org.apache.maven:maven-core:jar:3.0: Could not transfer artifact org.apache.maven:maven-core:pom:3.0 from/to cbi-repo (https://repo.eclipse.org/content/repositories/cbi/): Connect to repo.eclipse.org:443 [repo.eclipse.org/198.41.30.233] failed: Connection timed out (Connection timed out) -> [Help 2]
[ERROR]  
[ERROR]   The project org.eclipse.webtools.common:org.eclipse.webtools.common.tests:3.6.0-SNAPSHOT (/jobs/genie.webtools/WTP-R3_9_Integration/workspace/webtools.common.tests/pom.xml) has 1 error
[ERROR]     Unresolveable build extension: Plugin org.eclipse.tycho:tycho-maven-plugin:0.21.0 or one of its dependencies could not be resolved: Failed to collect dependencies at org.eclipse.tycho:tycho-maven-plugin:jar:0.21.0 -> org.eclipse.tycho:tycho-core:jar:0.21.0 -> org.apache.maven:maven-core:jar:3.0: Failed to read artifact descriptor for org.apache.maven:maven-core:jar:3.0: Could not transfer artifact org.apache.maven:maven-core:pom:3.0 from/to cbi-repo (https://repo.eclipse.org/content/repositories/cbi/): Connect to repo.eclipse.org:443 [repo.eclipse.org/198.41.30.233] failed: Connection timed out (Connection timed out) -> [Help 2]
[ERROR]  
[ERROR]   The project org.eclipse.webtools.dali:org.eclipse.webtools.dali:3.4.0-SNAPSHOT (/jobs/genie.webtools/WTP-R3_9_Integration/workspace/webtools.dali/pom.xml) has 1 error
[ERROR]     Unresolveable build extension: Plugin org.eclipse.tycho:tycho-maven-plugin:0.21.0 or one of its dependencies could not be resolved: Failed to collect dependencies at org.eclipse.tycho:tycho-maven-plugin:jar:0.21.0 -> org.eclipse.tycho:tycho-core:jar:0.21.0 -> org.apache.maven:maven-core:jar:3.0: Failed to read artifact descriptor for org.apache.maven:maven-core:jar:3.0: Could not transfer artifact org.apache.maven:maven-core:pom:3.0 from/to cbi-repo (https://repo.eclipse.org/content/repositories/cbi/): Connect to repo.eclipse.org:443 [repo.eclipse.org/198.41.30.233] failed: Connection timed out (Connection timed out) -> [Help 2]
[ERROR]  
[ERROR]   The project org.eclipse.webtools.ejb:org.eclipse.webtools.ejb:3.6.0-SNAPSHOT (/jobs/genie.webtools/WTP-R3_9_Integration/workspace/webtools.ejb/pom.xml) has 1 error
[ERROR]     Unresolveable build extension: Plugin org.eclipse.tycho:tycho-maven-plugin:0.21.0 or one of its dependencies could not be resolved: Failed to collect dependencies at org.eclipse.tycho:tycho-maven-plugin:jar:0.21.0 -> org.eclipse.tycho:tycho-core:jar:0.21.0 -> org.apache.maven:maven-core:jar:3.0: Failed to read artifact descriptor for org.apache.maven:maven-core:jar:3.0: Could not transfer artifact org.apache.maven:maven-core:pom:3.0 from/to cbi-repo (https://repo.eclipse.org/content/repositories/cbi/): Connect to repo.eclipse.org:443 [repo.eclipse.org/198.41.30.233] failed: Connection timed out (Connection timed out) -> [Help 2]
[ERROR]  
[ERROR]   The project org.eclipse.webtools.javaee:org.eclipse.webtools.javaee:3.6.0-SNAPSHOT (/jobs/genie.webtools/WTP-R3_9_Integration/workspace/webtools.javaee/pom.xml) has 1 error
[ERROR]     Unresolveable build extension: Plugin org.eclipse.tycho:tycho-maven-plugin:0.21.0 or one of its dependencies could not be resolved: Failed to collect dependencies at org.eclipse.tycho:tycho-maven-plugin:jar:0.21.0 -> org.eclipse.tycho:tycho-core:jar:0.21.0 -> org.apache.maven:maven-core:jar:3.0: Failed to read artifact descriptor for org.apache.maven:maven-core:jar:3.0: Could not transfer artifact org.apache.maven:maven-core:pom:3.0 from/to cbi-repo (https://repo.eclipse.org/content/repositories/cbi/): Connect to repo.eclipse.org:443 [repo.eclipse.org/198.41.30.233] failed: Connection timed out (Connection timed out) -> [Help 2]
[ERROR]  
[ERROR]   The project org.eclipse.webtools.javaee:org.eclipse.webtools.javaee.tests:3.6.0-SNAPSHOT (/jobs/genie.webtools/WTP-R3_9_Integration/workspace/webtools.javaee.tests/pom.xml) has 1 error
[ERROR]     Unresolveable build extension: Plugin org.eclipse.tycho:tycho-maven-plugin:0.21.0 or one of its dependencies could not be resolved: Failed to collect dependencies at org.eclipse.tycho:tycho-maven-plugin:jar:0.21.0 -> org.eclipse.tycho:tycho-core:jar:0.21.0 -> org.apache.maven:maven-core:jar:3.0: Failed to read artifact descriptor for org.apache.maven:maven-core:jar:3.0: Could not transfer artifact org.apache.maven:maven-core:pom:3.0 from/to cbi-repo (https://repo.eclipse.org/content/repositories/cbi/): Connect to repo.eclipse.org:443 [repo.eclipse.org/198.41.30.233] failed: Connection timed out (Connection timed out) -> [Help 2]
[ERROR]  
[ERROR]   The project org.eclipse.webtools.jsdt:jsdt-parent:3.6.0-SNAPSHOT (/jobs/genie.webtools/WTP-R3_9_Integration/workspace/webtools.jsdt/pom.xml) has 1 error
[ERROR]     Unresolveable build extension: Plugin org.eclipse.tycho:tycho-maven-plugin:0.21.0 or one of its dependencies could not be resolved: Failed to collect dependencies at org.eclipse.tycho:tycho-maven-plugin:jar:0.21.0 -> org.eclipse.tycho:tycho-core:jar:0.21.0 -> org.apache.maven:maven-core:jar:3.0: Failed to read artifact descriptor for org.apache.maven:maven-core:jar:3.0: Could not transfer artifact org.apache.maven:maven-core:pom:3.0 from/to cbi-repo (https://repo.eclipse.org/content/repositories/cbi/): Connect to repo.eclipse.org:443 [repo.eclipse.org/198.41.30.233] failed: Connection timed out (Connection timed out) -> [Help 2]
[ERROR]  
[ERROR]   The project org.eclipse.webtools.jsf:org.eclipse.webtools.jsf:3.6.0-SNAPSHOT (/jobs/genie.webtools/WTP-R3_9_Integration/workspace/webtools.jsf/pom.xml) has 1 error
[ERROR]     Unresolveable build extension: Plugin org.eclipse.tycho:tycho-maven-plugin:0.21.0 or one of its dependencies could not be resolved: Failed to collect dependencies at org.eclipse.tycho:tycho-maven-plugin:jar:0.21.0 -> org.eclipse.tycho:tycho-core:jar:0.21.0 -> org.apache.maven:maven-core:jar:3.0: Failed to read artifact descriptor for org.apache.maven:maven-core:jar:3.0: Could not transfer artifact org.apache.maven:maven-core:pom:3.0 from/to cbi-repo (https://repo.eclipse.org/content/repositories/cbi/): Connect to repo.eclipse.org:443 [repo.eclipse.org/198.41.30.233] failed: Connection timed out (Connection timed out) -> [Help 2]
[ERROR]  
[ERROR]   The project org.eclipse.webtools.jsf:org.eclipse.webtools.jsf.docs:3.6.0-SNAPSHOT (/jobs/genie.webtools/WTP-R3_9_Integration/workspace/webtools.jsf.docs/pom.xml) has 1 error
[ERROR]     Unresolveable build extension: Plugin org.eclipse.tycho:tycho-maven-plugin:0.21.0 or one of its dependencies could not be resolved: Failed to collect dependencies at org.eclipse.tycho:tycho-maven-plugin:jar:0.21.0 -> org.eclipse.tycho:tycho-core:jar:0.21.0 -> org.apache.maven:maven-core:jar:3.0: Failed to read artifact descriptor for org.apache.maven:maven-core:jar:3.0: Could not transfer artifact org.apache.maven:maven-core:pom:3.0 from/to cbi-repo (https://repo.eclipse.org/content/repositories/cbi/): Connect to repo.eclipse.org:443 [repo.eclipse.org/198.41.30.233] failed: Connection timed out (Connection timed out) -> [Help 2]
[ERROR]  
[ERROR]   The project org.eclipse.webtools.jsf:org.eclipse.webtools.jsf.tests:3.6.0-SNAPSHOT (/jobs/genie.webtools/WTP-R3_9_Integration/workspace/webtools.jsf.tests/pom.xml) has 1 error
[ERROR]     Unresolveable build extension: Plugin org.eclipse.tycho:tycho-maven-plugin:0.21.0 or one of its dependencies could not be resolved: Failed to collect dependencies at org.eclipse.tycho:tycho-maven-plugin:jar:0.21.0 -> org.eclipse.tycho:tycho-core:jar:0.21.0 -> org.apache.maven:maven-core:jar:3.0: Failed to read artifact descriptor for org.apache.maven:maven-core:jar:3.0: Could not transfer artifact org.apache.maven:maven-core:pom:3.0 from/to cbi-repo (https://repo.eclipse.org/content/repositories/cbi/): Connect to repo.eclipse.org:443 [repo.eclipse.org/198.41.30.233] failed: Connection timed out (Connection timed out) -> [Help 2]
[ERROR]  
[ERROR]   The project org.eclipse.webtools.servertools:org.eclipse.webtools.servertools:3.6.0-SNAPSHOT (/jobs/genie.webtools/WTP-R3_9_Integration/workspace/webtools.servertools/pom.xml) has 1 error
[ERROR]     Unresolveable build extension: Plugin org.eclipse.tycho:tycho-maven-plugin:0.21.0 or one of its dependencies could not be resolved: Failed to collect dependencies at org.eclipse.tycho:tycho-maven-plugin:jar:0.21.0 -> org.eclipse.tycho:tycho-core:jar:0.21.0 -> org.apache.maven:maven-core:jar:3.0: Failed to read artifact descriptor for org.apache.maven:maven-core:jar:3.0: Could not transfer artifact org.apache.maven:maven-core:pom:3.0 from/to cbi-repo (https://repo.eclipse.org/content/repositories/cbi/): Connect to repo.eclipse.org:443 [repo.eclipse.org/198.41.30.233] failed: Connection timed out (Connection timed out) -> [Help 2]
[ERROR]  
[ERROR]   The project org.eclipse.webtools.servertools:org.eclipse.webtools.servertools.docs:3.6.0-SNAPSHOT (/jobs/genie.webtools/WTP-R3_9_Integration/workspace/webtools.servertools.docs/pom.xml) has 1 error
[ERROR]     Unresolveable build extension: Plugin org.eclipse.tycho:tycho-maven-plugin:0.21.0 or one of its dependencies could not be resolved: Failed to collect dependencies at org.eclipse.tycho:tycho-maven-plugin:jar:0.21.0 -> org.eclipse.tycho:tycho-core:jar:0.21.0 -> org.apache.maven:maven-core:jar:3.0: Failed to read artifact descriptor for org.apache.maven:maven-core:jar:3.0: Could not transfer artifact org.apache.maven:maven-core:pom:3.0 from/to cbi-repo (https://repo.eclipse.org/content/repositories/cbi/): Connect to repo.eclipse.org:443 [repo.eclipse.org/198.41.30.233] failed: Connection timed out (Connection timed out) -> [Help 2]
[ERROR]  
[ERROR]   The project org.eclipse.webtools.servertools:org.eclipse.webtools.servertools.tests:3.6.0-SNAPSHOT (/jobs/genie.webtools/WTP-R3_9_Integration/workspace/webtools.servertools.tests/pom.xml) has 1 error
[ERROR]     Unresolveable build extension: Plugin org.eclipse.tycho:tycho-maven-plugin:0.21.0 or one of its dependencies could not be resolved: Failed to collect dependencies at org.eclipse.tycho:tycho-maven-plugin:jar:0.21.0 -> org.eclipse.tycho:tycho-core:jar:0.21.0 -> org.apache.maven:maven-core:jar:3.0: Failed to read artifact descriptor for org.apache.maven:maven-core:jar:3.0: Could not transfer artifact org.apache.maven:maven-core:pom:3.0 from/to cbi-repo (https://repo.eclipse.org/content/repositories/cbi/): Connect to repo.eclipse.org:443 [repo.eclipse.org/198.41.30.233] failed: Connection timed out (Connection timed out) -> [Help 2]
[ERROR]  
[ERROR]   The project org.eclipse.webtools.sourceediting:sourceediting-parent:3.6.0-SNAPSHOT (/jobs/genie.webtools/WTP-R3_9_Integration/workspace/webtools.sourceediting/pom.xml) has 1 error
[ERROR]     Unresolveable build extension: Plugin org.eclipse.tycho:tycho-maven-plugin:0.21.0 or one of its dependencies could not be resolved: Failed to collect dependencies at org.eclipse.tycho:tycho-maven-plugin:jar:0.21.0 -> org.eclipse.tycho:tycho-core:jar:0.21.0 -> org.apache.maven:maven-core:jar:3.0: Failed to read artifact descriptor for org.apache.maven:maven-core:jar:3.0: Could not transfer artifact org.apache.maven:maven-core:pom:3.0 from/to cbi-repo (https://repo.eclipse.org/content/repositories/cbi/): Connect to repo.eclipse.org:443 [repo.eclipse.org/198.41.30.233] failed: Connection timed out (Connection timed out) -> [Help 2]
[ERROR]  
[ERROR]   The project org.eclipse.webtools.sourceediting:org.eclipse.webtools.sourceediting.xpath:3.6.0-SNAPSHOT (/jobs/genie.webtools/WTP-R3_9_Integration/workspace/webtools.sourceediting.xpath/pom.xml) has 1 error
[ERROR]     Unresolveable build extension: Plugin org.eclipse.tycho:tycho-maven-plugin:0.21.0 or one of its dependencies could not be resolved: Failed to collect dependencies at org.eclipse.tycho:tycho-maven-plugin:jar:0.21.0 -> org.eclipse.tycho:tycho-core:jar:0.21.0 -> org.apache.maven:maven-core:jar:3.0: Failed to read artifact descriptor for org.apache.maven:maven-core:jar:3.0: Could not transfer artifact org.apache.maven:maven-core:pom:3.0 from/to cbi-repo (https://repo.eclipse.org/content/repositories/cbi/): Connect to repo.eclipse.org:443 [repo.eclipse.org/198.41.30.233] failed: Connection timed out (Connection timed out) -> [Help 2]
[ERROR]  
[ERROR]   The project org.eclipse.webtools.sourceediting:org.eclipse.webtools.sourceediting.xpath.tests:3.6.0-SNAPSHOT (/jobs/genie.webtools/WTP-R3_9_Integration/workspace/webtools.sourceediting.xpath.tests/pom.xml) has 1 error
[ERROR]     Unresolveable build extension: Plugin org.eclipse.tycho:tycho-maven-plugin:0.21.0 or one of its dependencies could not be resolved: Failed to collect dependencies at org.eclipse.tycho:tycho-maven-plugin:jar:0.21.0 -> org.eclipse.tycho:tycho-core:jar:0.21.0 -> org.apache.maven:maven-core:jar:3.0: Failed to read artifact descriptor for org.apache.maven:maven-core:jar:3.0: Could not transfer artifact org.apache.maven:maven-core:pom:3.0 from/to cbi-repo (https://repo.eclipse.org/content/repositories/cbi/): Connect to repo.eclipse.org:443 [repo.eclipse.org/198.41.30.233] failed: Connection timed out (Connection timed out) -> [Help 2]
[ERROR]  
[ERROR]   The project org.eclipse.webtools.sourceediting:org.eclipse.webtools.sourceediting.xsl:3.6.0-SNAPSHOT (/jobs/genie.webtools/WTP-R3_9_Integration/workspace/webtools.sourceediting.xsl/pom.xml) has 1 error
[ERROR]     Unresolveable build extension: Plugin org.eclipse.tycho:tycho-maven-plugin:0.21.0 or one of its dependencies could not be resolved: Failed to collect dependencies at org.eclipse.tycho:tycho-maven-plugin:jar:0.21.0 -> org.eclipse.tycho:tycho-core:jar:0.21.0 -> org.apache.maven:maven-core:jar:3.0: Failed to read artifact descriptor for org.apache.maven:maven-core:jar:3.0: Could not transfer artifact org.apache.maven:maven-core:pom:3.0 from/to cbi-repo (https://repo.eclipse.org/content/repositories/cbi/): Connect to repo.eclipse.org:443 [repo.eclipse.org/198.41.30.233] failed: Connection timed out (Connection timed out) -> [Help 2]
[ERROR]  
[ERROR]   The project org.eclipse.webtools.sourceediting:org.eclipse.webtools.sourceediting.xsl.tests:3.6.0-SNAPSHOT (/jobs/genie.webtools/WTP-R3_9_Integration/workspace/webtools.sourceediting.xsl.tests/pom.xml) has 1 error
[ERROR]     Unresolveable build extension: Plugin org.eclipse.tycho:tycho-maven-plugin:0.21.0 or one of its dependencies could not be resolved: Failed to collect dependencies at org.eclipse.tycho:tycho-maven-plugin:jar:0.21.0 -> org.eclipse.tycho:tycho-core:jar:0.21.0 -> org.apache.maven:maven-core:jar:3.0: Failed to read artifact descriptor for org.apache.maven:maven-core:jar:3.0: Could not transfer artifact org.apache.maven:maven-core:pom:3.0 from/to cbi-repo (https://repo.eclipse.org/content/repositories/cbi/): Connect to repo.eclipse.org:443 [repo.eclipse.org/198.41.30.233] failed: Connection timed out (Connection timed out) -> [Help 2]
[ERROR]  
[ERROR]   The project org.eclipse.webtools.webservices:org.eclipse.webtools.webservices:3.6.0-SNAPSHOT (/jobs/genie.webtools/WTP-R3_9_Integration/workspace/webtools.webservices/pom.xml) has 1 error
[ERROR]     Unresolveable build extension: Plugin org.eclipse.tycho:tycho-maven-plugin:0.21.0 or one of its dependencies could not be resolved: Failed to collect dependencies at org.eclipse.tycho:tycho-maven-plugin:jar:0.21.0 -> org.eclipse.tycho:tycho-core:jar:0.21.0 -> org.apache.maven:maven-core:jar:3.0: Failed to read artifact descriptor for org.apache.maven:maven-core:jar:3.0: Could not transfer artifact org.apache.maven:maven-core:pom:3.0 from/to cbi-repo (https://repo.eclipse.org/content/repositories/cbi/): Connect to repo.eclipse.org:443 [repo.eclipse.org/198.41.30.233] failed: Connection timed out (Connection timed out) -> [Help 2]
[ERROR]  
[ERROR]   The project org.eclipse.webtools.webservices:org.eclipse.webtools.webservices.axis2:3.6.0-SNAPSHOT (/jobs/genie.webtools/WTP-R3_9_Integration/workspace/webtools.webservices.axis2/pom.xml) has 1 error
[ERROR]     Unresolveable build extension: Plugin org.eclipse.tycho:tycho-maven-plugin:0.21.0 or one of its dependencies could not be resolved: Failed to collect dependencies at org.eclipse.tycho:tycho-maven-plugin:jar:0.21.0 -> org.eclipse.tycho:tycho-core:jar:0.21.0 -> org.apache.maven:maven-core:jar:3.0: Failed to read artifact descriptor for org.apache.maven:maven-core:jar:3.0: Could not transfer artifact org.apache.maven:maven-core:pom:3.0 from/to cbi-repo (https://repo.eclipse.org/content/repositories/cbi/): Connect to repo.eclipse.org:443 [repo.eclipse.org/198.41.30.233] failed: Connection timed out (Connection timed out) -> [Help 2]
[ERROR]  
[ERROR]   The project org.eclipse.webtools.webservices:org.eclipse.webtools.webservices.jaxws:3.6.0-SNAPSHOT (/jobs/genie.webtools/WTP-R3_9_Integration/workspace/webtools.webservices.jaxws/pom.xml) has 1 error
[ERROR]     Unresolveable build extension: Plugin org.eclipse.tycho:tycho-maven-plugin:0.21.0 or one of its dependencies could not be resolved: Failed to collect dependencies at org.eclipse.tycho:tycho-maven-plugin:jar:0.21.0 -> org.eclipse.tycho:tycho-core:jar:0.21.0 -> org.apache.maven:maven-core:jar:3.0: Failed to read artifact descriptor for org.apache.maven:maven-core:jar:3.0: Could not transfer artifact org.apache.maven:maven-core:pom:3.0 from/to cbi-repo (https://repo.eclipse.org/content/repositories/cbi/): Connect to repo.eclipse.org:443 [repo.eclipse.org/198.41.30.233] failed: Connection timed out (Connection timed out) -> [Help 2]
[ERROR]
[ERROR] To see the full stack trace of the errors, re-run Maven with the -e switch.
[ERROR] Re-run Maven using the -X switch to enable full debug logging.
[ERROR]
[ERROR] For more information about the errors and possible solutions, please read the following articles:
[ERROR] [Help 1] http://cwiki.apache.org/confluence/display/MAVEN/ProjectBuildingException
[ERROR] [Help 2] http://cwiki.apache.org/confluence/display/MAVEN/PluginResolutionException
[DEBUG] Waiting for process to finish
[DEBUG] Result: 1
Terminating xvnc.
Archiving artifacts

--
This message is automatically generated by Hudson.
For more information on Hudson, see: http://hudson-ci.org/
_______________________________________________
wtp-releng mailing list
[hidden email]
To change your delivery options, retrieve your password, or unsubscribe from this list, visit
https://dev.eclipse.org/mailman/listinfo/wtp-releng
Reply | Threaded
Open this post in threaded view
|  
Report Content as Inappropriate

[Hudson] Build failed in Hudson: WTP-R3_9_Integration #232

hudsonbuild
See <https://hudson.eclipse.org/webtools/job/WTP-R3_9_Integration/232/>

------------------------------------------
[...truncated 1129 lines...]
Downloading: https://repo.eclipse.org/content/repositories/tycho-snapshots/org/codehaus/plexus/plexus/2.0.3/plexus-2.0.3.pom
Downloading: https://repo.eclipse.org/content/repositories/maven_central/org/codehaus/plexus/plexus/2.0.3/plexus-2.0.3.pom
Downloaded: https://repo.eclipse.org/content/repositories/maven_central/org/codehaus/plexus/plexus/2.0.3/plexus-2.0.3.pom (16 KB at 629.1 KB/sec)
Downloading: https://oss.sonatype.org/content/repositories/public/org/apache/maven/maven-core/2.0.6/maven-core-2.0.6.pom
Downloading: https://repo.eclipse.org/content/repositories/cbi/org/apache/maven/maven-core/2.0.6/maven-core-2.0.6.pom
Downloading: https://repo.eclipse.org/content/repositories/tycho-snapshots/org/apache/maven/maven-core/2.0.6/maven-core-2.0.6.pom
Downloading: https://repo.eclipse.org/content/repositories/maven_central/org/apache/maven/maven-core/2.0.6/maven-core-2.0.6.pom
Downloaded: https://repo.eclipse.org/content/repositories/maven_central/org/apache/maven/maven-core/2.0.6/maven-core-2.0.6.pom (7 KB at 211.4 KB/sec)
Downloading: https://oss.sonatype.org/content/repositories/public/org/apache/maven/maven-settings/2.0.6/maven-settings-2.0.6.pom
Downloading: https://repo.eclipse.org/content/repositories/cbi/org/apache/maven/maven-settings/2.0.6/maven-settings-2.0.6.pom
Downloading: https://repo.eclipse.org/content/repositories/tycho-snapshots/org/apache/maven/maven-settings/2.0.6/maven-settings-2.0.6.pom
Downloading: https://repo.eclipse.org/content/repositories/maven_central/org/apache/maven/maven-settings/2.0.6/maven-settings-2.0.6.pom
Downloaded: https://repo.eclipse.org/content/repositories/maven_central/org/apache/maven/maven-settings/2.0.6/maven-settings-2.0.6.pom (2 KB at 67.4 KB/sec)
Downloading: https://oss.sonatype.org/content/repositories/public/org/apache/maven/maven-plugin-parameter-documenter/2.0.6/maven-plugin-parameter-documenter-2.0.6.pom
Downloading: https://repo.eclipse.org/content/repositories/cbi/org/apache/maven/maven-plugin-parameter-documenter/2.0.6/maven-plugin-parameter-documenter-2.0.6.pom
Downloading: https://repo.eclipse.org/content/repositories/tycho-snapshots/org/apache/maven/maven-plugin-parameter-documenter/2.0.6/maven-plugin-parameter-documenter-2.0.6.pom
Downloading: https://repo.eclipse.org/content/repositories/maven_central/org/apache/maven/maven-plugin-parameter-documenter/2.0.6/maven-plugin-parameter-documenter-2.0.6.pom
Downloaded: https://repo.eclipse.org/content/repositories/maven_central/org/apache/maven/maven-plugin-parameter-documenter/2.0.6/maven-plugin-parameter-documenter-2.0.6.pom (2 KB at 74.6 KB/sec)
Downloading: https://oss.sonatype.org/content/repositories/public/org/apache/maven/reporting/maven-reporting-api/2.0.6/maven-reporting-api-2.0.6.pom
Downloading: https://repo.eclipse.org/content/repositories/cbi/org/apache/maven/reporting/maven-reporting-api/2.0.6/maven-reporting-api-2.0.6.pom
Downloading: https://repo.eclipse.org/content/repositories/tycho-snapshots/org/apache/maven/reporting/maven-reporting-api/2.0.6/maven-reporting-api-2.0.6.pom
Downloading: https://repo.eclipse.org/content/repositories/maven_central/org/apache/maven/reporting/maven-reporting-api/2.0.6/maven-reporting-api-2.0.6.pom
Downloaded: https://repo.eclipse.org/content/repositories/maven_central/org/apache/maven/reporting/maven-reporting-api/2.0.6/maven-reporting-api-2.0.6.pom (2 KB at 68.4 KB/sec)
Downloading: https://oss.sonatype.org/content/repositories/public/org/apache/maven/reporting/maven-reporting/2.0.6/maven-reporting-2.0.6.pom
Downloading: https://repo.eclipse.org/content/repositories/cbi/org/apache/maven/reporting/maven-reporting/2.0.6/maven-reporting-2.0.6.pom
Downloading: https://repo.eclipse.org/content/repositories/tycho-snapshots/org/apache/maven/reporting/maven-reporting/2.0.6/maven-reporting-2.0.6.pom
Downloading: https://repo.eclipse.org/content/repositories/maven_central/org/apache/maven/reporting/maven-reporting/2.0.6/maven-reporting-2.0.6.pom
Downloaded: https://repo.eclipse.org/content/repositories/maven_central/org/apache/maven/reporting/maven-reporting/2.0.6/maven-reporting-2.0.6.pom (2 KB at 35.1 KB/sec)
Downloading: https://oss.sonatype.org/content/repositories/public/org/apache/maven/doxia/doxia-sink-api/1.0-alpha-7/doxia-sink-api-1.0-alpha-7.pom
Downloading: https://repo.eclipse.org/content/repositories/cbi/org/apache/maven/doxia/doxia-sink-api/1.0-alpha-7/doxia-sink-api-1.0-alpha-7.pom
Downloading: https://repo.eclipse.org/content/repositories/tycho-snapshots/org/apache/maven/doxia/doxia-sink-api/1.0-alpha-7/doxia-sink-api-1.0-alpha-7.pom
Downloading: https://repo.eclipse.org/content/repositories/maven_central/org/apache/maven/doxia/doxia-sink-api/1.0-alpha-7/doxia-sink-api-1.0-alpha-7.pom
Downloaded: https://repo.eclipse.org/content/repositories/maven_central/org/apache/maven/doxia/doxia-sink-api/1.0-alpha-7/doxia-sink-api-1.0-alpha-7.pom (424 B at 16.6 KB/sec)
Downloading: https://oss.sonatype.org/content/repositories/public/org/apache/maven/doxia/doxia/1.0-alpha-7/doxia-1.0-alpha-7.pom
Downloading: https://repo.eclipse.org/content/repositories/cbi/org/apache/maven/doxia/doxia/1.0-alpha-7/doxia-1.0-alpha-7.pom
Downloading: https://repo.eclipse.org/content/repositories/tycho-snapshots/org/apache/maven/doxia/doxia/1.0-alpha-7/doxia-1.0-alpha-7.pom
Downloading: https://repo.eclipse.org/content/repositories/maven_central/org/apache/maven/doxia/doxia/1.0-alpha-7/doxia-1.0-alpha-7.pom
Downloaded: https://repo.eclipse.org/content/repositories/maven_central/org/apache/maven/doxia/doxia/1.0-alpha-7/doxia-1.0-alpha-7.pom (4 KB at 136.5 KB/sec)
Downloading: https://oss.sonatype.org/content/repositories/public/org/apache/maven/maven-profile/2.0.6/maven-profile-2.0.6.pom
Downloading: https://repo.eclipse.org/content/repositories/cbi/org/apache/maven/maven-profile/2.0.6/maven-profile-2.0.6.pom
Downloading: https://repo.eclipse.org/content/repositories/tycho-snapshots/org/apache/maven/maven-profile/2.0.6/maven-profile-2.0.6.pom
Downloading: https://repo.eclipse.org/content/repositories/maven_central/org/apache/maven/maven-profile/2.0.6/maven-profile-2.0.6.pom
Downloaded: https://repo.eclipse.org/content/repositories/maven_central/org/apache/maven/maven-profile/2.0.6/maven-profile-2.0.6.pom (2 KB at 74.4 KB/sec)
Downloading: https://oss.sonatype.org/content/repositories/public/org/apache/maven/maven-repository-metadata/2.0.6/maven-repository-metadata-2.0.6.pom
Downloading: https://repo.eclipse.org/content/repositories/cbi/org/apache/maven/maven-repository-metadata/2.0.6/maven-repository-metadata-2.0.6.pom
Downloading: https://repo.eclipse.org/content/repositories/tycho-snapshots/org/apache/maven/maven-repository-metadata/2.0.6/maven-repository-metadata-2.0.6.pom
Downloading: https://repo.eclipse.org/content/repositories/maven_central/org/apache/maven/maven-repository-metadata/2.0.6/maven-repository-metadata-2.0.6.pom
Downloaded: https://repo.eclipse.org/content/repositories/maven_central/org/apache/maven/maven-repository-metadata/2.0.6/maven-repository-metadata-2.0.6.pom (2 KB at 66.9 KB/sec)
Downloading: https://oss.sonatype.org/content/repositories/public/org/apache/maven/maven-error-diagnostics/2.0.6/maven-error-diagnostics-2.0.6.pom
Downloading: https://repo.eclipse.org/content/repositories/cbi/org/apache/maven/maven-error-diagnostics/2.0.6/maven-error-diagnostics-2.0.6.pom
Downloading: https://repo.eclipse.org/content/repositories/tycho-snapshots/org/apache/maven/maven-error-diagnostics/2.0.6/maven-error-diagnostics-2.0.6.pom
Downloading: https://repo.eclipse.org/content/repositories/maven_central/org/apache/maven/maven-error-diagnostics/2.0.6/maven-error-diagnostics-2.0.6.pom
Downloaded: https://repo.eclipse.org/content/repositories/maven_central/org/apache/maven/maven-error-diagnostics/2.0.6/maven-error-diagnostics-2.0.6.pom (2 KB at 48.9 KB/sec)
Downloading: https://oss.sonatype.org/content/repositories/public/commons-cli/commons-cli/1.0/commons-cli-1.0.pom
Downloading: https://repo.eclipse.org/content/repositories/cbi/commons-cli/commons-cli/1.0/commons-cli-1.0.pom
Downloading: https://repo.eclipse.org/content/repositories/tycho-snapshots/commons-cli/commons-cli/1.0/commons-cli-1.0.pom
Downloading: https://repo.eclipse.org/content/repositories/maven_central/commons-cli/commons-cli/1.0/commons-cli-1.0.pom
Downloaded: https://repo.eclipse.org/content/repositories/maven_central/commons-cli/commons-cli/1.0/commons-cli-1.0.pom (3 KB at 85.7 KB/sec)
Downloading: https://oss.sonatype.org/content/repositories/public/org/apache/maven/maven-plugin-api/2.0.6/maven-plugin-api-2.0.6.pom
Downloading: https://repo.eclipse.org/content/repositories/cbi/org/apache/maven/maven-plugin-api/2.0.6/maven-plugin-api-2.0.6.pom
Downloading: https://repo.eclipse.org/content/repositories/tycho-snapshots/org/apache/maven/maven-plugin-api/2.0.6/maven-plugin-api-2.0.6.pom
Downloading: https://repo.eclipse.org/content/repositories/maven_central/org/apache/maven/maven-plugin-api/2.0.6/maven-plugin-api-2.0.6.pom
Downloaded: https://repo.eclipse.org/content/repositories/maven_central/org/apache/maven/maven-plugin-api/2.0.6/maven-plugin-api-2.0.6.pom (2 KB at 61.8 KB/sec)
Downloading: https://oss.sonatype.org/content/repositories/public/org/apache/maven/maven-plugin-descriptor/2.0.6/maven-plugin-descriptor-2.0.6.pom
Downloading: https://repo.eclipse.org/content/repositories/cbi/org/apache/maven/maven-plugin-descriptor/2.0.6/maven-plugin-descriptor-2.0.6.pom
Downloading: https://repo.eclipse.org/content/repositories/tycho-snapshots/org/apache/maven/maven-plugin-descriptor/2.0.6/maven-plugin-descriptor-2.0.6.pom
Downloading: https://repo.eclipse.org/content/repositories/maven_central/org/apache/maven/maven-plugin-descriptor/2.0.6/maven-plugin-descriptor-2.0.6.pom
Downloaded: https://repo.eclipse.org/content/repositories/maven_central/org/apache/maven/maven-plugin-descriptor/2.0.6/maven-plugin-descriptor-2.0.6.pom (2 KB at 75.8 KB/sec)
Downloading: https://oss.sonatype.org/content/repositories/public/org/codehaus/plexus/plexus-interactivity-api/1.0-alpha-4/plexus-interactivity-api-1.0-alpha-4.pom
Downloading: https://repo.eclipse.org/content/repositories/cbi/org/codehaus/plexus/plexus-interactivity-api/1.0-alpha-4/plexus-interactivity-api-1.0-alpha-4.pom
Downloading: https://repo.eclipse.org/content/repositories/tycho-snapshots/org/codehaus/plexus/plexus-interactivity-api/1.0-alpha-4/plexus-interactivity-api-1.0-alpha-4.pom
Downloading: https://repo.eclipse.org/content/repositories/maven_central/org/codehaus/plexus/plexus-interactivity-api/1.0-alpha-4/plexus-interactivity-api-1.0-alpha-4.pom
Downloaded: https://repo.eclipse.org/content/repositories/maven_central/org/codehaus/plexus/plexus-interactivity-api/1.0-alpha-4/plexus-interactivity-api-1.0-alpha-4.pom (7 KB at 277.0 KB/sec)
Downloading: https://oss.sonatype.org/content/repositories/public/org/apache/maven/maven-artifact-manager/2.0.6/maven-artifact-manager-2.0.6.pom
Downloading: https://repo.eclipse.org/content/repositories/cbi/org/apache/maven/maven-artifact-manager/2.0.6/maven-artifact-manager-2.0.6.pom
Downloading: https://repo.eclipse.org/content/repositories/tycho-snapshots/org/apache/maven/maven-artifact-manager/2.0.6/maven-artifact-manager-2.0.6.pom
Downloading: https://repo.eclipse.org/content/repositories/maven_central/org/apache/maven/maven-artifact-manager/2.0.6/maven-artifact-manager-2.0.6.pom
Downloaded: https://repo.eclipse.org/content/repositories/maven_central/org/apache/maven/maven-artifact-manager/2.0.6/maven-artifact-manager-2.0.6.pom (3 KB at 94.8 KB/sec)
Downloading: https://oss.sonatype.org/content/repositories/public/org/apache/maven/maven-monitor/2.0.6/maven-monitor-2.0.6.pom
Downloading: https://repo.eclipse.org/content/repositories/cbi/org/apache/maven/maven-monitor/2.0.6/maven-monitor-2.0.6.pom
Downloading: https://repo.eclipse.org/content/repositories/tycho-snapshots/org/apache/maven/maven-monitor/2.0.6/maven-monitor-2.0.6.pom
Downloading: https://repo.eclipse.org/content/repositories/maven_central/org/apache/maven/maven-monitor/2.0.6/maven-monitor-2.0.6.pom
Downloaded: https://repo.eclipse.org/content/repositories/maven_central/org/apache/maven/maven-monitor/2.0.6/maven-monitor-2.0.6.pom (2 KB at 49.0 KB/sec)
Downloading: https://oss.sonatype.org/content/repositories/public/classworlds/classworlds/1.1/classworlds-1.1.pom
Downloading: https://repo.eclipse.org/content/repositories/cbi/classworlds/classworlds/1.1/classworlds-1.1.pom
Downloading: https://repo.eclipse.org/content/repositories/tycho-snapshots/classworlds/classworlds/1.1/classworlds-1.1.pom
Downloading: https://repo.eclipse.org/content/repositories/maven_central/classworlds/classworlds/1.1/classworlds-1.1.pom
Downloaded: https://repo.eclipse.org/content/repositories/maven_central/classworlds/classworlds/1.1/classworlds-1.1.pom (4 KB at 115.9 KB/sec)
Downloading: https://oss.sonatype.org/content/repositories/public/org/codehaus/plexus/plexus-archiver/2.1/plexus-archiver-2.1.pom
Downloading: https://repo.eclipse.org/content/repositories/cbi/org/codehaus/plexus/plexus-archiver/2.1/plexus-archiver-2.1.pom
Downloading: https://repo.eclipse.org/content/repositories/tycho-snapshots/org/codehaus/plexus/plexus-archiver/2.1/plexus-archiver-2.1.pom
Downloading: https://repo.eclipse.org/content/repositories/maven_central/org/codehaus/plexus/plexus-archiver/2.1/plexus-archiver-2.1.pom
Downloaded: https://repo.eclipse.org/content/repositories/maven_central/org/codehaus/plexus/plexus-archiver/2.1/plexus-archiver-2.1.pom (3 KB at 101.6 KB/sec)
Downloading: https://oss.sonatype.org/content/repositories/public/org/codehaus/plexus/plexus-io/2.0.2/plexus-io-2.0.2.pom
Downloading: https://repo.eclipse.org/content/repositories/cbi/org/codehaus/plexus/plexus-io/2.0.2/plexus-io-2.0.2.pom
Downloading: https://repo.eclipse.org/content/repositories/tycho-snapshots/org/codehaus/plexus/plexus-io/2.0.2/plexus-io-2.0.2.pom
Downloading: https://repo.eclipse.org/content/repositories/maven_central/org/codehaus/plexus/plexus-io/2.0.2/plexus-io-2.0.2.pom
Downloaded: https://repo.eclipse.org/content/repositories/maven_central/org/codehaus/plexus/plexus-io/2.0.2/plexus-io-2.0.2.pom (2 KB at 52.9 KB/sec)
Downloading: https://oss.sonatype.org/content/repositories/public/org/apache/maven/maven-archiver/2.4.2/maven-archiver-2.4.2.jar
Downloading: https://oss.sonatype.org/content/repositories/public/org/codehaus/plexus/plexus-archiver/2.0.1/plexus-archiver-2.0.1.jar
Downloading: https://oss.sonatype.org/content/repositories/public/org/codehaus/plexus/plexus-io/2.0.1/plexus-io-2.0.1.jar
Downloading: https://oss.sonatype.org/content/repositories/public/org/codehaus/plexus/plexus-utils/3.0/plexus-utils-3.0.jar
Downloading: https://oss.sonatype.org/content/repositories/public/org/codehaus/plexus/plexus-interpolation/1.13/plexus-interpolation-1.13.jar
Downloading: https://repo.eclipse.org/content/repositories/cbi/org/apache/maven/maven-archiver/2.4.2/maven-archiver-2.4.2.jar
Downloading: https://repo.eclipse.org/content/repositories/cbi/org/codehaus/plexus/plexus-archiver/2.0.1/plexus-archiver-2.0.1.jar
Downloading: https://repo.eclipse.org/content/repositories/cbi/org/codehaus/plexus/plexus-io/2.0.1/plexus-io-2.0.1.jar
Downloading: https://repo.eclipse.org/content/repositories/cbi/org/codehaus/plexus/plexus-utils/3.0/plexus-utils-3.0.jar
Downloading: https://repo.eclipse.org/content/repositories/cbi/org/codehaus/plexus/plexus-interpolation/1.13/plexus-interpolation-1.13.jar
Downloading: https://repo.eclipse.org/content/repositories/tycho-snapshots/org/apache/maven/maven-archiver/2.4.2/maven-archiver-2.4.2.jar
Downloading: https://repo.eclipse.org/content/repositories/tycho-snapshots/org/codehaus/plexus/plexus-archiver/2.0.1/plexus-archiver-2.0.1.jar
Downloading: https://repo.eclipse.org/content/repositories/tycho-snapshots/org/codehaus/plexus/plexus-io/2.0.1/plexus-io-2.0.1.jar
Downloading: https://repo.eclipse.org/content/repositories/tycho-snapshots/org/codehaus/plexus/plexus-utils/3.0/plexus-utils-3.0.jar
Downloading: https://repo.eclipse.org/content/repositories/tycho-snapshots/org/codehaus/plexus/plexus-interpolation/1.13/plexus-interpolation-1.13.jar
Downloading: https://repo.eclipse.org/content/repositories/maven_central/org/apache/maven/maven-archiver/2.4.2/maven-archiver-2.4.2.jar
Downloading: https://repo.eclipse.org/content/repositories/maven_central/org/codehaus/plexus/plexus-archiver/2.0.1/plexus-archiver-2.0.1.jar
Downloading: https://repo.eclipse.org/content/repositories/maven_central/org/codehaus/plexus/plexus-io/2.0.1/plexus-io-2.0.1.jar
Downloading: https://repo.eclipse.org/content/repositories/maven_central/org/codehaus/plexus/plexus-utils/3.0/plexus-utils-3.0.jar
Downloading: https://repo.eclipse.org/content/repositories/maven_central/org/codehaus/plexus/plexus-interpolation/1.13/plexus-interpolation-1.13.jar
Downloaded: https://repo.eclipse.org/content/repositories/maven_central/org/codehaus/plexus/plexus-io/2.0.1/plexus-io-2.0.1.jar (57 KB at 1384.0 KB/sec)
Downloaded: https://repo.eclipse.org/content/repositories/maven_central/org/codehaus/plexus/plexus-archiver/2.0.1/plexus-archiver-2.0.1.jar (176 KB at 3904.3 KB/sec)
Downloaded: https://repo.eclipse.org/content/repositories/maven_central/org/codehaus/plexus/plexus-interpolation/1.13/plexus-interpolation-1.13.jar (60 KB at 795.0 KB/sec)
Downloaded: https://repo.eclipse.org/content/repositories/maven_central/org/apache/maven/maven-archiver/2.4.2/maven-archiver-2.4.2.jar (20 KB at 259.8 KB/sec)
Downloaded: https://repo.eclipse.org/content/repositories/maven_central/org/codehaus/plexus/plexus-utils/3.0/plexus-utils-3.0.jar (221 KB at 2904.9 KB/sec)
Downloading: https://oss.sonatype.org/content/repositories/public/org/eclipse/tycho/tycho-surefire-plugin/0.21.0/tycho-surefire-plugin-0.21.0.pom
Downloaded: https://oss.sonatype.org/content/repositories/public/org/eclipse/tycho/tycho-surefire-plugin/0.21.0/tycho-surefire-plugin-0.21.0.pom (4 KB at 4.3 KB/sec)
Downloading: https://oss.sonatype.org/content/repositories/public/org/eclipse/tycho/tycho-surefire/0.21.0/tycho-surefire-0.21.0.pom
Downloaded: https://oss.sonatype.org/content/repositories/public/org/eclipse/tycho/tycho-surefire/0.21.0/tycho-surefire-0.21.0.pom (3 KB at 19.5 KB/sec)
Downloading: https://oss.sonatype.org/content/repositories/public/org/eclipse/tycho/tycho-surefire-plugin/0.21.0/tycho-surefire-plugin-0.21.0.jar
Downloaded: https://oss.sonatype.org/content/repositories/public/org/eclipse/tycho/tycho-surefire-plugin/0.21.0/tycho-surefire-plugin-0.21.0.jar (48 KB at 233.3 KB/sec)
Downloading: https://oss.sonatype.org/content/repositories/public/org/eclipse/tycho/org.eclipse.tycho.surefire.osgibooter/0.21.0/org.eclipse.tycho.surefire.osgibooter-0.21.0.pom
Downloaded: https://oss.sonatype.org/content/repositories/public/org/eclipse/tycho/org.eclipse.tycho.surefire.osgibooter/0.21.0/org.eclipse.tycho.surefire.osgibooter-0.21.0.pom (2 KB at 12.5 KB/sec)
Downloading: https://oss.sonatype.org/content/repositories/public/org/eclipse/tycho/org.eclipse.tycho.surefire.junit/0.21.0/org.eclipse.tycho.surefire.junit-0.21.0.pom
Downloaded: https://oss.sonatype.org/content/repositories/public/org/eclipse/tycho/org.eclipse.tycho.surefire.junit/0.21.0/org.eclipse.tycho.surefire.junit-0.21.0.pom (2 KB at 9.0 KB/sec)
Downloading: https://oss.sonatype.org/content/repositories/public/org/eclipse/tycho/org.eclipse.tycho.surefire.junit4/0.21.0/org.eclipse.tycho.surefire.junit4-0.21.0.pom
Downloaded: https://oss.sonatype.org/content/repositories/public/org/eclipse/tycho/org.eclipse.tycho.surefire.junit4/0.21.0/org.eclipse.tycho.surefire.junit4-0.21.0.pom (2 KB at 11.1 KB/sec)
Downloading: https://oss.sonatype.org/content/repositories/public/org/eclipse/tycho/org.eclipse.tycho.surefire.junit47/0.21.0/org.eclipse.tycho.surefire.junit47-0.21.0.pom
Downloaded: https://oss.sonatype.org/content/repositories/public/org/eclipse/tycho/org.eclipse.tycho.surefire.junit47/0.21.0/org.eclipse.tycho.surefire.junit47-0.21.0.pom (2 KB at 10.5 KB/sec)
Downloading: https://oss.sonatype.org/content/repositories/public/org/apache/maven/surefire/surefire-api/2.10/surefire-api-2.10.pom
Downloading: https://repo.eclipse.org/content/repositories/cbi/org/apache/maven/surefire/surefire-api/2.10/surefire-api-2.10.pom
Downloading: https://repo.eclipse.org/content/repositories/tycho-snapshots/org/apache/maven/surefire/surefire-api/2.10/surefire-api-2.10.pom
Downloading: https://repo.eclipse.org/content/repositories/maven_central/org/apache/maven/surefire/surefire-api/2.10/surefire-api-2.10.pom
Downloaded: https://repo.eclipse.org/content/repositories/maven_central/org/apache/maven/surefire/surefire-api/2.10/surefire-api-2.10.pom (3 KB at 82.6 KB/sec)
Downloading: https://oss.sonatype.org/content/repositories/public/org/apache/maven/surefire/surefire/2.10/surefire-2.10.pom
Downloading: https://repo.eclipse.org/content/repositories/cbi/org/apache/maven/surefire/surefire/2.10/surefire-2.10.pom
Downloading: https://repo.eclipse.org/content/repositories/tycho-snapshots/org/apache/maven/surefire/surefire/2.10/surefire-2.10.pom
Downloading: https://repo.eclipse.org/content/repositories/maven_central/org/apache/maven/surefire/surefire/2.10/surefire-2.10.pom
Downloaded: https://repo.eclipse.org/content/repositories/maven_central/org/apache/maven/surefire/surefire/2.10/surefire-2.10.pom (12 KB at 465.7 KB/sec)
Downloading: https://oss.sonatype.org/content/repositories/public/org/apache/maven/maven-parent/20/maven-parent-20.pom
Downloading: https://repo.eclipse.org/content/repositories/cbi/org/apache/maven/maven-parent/20/maven-parent-20.pom
Downloading: https://repo.eclipse.org/content/repositories/tycho-snapshots/org/apache/maven/maven-parent/20/maven-parent-20.pom
Downloading: https://repo.eclipse.org/content/repositories/maven_central/org/apache/maven/maven-parent/20/maven-parent-20.pom
Downloaded: https://repo.eclipse.org/content/repositories/maven_central/org/apache/maven/maven-parent/20/maven-parent-20.pom (25 KB at 924.4 KB/sec)
Downloading: https://oss.sonatype.org/content/repositories/public/org/eclipse/tycho/org.eclipse.tycho.surefire.osgibooter/0.21.0/org.eclipse.tycho.surefire.osgibooter-0.21.0.jar
Downloading: https://oss.sonatype.org/content/repositories/public/org/eclipse/tycho/org.eclipse.tycho.surefire.junit/0.21.0/org.eclipse.tycho.surefire.junit-0.21.0.jar
Downloading: https://oss.sonatype.org/content/repositories/public/org/eclipse/tycho/org.eclipse.tycho.surefire.junit4/0.21.0/org.eclipse.tycho.surefire.junit4-0.21.0.jar
Downloading: https://oss.sonatype.org/content/repositories/public/org/eclipse/tycho/org.eclipse.tycho.surefire.junit47/0.21.0/org.eclipse.tycho.surefire.junit47-0.21.0.jar
Downloading: https://oss.sonatype.org/content/repositories/public/org/apache/maven/surefire/surefire-api/2.10/surefire-api-2.10.jar
Downloaded: https://oss.sonatype.org/content/repositories/public/org/eclipse/tycho/org.eclipse.tycho.surefire.junit/0.21.0/org.eclipse.tycho.surefire.junit-0.21.0.jar (25 KB at 100.2 KB/sec)
Downloaded: https://oss.sonatype.org/content/repositories/public/org/eclipse/tycho/org.eclipse.tycho.surefire.junit4/0.21.0/org.eclipse.tycho.surefire.junit4-0.21.0.jar (29 KB at 89.8 KB/sec)
Downloaded: https://oss.sonatype.org/content/repositories/public/org/eclipse/tycho/org.eclipse.tycho.surefire.junit47/0.21.0/org.eclipse.tycho.surefire.junit47-0.21.0.jar (49 KB at 136.6 KB/sec)
Downloaded: https://oss.sonatype.org/content/repositories/public/org/eclipse/tycho/org.eclipse.tycho.surefire.osgibooter/0.21.0/org.eclipse.tycho.surefire.osgibooter-0.21.0.jar (181 KB at 364.1 KB/sec)
Downloading: https://repo.eclipse.org/content/repositories/cbi/org/apache/maven/surefire/surefire-api/2.10/surefire-api-2.10.jar
Downloading: https://repo.eclipse.org/content/repositories/tycho-snapshots/org/apache/maven/surefire/surefire-api/2.10/surefire-api-2.10.jar
Downloading: https://repo.eclipse.org/content/repositories/maven_central/org/apache/maven/surefire/surefire-api/2.10/surefire-api-2.10.jar
Downloaded: https://repo.eclipse.org/content/repositories/maven_central/org/apache/maven/surefire/surefire-api/2.10/surefire-api-2.10.jar (158 KB at 3029.7 KB/sec)
Downloading: https://oss.sonatype.org/content/repositories/public/org/apache/maven/plugins/maven-dependency-plugin/2.8/maven-dependency-plugin-2.8.pom
Downloading: https://repo.eclipse.org/content/repositories/cbi/org/apache/maven/plugins/maven-dependency-plugin/2.8/maven-dependency-plugin-2.8.pom
Downloading: https://repo.eclipse.org/content/repositories/tycho-snapshots/org/apache/maven/plugins/maven-dependency-plugin/2.8/maven-dependency-plugin-2.8.pom
Downloading: https://repo.eclipse.org/content/repositories/maven_central/org/apache/maven/plugins/maven-dependency-plugin/2.8/maven-dependency-plugin-2.8.pom
Downloaded: https://repo.eclipse.org/content/repositories/maven_central/org/apache/maven/plugins/maven-dependency-plugin/2.8/maven-dependency-plugin-2.8.pom (12 KB at 339.0 KB/sec)
Downloading: https://oss.sonatype.org/content/repositories/public/org/apache/maven/plugins/maven-dependency-plugin/2.8/maven-dependency-plugin-2.8.jar
Downloading: https://repo.eclipse.org/content/repositories/cbi/org/apache/maven/plugins/maven-dependency-plugin/2.8/maven-dependency-plugin-2.8.jar
Downloading: https://repo.eclipse.org/content/repositories/tycho-snapshots/org/apache/maven/plugins/maven-dependency-plugin/2.8/maven-dependency-plugin-2.8.jar
Downloading: https://repo.eclipse.org/content/repositories/maven_central/org/apache/maven/plugins/maven-dependency-plugin/2.8/maven-dependency-plugin-2.8.jar
Downloaded: https://repo.eclipse.org/content/repositories/maven_central/org/apache/maven/plugins/maven-dependency-plugin/2.8/maven-dependency-plugin-2.8.jar (150 KB at 3561.8 KB/sec)
Downloading: https://oss.sonatype.org/content/repositories/public/org/eclipse/tycho/extras/tycho-eclipserun-plugin/0.21.0/tycho-eclipserun-plugin-0.21.0.pom
Downloaded: https://oss.sonatype.org/content/repositories/public/org/eclipse/tycho/extras/tycho-eclipserun-plugin/0.21.0/tycho-eclipserun-plugin-0.21.0.pom (2 KB at 11.4 KB/sec)
Downloading: https://oss.sonatype.org/content/repositories/public/org/eclipse/tycho/extras/tycho-eclipserun-plugin/0.21.0/tycho-eclipserun-plugin-0.21.0.jar
Downloaded: https://oss.sonatype.org/content/repositories/public/org/eclipse/tycho/extras/tycho-eclipserun-plugin/0.21.0/tycho-eclipserun-plugin-0.21.0.jar (12 KB at 67.1 KB/sec)
Downloading: https://oss.sonatype.org/content/repositories/public/org/apache/maven/plugins/maven-javadoc-plugin/2.7/maven-javadoc-plugin-2.7.pom
Downloading: https://repo.eclipse.org/content/repositories/cbi/org/apache/maven/plugins/maven-javadoc-plugin/2.7/maven-javadoc-plugin-2.7.pom
Downloading: https://repo.eclipse.org/content/repositories/tycho-snapshots/org/apache/maven/plugins/maven-javadoc-plugin/2.7/maven-javadoc-plugin-2.7.pom
Downloading: https://repo.eclipse.org/content/repositories/maven_central/org/apache/maven/plugins/maven-javadoc-plugin/2.7/maven-javadoc-plugin-2.7.pom
Downloaded: https://repo.eclipse.org/content/repositories/maven_central/org/apache/maven/plugins/maven-javadoc-plugin/2.7/maven-javadoc-plugin-2.7.pom (16 KB at 441.7 KB/sec)
Downloading: https://oss.sonatype.org/content/repositories/public/org/apache/maven/plugins/maven-plugins/17/maven-plugins-17.pom
Downloading: https://repo.eclipse.org/content/repositories/cbi/org/apache/maven/plugins/maven-plugins/17/maven-plugins-17.pom
Downloading: https://repo.eclipse.org/content/repositories/tycho-snapshots/org/apache/maven/plugins/maven-plugins/17/maven-plugins-17.pom
Downloading: https://repo.eclipse.org/content/repositories/maven_central/org/apache/maven/plugins/maven-plugins/17/maven-plugins-17.pom
Downloaded: https://repo.eclipse.org/content/repositories/maven_central/org/apache/maven/plugins/maven-plugins/17/maven-plugins-17.pom (13 KB at 324.2 KB/sec)
Downloading: https://oss.sonatype.org/content/repositories/public/org/apache/maven/plugins/maven-javadoc-plugin/2.7/maven-javadoc-plugin-2.7.jar
Downloading: https://repo.eclipse.org/content/repositories/cbi/org/apache/maven/plugins/maven-javadoc-plugin/2.7/maven-javadoc-plugin-2.7.jar
Downloading: https://repo.eclipse.org/content/repositories/tycho-snapshots/org/apache/maven/plugins/maven-javadoc-plugin/2.7/maven-javadoc-plugin-2.7.jar
Downloading: https://repo.eclipse.org/content/repositories/maven_central/org/apache/maven/plugins/maven-javadoc-plugin/2.7/maven-javadoc-plugin-2.7.jar
Downloaded: https://repo.eclipse.org/content/repositories/maven_central/org/apache/maven/plugins/maven-javadoc-plugin/2.7/maven-javadoc-plugin-2.7.jar (268 KB at 4782.1 KB/sec)
[INFO] Computing target platform for MavenProject: org.eclipse.webtools.releng:org.eclipse.wtp.releng.versionchecker:1.0.1-SNAPSHOT @ /jobs/genie.webtools/WTP-R3_9_Integration/workspace/webtools.releng/org.eclipse.wtp.releng.versionchecker/pom.xml
[INFO] Fetching p2.index from http://download.eclipse.org/cbi/updates/license/ (0B at 0B/s)
[INFO] Adding repository http://download.eclipse.org/cbi/updates/license
[INFO] Fetching compositeContent.jar from http://download.eclipse.org/cbi/updates/license/ (0B of 414B at 0B/s)
[INFO] Fetching content.jar from http://download.eclipse.org/cbi/updates/license/1.0.0.v20131003-1638/ (0B of 3.87kB at 0B/s)
[INFO] Fetching content.jar from http://download.eclipse.org/cbi/updates/license/1.0.1.v20140414-1359/ (0B of 3.83kB at 0B/s)
[INFO] Adding repository http://download.eclipse.org/eclipse/updates/4.7-I-builds/I20170305-2000
[INFO] o.h.m.e.h.MavenExecutionResultHandler - Build failed with exception(s)
[INFO] o.h.m.e.h.MavenExecutionResultHandler - [1] org.apache.maven.InternalErrorException: Internal error: java.lang.RuntimeException: Failed to load p2 repository with ID 'platform' from location http://download.eclipse.org/eclipse/updates/4.7-I-builds/I20170305-2000/
[DEBUG] Closing connection to remote
[ERROR] Internal error: java.lang.RuntimeException: Failed to load p2 repository with ID 'platform' from location http://download.eclipse.org/eclipse/updates/4.7-I-builds/I20170305-2000/: No repository found at http://download.eclipse.org/eclipse/updates/4.7-I-builds/I20170305-2000. -> [Help 1]
org.apache.maven.InternalErrorException: Internal error: java.lang.RuntimeException: Failed to load p2 repository with ID 'platform' from location http://download.eclipse.org/eclipse/updates/4.7-I-builds/I20170305-2000/
        at org.apache.maven.DefaultMaven.execute(DefaultMaven.java:167)
        at org.apache.maven.cli.MavenCli.execute(MavenCli.java:584)
        at org.apache.maven.cli.MavenCli.doMain(MavenCli.java:216)
        at org.apache.maven.cli.MavenCli.main(MavenCli.java:160)
        at sun.reflect.NativeMethodAccessorImpl.invoke0(Native Method)
        at sun.reflect.NativeMethodAccessorImpl.invoke(NativeMethodAccessorImpl.java:62)
        at sun.reflect.DelegatingMethodAccessorImpl.invoke(DelegatingMethodAccessorImpl.java:43)
        at java.lang.reflect.Method.invoke(Method.java:498)
        at org.codehaus.plexus.classworlds.launcher.Launcher.launchEnhanced(Launcher.java:289)
        at org.codehaus.plexus.classworlds.launcher.Launcher.launch(Launcher.java:229)
        at org.codehaus.plexus.classworlds.launcher.Launcher.mainWithExitCode(Launcher.java:415)
        at org.codehaus.plexus.classworlds.launcher.Launcher.main(Launcher.java:356)
Caused by: java.lang.RuntimeException: Failed to load p2 repository with ID 'platform' from location http://download.eclipse.org/eclipse/updates/4.7-I-builds/I20170305-2000/
        at org.eclipse.tycho.p2.target.TargetPlatformFactoryImpl.loadMetadataRepository(TargetPlatformFactoryImpl.java:301)
        at org.eclipse.tycho.p2.target.TargetPlatformFactoryImpl.gatherExternalInstallableUnits(TargetPlatformFactoryImpl.java:269)
        at org.eclipse.tycho.p2.target.TargetPlatformFactoryImpl.createTargetPlatform(TargetPlatformFactoryImpl.java:174)
        at org.eclipse.tycho.p2.target.TargetPlatformFactoryImpl.createTargetPlatform(TargetPlatformFactoryImpl.java:126)
        at org.eclipse.tycho.p2.target.TargetPlatformFactoryImpl.createTargetPlatform(TargetPlatformFactoryImpl.java:1)
        at org.eclipse.tycho.p2.manager.ReactorRepositoryManagerImpl.computePreliminaryTargetPlatform(ReactorRepositoryManagerImpl.java:82)
        at org.eclipse.tycho.p2.resolver.P2DependencyResolver.computePreliminaryTargetPlatform(P2DependencyResolver.java:215)
        at org.eclipse.tycho.core.resolver.DefaultTychoResolver.resolveProject(DefaultTychoResolver.java:99)
        at org.eclipse.tycho.core.maven.TychoMavenLifecycleParticipant.afterProjectsRead(TychoMavenLifecycleParticipant.java:75)
        at org.apache.maven.DefaultMaven.doExecute(DefaultMaven.java:318)
        at org.apache.maven.DefaultMaven.execute(DefaultMaven.java:155)
        ... 11 more
Caused by: org.eclipse.equinox.p2.core.ProvisionException: No repository found at http://download.eclipse.org/eclipse/updates/4.7-I-builds/I20170305-2000.
        at org.eclipse.equinox.internal.p2.repository.helpers.AbstractRepositoryManager.fail(AbstractRepositoryManager.java:395)
        at org.eclipse.equinox.internal.p2.repository.helpers.AbstractRepositoryManager.loadRepository(AbstractRepositoryManager.java:692)
        at org.eclipse.equinox.internal.p2.metadata.repository.MetadataRepositoryManager.loadRepository(MetadataRepositoryManager.java:96)
        at org.eclipse.tycho.p2.remote.RemoteMetadataRepositoryManager.loadRepository(RemoteMetadataRepositoryManager.java:59)
        at org.eclipse.tycho.p2.remote.RemoteMetadataRepositoryManager.loadRepository(RemoteMetadataRepositoryManager.java:52)
        at org.eclipse.tycho.p2.target.TargetPlatformFactoryImpl.loadMetadataRepository(TargetPlatformFactoryImpl.java:297)
        ... 21 more
[ERROR]
[ERROR] To see the full stack trace of the errors, re-run Maven with the -e switch.
[ERROR] Re-run Maven using the -X switch to enable full debug logging.
[ERROR]
[ERROR] For more information about the errors and possible solutions, please read the following articles:
[ERROR] [Help 1] http://cwiki.apache.org/confluence/display/MAVEN/InternalErrorException
[DEBUG] Waiting for process to finish
[DEBUG] Result: 1
Terminating xvnc.
Archiving artifacts

--
This message is automatically generated by Hudson.
For more information on Hudson, see: http://hudson-ci.org/
_______________________________________________
wtp-releng mailing list
[hidden email]
To change your delivery options, retrieve your password, or unsubscribe from this list, visit
https://dev.eclipse.org/mailman/listinfo/wtp-releng
Reply | Threaded
Open this post in threaded view
|  
Report Content as Inappropriate

[Hudson] Hudson build is back to normal : WTP-R3_9_Integration #233

hudsonbuild
See <https://hudson.eclipse.org/webtools/job/WTP-R3_9_Integration/233/changes>


--
This message is automatically generated by Hudson.
For more information on Hudson, see: http://hudson-ci.org/
_______________________________________________
wtp-releng mailing list
[hidden email]
To change your delivery options, retrieve your password, or unsubscribe from this list, visit
https://dev.eclipse.org/mailman/listinfo/wtp-releng
Loading...