Quantcast

[Hudson] Build failed in Hudson: WTP-R3_9_Integration #238

classic Classic list List threaded Threaded
2 messages Options
Reply | Threaded
Open this post in threaded view
|  
Report Content as Inappropriate

[Hudson] Build failed in Hudson: WTP-R3_9_Integration #238

hudsonbuild
See <https://hudson.eclipse.org/webtools/job/WTP-R3_9_Integration/238/>

------------------------------------------
[...truncated 1375 lines...]
Downloading: https://repo.eclipse.org/content/repositories/tycho-snapshots/org/apache/maven/maven-repository-metadata/2.0.6/maven-repository-metadata-2.0.6.pom
Downloading: https://repo.eclipse.org/content/repositories/maven_central/org/apache/maven/maven-repository-metadata/2.0.6/maven-repository-metadata-2.0.6.pom
Downloaded: https://repo.eclipse.org/content/repositories/maven_central/org/apache/maven/maven-repository-metadata/2.0.6/maven-repository-metadata-2.0.6.pom (2 KB at 58.3 KB/sec)
Downloading: https://oss.sonatype.org/content/repositories/public/org/apache/maven/maven-error-diagnostics/2.0.6/maven-error-diagnostics-2.0.6.pom
Downloading: https://repo.eclipse.org/content/repositories/cbi/org/apache/maven/maven-error-diagnostics/2.0.6/maven-error-diagnostics-2.0.6.pom
Downloading: https://repo.eclipse.org/content/repositories/tycho-snapshots/org/apache/maven/maven-error-diagnostics/2.0.6/maven-error-diagnostics-2.0.6.pom
Downloading: https://repo.eclipse.org/content/repositories/maven_central/org/apache/maven/maven-error-diagnostics/2.0.6/maven-error-diagnostics-2.0.6.pom
Downloaded: https://repo.eclipse.org/content/repositories/maven_central/org/apache/maven/maven-error-diagnostics/2.0.6/maven-error-diagnostics-2.0.6.pom (2 KB at 66.6 KB/sec)
Downloading: https://oss.sonatype.org/content/repositories/public/commons-cli/commons-cli/1.0/commons-cli-1.0.pom
Downloading: https://repo.eclipse.org/content/repositories/cbi/commons-cli/commons-cli/1.0/commons-cli-1.0.pom
Downloading: https://repo.eclipse.org/content/repositories/tycho-snapshots/commons-cli/commons-cli/1.0/commons-cli-1.0.pom
Downloading: https://repo.eclipse.org/content/repositories/maven_central/commons-cli/commons-cli/1.0/commons-cli-1.0.pom
Downloaded: https://repo.eclipse.org/content/repositories/maven_central/commons-cli/commons-cli/1.0/commons-cli-1.0.pom (3 KB at 82.2 KB/sec)
Downloading: https://oss.sonatype.org/content/repositories/public/org/apache/maven/maven-plugin-api/2.0.6/maven-plugin-api-2.0.6.pom
Downloading: https://repo.eclipse.org/content/repositories/cbi/org/apache/maven/maven-plugin-api/2.0.6/maven-plugin-api-2.0.6.pom
Downloading: https://repo.eclipse.org/content/repositories/tycho-snapshots/org/apache/maven/maven-plugin-api/2.0.6/maven-plugin-api-2.0.6.pom
Downloading: https://repo.eclipse.org/content/repositories/maven_central/org/apache/maven/maven-plugin-api/2.0.6/maven-plugin-api-2.0.6.pom
Downloaded: https://repo.eclipse.org/content/repositories/maven_central/org/apache/maven/maven-plugin-api/2.0.6/maven-plugin-api-2.0.6.pom (2 KB at 56.8 KB/sec)
Downloading: https://oss.sonatype.org/content/repositories/public/org/apache/maven/maven-plugin-descriptor/2.0.6/maven-plugin-descriptor-2.0.6.pom
Downloading: https://repo.eclipse.org/content/repositories/cbi/org/apache/maven/maven-plugin-descriptor/2.0.6/maven-plugin-descriptor-2.0.6.pom
Downloading: https://repo.eclipse.org/content/repositories/tycho-snapshots/org/apache/maven/maven-plugin-descriptor/2.0.6/maven-plugin-descriptor-2.0.6.pom
Downloading: https://repo.eclipse.org/content/repositories/maven_central/org/apache/maven/maven-plugin-descriptor/2.0.6/maven-plugin-descriptor-2.0.6.pom
Downloaded: https://repo.eclipse.org/content/repositories/maven_central/org/apache/maven/maven-plugin-descriptor/2.0.6/maven-plugin-descriptor-2.0.6.pom (2 KB at 82.1 KB/sec)
Downloading: https://oss.sonatype.org/content/repositories/public/org/codehaus/plexus/plexus-interactivity-api/1.0-alpha-4/plexus-interactivity-api-1.0-alpha-4.pom
Downloading: https://repo.eclipse.org/content/repositories/cbi/org/codehaus/plexus/plexus-interactivity-api/1.0-alpha-4/plexus-interactivity-api-1.0-alpha-4.pom
Downloading: https://repo.eclipse.org/content/repositories/tycho-snapshots/org/codehaus/plexus/plexus-interactivity-api/1.0-alpha-4/plexus-interactivity-api-1.0-alpha-4.pom
Downloading: https://repo.eclipse.org/content/repositories/maven_central/org/codehaus/plexus/plexus-interactivity-api/1.0-alpha-4/plexus-interactivity-api-1.0-alpha-4.pom
Downloaded: https://repo.eclipse.org/content/repositories/maven_central/org/codehaus/plexus/plexus-interactivity-api/1.0-alpha-4/plexus-interactivity-api-1.0-alpha-4.pom (7 KB at 266.3 KB/sec)
Downloading: https://oss.sonatype.org/content/repositories/public/org/apache/maven/maven-artifact-manager/2.0.6/maven-artifact-manager-2.0.6.pom
Downloading: https://repo.eclipse.org/content/repositories/cbi/org/apache/maven/maven-artifact-manager/2.0.6/maven-artifact-manager-2.0.6.pom
Downloading: https://repo.eclipse.org/content/repositories/tycho-snapshots/org/apache/maven/maven-artifact-manager/2.0.6/maven-artifact-manager-2.0.6.pom
Downloading: https://repo.eclipse.org/content/repositories/maven_central/org/apache/maven/maven-artifact-manager/2.0.6/maven-artifact-manager-2.0.6.pom
Downloaded: https://repo.eclipse.org/content/repositories/maven_central/org/apache/maven/maven-artifact-manager/2.0.6/maven-artifact-manager-2.0.6.pom (3 KB at 102.4 KB/sec)
Downloading: https://oss.sonatype.org/content/repositories/public/org/apache/maven/maven-monitor/2.0.6/maven-monitor-2.0.6.pom
Downloading: https://repo.eclipse.org/content/repositories/cbi/org/apache/maven/maven-monitor/2.0.6/maven-monitor-2.0.6.pom
Downloading: https://repo.eclipse.org/content/repositories/tycho-snapshots/org/apache/maven/maven-monitor/2.0.6/maven-monitor-2.0.6.pom
Downloading: https://repo.eclipse.org/content/repositories/maven_central/org/apache/maven/maven-monitor/2.0.6/maven-monitor-2.0.6.pom
Downloaded: https://repo.eclipse.org/content/repositories/maven_central/org/apache/maven/maven-monitor/2.0.6/maven-monitor-2.0.6.pom (2 KB at 53.2 KB/sec)
Downloading: https://oss.sonatype.org/content/repositories/public/classworlds/classworlds/1.1/classworlds-1.1.pom
Downloading: https://repo.eclipse.org/content/repositories/cbi/classworlds/classworlds/1.1/classworlds-1.1.pom
Downloading: https://repo.eclipse.org/content/repositories/tycho-snapshots/classworlds/classworlds/1.1/classworlds-1.1.pom
Downloading: https://repo.eclipse.org/content/repositories/maven_central/classworlds/classworlds/1.1/classworlds-1.1.pom
Downloaded: https://repo.eclipse.org/content/repositories/maven_central/classworlds/classworlds/1.1/classworlds-1.1.pom (4 KB at 147.5 KB/sec)
Downloading: https://oss.sonatype.org/content/repositories/public/org/codehaus/plexus/plexus-archiver/2.1/plexus-archiver-2.1.pom
Downloading: https://repo.eclipse.org/content/repositories/cbi/org/codehaus/plexus/plexus-archiver/2.1/plexus-archiver-2.1.pom
Downloading: https://repo.eclipse.org/content/repositories/tycho-snapshots/org/codehaus/plexus/plexus-archiver/2.1/plexus-archiver-2.1.pom
Downloading: https://repo.eclipse.org/content/repositories/maven_central/org/codehaus/plexus/plexus-archiver/2.1/plexus-archiver-2.1.pom
Downloaded: https://repo.eclipse.org/content/repositories/maven_central/org/codehaus/plexus/plexus-archiver/2.1/plexus-archiver-2.1.pom (3 KB at 130.6 KB/sec)
Downloading: https://oss.sonatype.org/content/repositories/public/org/codehaus/plexus/plexus-io/2.0.2/plexus-io-2.0.2.pom
Downloading: https://repo.eclipse.org/content/repositories/cbi/org/codehaus/plexus/plexus-io/2.0.2/plexus-io-2.0.2.pom
Downloading: https://repo.eclipse.org/content/repositories/tycho-snapshots/org/codehaus/plexus/plexus-io/2.0.2/plexus-io-2.0.2.pom
Downloading: https://repo.eclipse.org/content/repositories/maven_central/org/codehaus/plexus/plexus-io/2.0.2/plexus-io-2.0.2.pom
Downloaded: https://repo.eclipse.org/content/repositories/maven_central/org/codehaus/plexus/plexus-io/2.0.2/plexus-io-2.0.2.pom (2 KB at 5.7 KB/sec)
Downloading: https://oss.sonatype.org/content/repositories/public/org/apache/maven/maven-archiver/2.4.2/maven-archiver-2.4.2.jar
Downloading: https://oss.sonatype.org/content/repositories/public/org/codehaus/plexus/plexus-archiver/2.0.1/plexus-archiver-2.0.1.jar
Downloading: https://oss.sonatype.org/content/repositories/public/org/codehaus/plexus/plexus-io/2.0.1/plexus-io-2.0.1.jar
Downloading: https://oss.sonatype.org/content/repositories/public/org/codehaus/plexus/plexus-utils/3.0/plexus-utils-3.0.jar
Downloading: https://oss.sonatype.org/content/repositories/public/org/codehaus/plexus/plexus-interpolation/1.13/plexus-interpolation-1.13.jar
Downloading: https://repo.eclipse.org/content/repositories/cbi/org/apache/maven/maven-archiver/2.4.2/maven-archiver-2.4.2.jar
Downloading: https://repo.eclipse.org/content/repositories/cbi/org/codehaus/plexus/plexus-archiver/2.0.1/plexus-archiver-2.0.1.jar
Downloading: https://repo.eclipse.org/content/repositories/cbi/org/codehaus/plexus/plexus-io/2.0.1/plexus-io-2.0.1.jar
Downloading: https://repo.eclipse.org/content/repositories/cbi/org/codehaus/plexus/plexus-utils/3.0/plexus-utils-3.0.jar
Downloading: https://repo.eclipse.org/content/repositories/cbi/org/codehaus/plexus/plexus-interpolation/1.13/plexus-interpolation-1.13.jar
Downloading: https://repo.eclipse.org/content/repositories/tycho-snapshots/org/apache/maven/maven-archiver/2.4.2/maven-archiver-2.4.2.jar
Downloading: https://repo.eclipse.org/content/repositories/tycho-snapshots/org/codehaus/plexus/plexus-archiver/2.0.1/plexus-archiver-2.0.1.jar
Downloading: https://repo.eclipse.org/content/repositories/tycho-snapshots/org/codehaus/plexus/plexus-utils/3.0/plexus-utils-3.0.jar
Downloading: https://repo.eclipse.org/content/repositories/tycho-snapshots/org/codehaus/plexus/plexus-io/2.0.1/plexus-io-2.0.1.jar
Downloading: https://repo.eclipse.org/content/repositories/tycho-snapshots/org/codehaus/plexus/plexus-interpolation/1.13/plexus-interpolation-1.13.jar
Downloading: https://repo.eclipse.org/content/repositories/maven_central/org/apache/maven/maven-archiver/2.4.2/maven-archiver-2.4.2.jar
Downloading: https://repo.eclipse.org/content/repositories/maven_central/org/codehaus/plexus/plexus-archiver/2.0.1/plexus-archiver-2.0.1.jar
Downloading: https://repo.eclipse.org/content/repositories/maven_central/org/codehaus/plexus/plexus-io/2.0.1/plexus-io-2.0.1.jar
Downloading: https://repo.eclipse.org/content/repositories/maven_central/org/codehaus/plexus/plexus-utils/3.0/plexus-utils-3.0.jar
Downloading: https://repo.eclipse.org/content/repositories/maven_central/org/codehaus/plexus/plexus-interpolation/1.13/plexus-interpolation-1.13.jar
Downloaded: https://repo.eclipse.org/content/repositories/maven_central/org/codehaus/plexus/plexus-io/2.0.1/plexus-io-2.0.1.jar (57 KB at 1418.6 KB/sec)
Downloaded: https://repo.eclipse.org/content/repositories/maven_central/org/codehaus/plexus/plexus-archiver/2.0.1/plexus-archiver-2.0.1.jar (176 KB at 3738.2 KB/sec)
Downloaded: https://repo.eclipse.org/content/repositories/maven_central/org/codehaus/plexus/plexus-interpolation/1.13/plexus-interpolation-1.13.jar (60 KB at 1125.0 KB/sec)
Downloaded: https://repo.eclipse.org/content/repositories/maven_central/org/apache/maven/maven-archiver/2.4.2/maven-archiver-2.4.2.jar (20 KB at 140.1 KB/sec)
Downloaded: https://repo.eclipse.org/content/repositories/maven_central/org/codehaus/plexus/plexus-utils/3.0/plexus-utils-3.0.jar (221 KB at 758.7 KB/sec)
Downloading: https://oss.sonatype.org/content/repositories/public/org/eclipse/tycho/tycho-surefire-plugin/0.21.0/tycho-surefire-plugin-0.21.0.pom
Downloading: https://repo.eclipse.org/content/repositories/cbi/org/eclipse/tycho/tycho-surefire-plugin/0.21.0/tycho-surefire-plugin-0.21.0.pom
Downloading: https://repo.eclipse.org/content/repositories/tycho-snapshots/org/eclipse/tycho/tycho-surefire-plugin/0.21.0/tycho-surefire-plugin-0.21.0.pom
Downloading: https://repo.eclipse.org/content/repositories/maven_central/org/eclipse/tycho/tycho-surefire-plugin/0.21.0/tycho-surefire-plugin-0.21.0.pom
Downloaded: https://repo.eclipse.org/content/repositories/maven_central/org/eclipse/tycho/tycho-surefire-plugin/0.21.0/tycho-surefire-plugin-0.21.0.pom (4 KB at 73.5 KB/sec)
Downloading: https://oss.sonatype.org/content/repositories/public/org/eclipse/tycho/tycho-surefire/0.21.0/tycho-surefire-0.21.0.pom
Downloading: https://repo.eclipse.org/content/repositories/cbi/org/eclipse/tycho/tycho-surefire/0.21.0/tycho-surefire-0.21.0.pom
Downloading: https://repo.eclipse.org/content/repositories/tycho-snapshots/org/eclipse/tycho/tycho-surefire/0.21.0/tycho-surefire-0.21.0.pom
Downloading: https://repo.eclipse.org/content/repositories/maven_central/org/eclipse/tycho/tycho-surefire/0.21.0/tycho-surefire-0.21.0.pom
Downloaded: https://repo.eclipse.org/content/repositories/maven_central/org/eclipse/tycho/tycho-surefire/0.21.0/tycho-surefire-0.21.0.pom (3 KB at 64.3 KB/sec)
Downloading: https://oss.sonatype.org/content/repositories/public/org/eclipse/tycho/tycho-surefire-plugin/0.21.0/tycho-surefire-plugin-0.21.0.jar
Downloading: https://repo.eclipse.org/content/repositories/cbi/org/eclipse/tycho/tycho-surefire-plugin/0.21.0/tycho-surefire-plugin-0.21.0.jar
Downloading: https://repo.eclipse.org/content/repositories/tycho-snapshots/org/eclipse/tycho/tycho-surefire-plugin/0.21.0/tycho-surefire-plugin-0.21.0.jar
Downloading: https://repo.eclipse.org/content/repositories/maven_central/org/eclipse/tycho/tycho-surefire-plugin/0.21.0/tycho-surefire-plugin-0.21.0.jar
Downloaded: https://repo.eclipse.org/content/repositories/maven_central/org/eclipse/tycho/tycho-surefire-plugin/0.21.0/tycho-surefire-plugin-0.21.0.jar (48 KB at 1086.9 KB/sec)
Downloading: https://oss.sonatype.org/content/repositories/public/org/eclipse/tycho/org.eclipse.tycho.surefire.osgibooter/0.21.0/org.eclipse.tycho.surefire.osgibooter-0.21.0.pom
Downloading: https://repo.eclipse.org/content/repositories/cbi/org/eclipse/tycho/org.eclipse.tycho.surefire.osgibooter/0.21.0/org.eclipse.tycho.surefire.osgibooter-0.21.0.pom
Downloading: https://repo.eclipse.org/content/repositories/tycho-snapshots/org/eclipse/tycho/org.eclipse.tycho.surefire.osgibooter/0.21.0/org.eclipse.tycho.surefire.osgibooter-0.21.0.pom
Downloading: https://repo.eclipse.org/content/repositories/maven_central/org/eclipse/tycho/org.eclipse.tycho.surefire.osgibooter/0.21.0/org.eclipse.tycho.surefire.osgibooter-0.21.0.pom
Downloaded: https://repo.eclipse.org/content/repositories/maven_central/org/eclipse/tycho/org.eclipse.tycho.surefire.osgibooter/0.21.0/org.eclipse.tycho.surefire.osgibooter-0.21.0.pom (2 KB at 36.6 KB/sec)
Downloading: https://oss.sonatype.org/content/repositories/public/org/eclipse/tycho/org.eclipse.tycho.surefire.junit/0.21.0/org.eclipse.tycho.surefire.junit-0.21.0.pom
Downloading: https://repo.eclipse.org/content/repositories/cbi/org/eclipse/tycho/org.eclipse.tycho.surefire.junit/0.21.0/org.eclipse.tycho.surefire.junit-0.21.0.pom
Downloading: https://repo.eclipse.org/content/repositories/tycho-snapshots/org/eclipse/tycho/org.eclipse.tycho.surefire.junit/0.21.0/org.eclipse.tycho.surefire.junit-0.21.0.pom
Downloading: https://repo.eclipse.org/content/repositories/maven_central/org/eclipse/tycho/org.eclipse.tycho.surefire.junit/0.21.0/org.eclipse.tycho.surefire.junit-0.21.0.pom
Downloaded: https://repo.eclipse.org/content/repositories/maven_central/org/eclipse/tycho/org.eclipse.tycho.surefire.junit/0.21.0/org.eclipse.tycho.surefire.junit-0.21.0.pom (2 KB at 37.5 KB/sec)
Downloading: https://oss.sonatype.org/content/repositories/public/org/eclipse/tycho/org.eclipse.tycho.surefire.junit4/0.21.0/org.eclipse.tycho.surefire.junit4-0.21.0.pom
Downloading: https://repo.eclipse.org/content/repositories/cbi/org/eclipse/tycho/org.eclipse.tycho.surefire.junit4/0.21.0/org.eclipse.tycho.surefire.junit4-0.21.0.pom
Downloading: https://repo.eclipse.org/content/repositories/tycho-snapshots/org/eclipse/tycho/org.eclipse.tycho.surefire.junit4/0.21.0/org.eclipse.tycho.surefire.junit4-0.21.0.pom
Downloading: https://repo.eclipse.org/content/repositories/maven_central/org/eclipse/tycho/org.eclipse.tycho.surefire.junit4/0.21.0/org.eclipse.tycho.surefire.junit4-0.21.0.pom
Downloaded: https://repo.eclipse.org/content/repositories/maven_central/org/eclipse/tycho/org.eclipse.tycho.surefire.junit4/0.21.0/org.eclipse.tycho.surefire.junit4-0.21.0.pom (2 KB at 33.5 KB/sec)
Downloading: https://oss.sonatype.org/content/repositories/public/org/eclipse/tycho/org.eclipse.tycho.surefire.junit47/0.21.0/org.eclipse.tycho.surefire.junit47-0.21.0.pom
Downloading: https://repo.eclipse.org/content/repositories/cbi/org/eclipse/tycho/org.eclipse.tycho.surefire.junit47/0.21.0/org.eclipse.tycho.surefire.junit47-0.21.0.pom
Downloading: https://repo.eclipse.org/content/repositories/tycho-snapshots/org/eclipse/tycho/org.eclipse.tycho.surefire.junit47/0.21.0/org.eclipse.tycho.surefire.junit47-0.21.0.pom
Downloading: https://repo.eclipse.org/content/repositories/maven_central/org/eclipse/tycho/org.eclipse.tycho.surefire.junit47/0.21.0/org.eclipse.tycho.surefire.junit47-0.21.0.pom
Downloaded: https://repo.eclipse.org/content/repositories/maven_central/org/eclipse/tycho/org.eclipse.tycho.surefire.junit47/0.21.0/org.eclipse.tycho.surefire.junit47-0.21.0.pom (2 KB at 34.6 KB/sec)
Downloading: https://oss.sonatype.org/content/repositories/public/org/apache/maven/surefire/surefire-api/2.10/surefire-api-2.10.pom
Downloading: https://repo.eclipse.org/content/repositories/cbi/org/apache/maven/surefire/surefire-api/2.10/surefire-api-2.10.pom
Downloading: https://repo.eclipse.org/content/repositories/tycho-snapshots/org/apache/maven/surefire/surefire-api/2.10/surefire-api-2.10.pom
Downloading: https://repo.eclipse.org/content/repositories/maven_central/org/apache/maven/surefire/surefire-api/2.10/surefire-api-2.10.pom
Downloaded: https://repo.eclipse.org/content/repositories/maven_central/org/apache/maven/surefire/surefire-api/2.10/surefire-api-2.10.pom (3 KB at 72.0 KB/sec)
Downloading: https://oss.sonatype.org/content/repositories/public/org/apache/maven/surefire/surefire/2.10/surefire-2.10.pom
Downloading: https://repo.eclipse.org/content/repositories/cbi/org/apache/maven/surefire/surefire/2.10/surefire-2.10.pom
Downloading: https://repo.eclipse.org/content/repositories/tycho-snapshots/org/apache/maven/surefire/surefire/2.10/surefire-2.10.pom
Downloading: https://repo.eclipse.org/content/repositories/maven_central/org/apache/maven/surefire/surefire/2.10/surefire-2.10.pom
Downloaded: https://repo.eclipse.org/content/repositories/maven_central/org/apache/maven/surefire/surefire/2.10/surefire-2.10.pom (12 KB at 485.1 KB/sec)
Downloading: https://oss.sonatype.org/content/repositories/public/org/apache/maven/maven-parent/20/maven-parent-20.pom
Downloading: https://repo.eclipse.org/content/repositories/cbi/org/apache/maven/maven-parent/20/maven-parent-20.pom
Downloading: https://repo.eclipse.org/content/repositories/tycho-snapshots/org/apache/maven/maven-parent/20/maven-parent-20.pom
Downloading: https://repo.eclipse.org/content/repositories/maven_central/org/apache/maven/maven-parent/20/maven-parent-20.pom
Downloaded: https://repo.eclipse.org/content/repositories/maven_central/org/apache/maven/maven-parent/20/maven-parent-20.pom (25 KB at 924.4 KB/sec)
Downloading: https://oss.sonatype.org/content/repositories/public/org/eclipse/tycho/org.eclipse.tycho.surefire.osgibooter/0.21.0/org.eclipse.tycho.surefire.osgibooter-0.21.0.jar
Downloading: https://oss.sonatype.org/content/repositories/public/org/eclipse/tycho/org.eclipse.tycho.surefire.junit4/0.21.0/org.eclipse.tycho.surefire.junit4-0.21.0.jar
Downloading: https://oss.sonatype.org/content/repositories/public/org/eclipse/tycho/org.eclipse.tycho.surefire.junit/0.21.0/org.eclipse.tycho.surefire.junit-0.21.0.jar
Downloading: https://oss.sonatype.org/content/repositories/public/org/eclipse/tycho/org.eclipse.tycho.surefire.junit47/0.21.0/org.eclipse.tycho.surefire.junit47-0.21.0.jar
Downloading: https://oss.sonatype.org/content/repositories/public/org/apache/maven/surefire/surefire-api/2.10/surefire-api-2.10.jar
Downloading: https://repo.eclipse.org/content/repositories/cbi/org/eclipse/tycho/org.eclipse.tycho.surefire.osgibooter/0.21.0/org.eclipse.tycho.surefire.osgibooter-0.21.0.jar
Downloading: https://repo.eclipse.org/content/repositories/cbi/org/eclipse/tycho/org.eclipse.tycho.surefire.junit47/0.21.0/org.eclipse.tycho.surefire.junit47-0.21.0.jar
Downloading: https://repo.eclipse.org/content/repositories/cbi/org/eclipse/tycho/org.eclipse.tycho.surefire.junit/0.21.0/org.eclipse.tycho.surefire.junit-0.21.0.jar
Downloading: https://repo.eclipse.org/content/repositories/cbi/org/eclipse/tycho/org.eclipse.tycho.surefire.junit4/0.21.0/org.eclipse.tycho.surefire.junit4-0.21.0.jar
Downloading: https://repo.eclipse.org/content/repositories/cbi/org/apache/maven/surefire/surefire-api/2.10/surefire-api-2.10.jar
Downloading: https://repo.eclipse.org/content/repositories/tycho-snapshots/org/eclipse/tycho/org.eclipse.tycho.surefire.osgibooter/0.21.0/org.eclipse.tycho.surefire.osgibooter-0.21.0.jar
Downloading: https://repo.eclipse.org/content/repositories/tycho-snapshots/org/eclipse/tycho/org.eclipse.tycho.surefire.junit/0.21.0/org.eclipse.tycho.surefire.junit-0.21.0.jar
Downloading: https://repo.eclipse.org/content/repositories/tycho-snapshots/org/eclipse/tycho/org.eclipse.tycho.surefire.junit47/0.21.0/org.eclipse.tycho.surefire.junit47-0.21.0.jar
Downloading: https://repo.eclipse.org/content/repositories/tycho-snapshots/org/eclipse/tycho/org.eclipse.tycho.surefire.junit4/0.21.0/org.eclipse.tycho.surefire.junit4-0.21.0.jar
Downloading: https://repo.eclipse.org/content/repositories/tycho-snapshots/org/apache/maven/surefire/surefire-api/2.10/surefire-api-2.10.jar
Downloading: https://repo.eclipse.org/content/repositories/maven_central/org/eclipse/tycho/org.eclipse.tycho.surefire.osgibooter/0.21.0/org.eclipse.tycho.surefire.osgibooter-0.21.0.jar
Downloading: https://repo.eclipse.org/content/repositories/maven_central/org/eclipse/tycho/org.eclipse.tycho.surefire.junit/0.21.0/org.eclipse.tycho.surefire.junit-0.21.0.jar
Downloading: https://repo.eclipse.org/content/repositories/maven_central/org/eclipse/tycho/org.eclipse.tycho.surefire.junit4/0.21.0/org.eclipse.tycho.surefire.junit4-0.21.0.jar
Downloading: https://repo.eclipse.org/content/repositories/maven_central/org/eclipse/tycho/org.eclipse.tycho.surefire.junit47/0.21.0/org.eclipse.tycho.surefire.junit47-0.21.0.jar
Downloading: https://repo.eclipse.org/content/repositories/maven_central/org/apache/maven/surefire/surefire-api/2.10/surefire-api-2.10.jar
Downloaded: https://repo.eclipse.org/content/repositories/maven_central/org/apache/maven/surefire/surefire-api/2.10/surefire-api-2.10.jar (158 KB at 2500.7 KB/sec)
Downloaded: https://repo.eclipse.org/content/repositories/maven_central/org/eclipse/tycho/org.eclipse.tycho.surefire.junit/0.21.0/org.eclipse.tycho.surefire.junit-0.21.0.jar (25 KB at 284.1 KB/sec)
Downloaded: https://repo.eclipse.org/content/repositories/maven_central/org/eclipse/tycho/org.eclipse.tycho.surefire.junit47/0.21.0/org.eclipse.tycho.surefire.junit47-0.21.0.jar (49 KB at 565.4 KB/sec)
Downloaded: https://repo.eclipse.org/content/repositories/maven_central/org/eclipse/tycho/org.eclipse.tycho.surefire.osgibooter/0.21.0/org.eclipse.tycho.surefire.osgibooter-0.21.0.jar (181 KB at 2075.9 KB/sec)
Downloaded: https://repo.eclipse.org/content/repositories/maven_central/org/eclipse/tycho/org.eclipse.tycho.surefire.junit4/0.21.0/org.eclipse.tycho.surefire.junit4-0.21.0.jar (29 KB at 295.8 KB/sec)
Downloading: https://oss.sonatype.org/content/repositories/public/org/apache/maven/plugins/maven-dependency-plugin/2.8/maven-dependency-plugin-2.8.pom
Downloading: https://repo.eclipse.org/content/repositories/cbi/org/apache/maven/plugins/maven-dependency-plugin/2.8/maven-dependency-plugin-2.8.pom
Downloading: https://repo.eclipse.org/content/repositories/tycho-snapshots/org/apache/maven/plugins/maven-dependency-plugin/2.8/maven-dependency-plugin-2.8.pom
Downloading: https://repo.eclipse.org/content/repositories/maven_central/org/apache/maven/plugins/maven-dependency-plugin/2.8/maven-dependency-plugin-2.8.pom
Downloaded: https://repo.eclipse.org/content/repositories/maven_central/org/apache/maven/plugins/maven-dependency-plugin/2.8/maven-dependency-plugin-2.8.pom (12 KB at 243.2 KB/sec)
Downloading: https://oss.sonatype.org/content/repositories/public/org/apache/maven/plugins/maven-dependency-plugin/2.8/maven-dependency-plugin-2.8.jar
Downloading: https://repo.eclipse.org/content/repositories/cbi/org/apache/maven/plugins/maven-dependency-plugin/2.8/maven-dependency-plugin-2.8.jar
Downloading: https://repo.eclipse.org/content/repositories/tycho-snapshots/org/apache/maven/plugins/maven-dependency-plugin/2.8/maven-dependency-plugin-2.8.jar
Downloading: https://repo.eclipse.org/content/repositories/maven_central/org/apache/maven/plugins/maven-dependency-plugin/2.8/maven-dependency-plugin-2.8.jar
Downloaded: https://repo.eclipse.org/content/repositories/maven_central/org/apache/maven/plugins/maven-dependency-plugin/2.8/maven-dependency-plugin-2.8.jar (150 KB at 3478.9 KB/sec)
Downloading: https://oss.sonatype.org/content/repositories/public/org/eclipse/tycho/extras/tycho-eclipserun-plugin/0.21.0/tycho-eclipserun-plugin-0.21.0.pom
Downloading: https://repo.eclipse.org/content/repositories/cbi/org/eclipse/tycho/extras/tycho-eclipserun-plugin/0.21.0/tycho-eclipserun-plugin-0.21.0.pom
Downloading: https://repo.eclipse.org/content/repositories/tycho-snapshots/org/eclipse/tycho/extras/tycho-eclipserun-plugin/0.21.0/tycho-eclipserun-plugin-0.21.0.pom
Downloading: https://repo.eclipse.org/content/repositories/maven_central/org/eclipse/tycho/extras/tycho-eclipserun-plugin/0.21.0/tycho-eclipserun-plugin-0.21.0.pom
[INFO] o.h.m.e.h.MavenExecutionResultHandler - Build failed with exception(s)
[INFO] o.h.m.e.h.MavenExecutionResultHandler - [1] org.apache.maven.InternalErrorException: Internal error: java.lang.RuntimeException: org.apache.maven.MavenExecutionException: Could not setup plugin ClassRealm
[DEBUG] Closing connection to remote
[ERROR] Internal error: java.lang.RuntimeException: org.apache.maven.MavenExecutionException: Could not setup plugin ClassRealm: Plugin org.eclipse.tycho.extras:tycho-eclipserun-plugin:0.21.0 or one of its dependencies could not be resolved: Failed to read artifact descriptor for org.eclipse.tycho.extras:tycho-eclipserun-plugin:jar:0.21.0: Could not transfer artifact org.eclipse.tycho.extras:tycho-eclipserun-plugin:pom:0.21.0 from/to tycho (https://oss.sonatype.org/content/repositories/public/): Failed to transfer file: https://oss.sonatype.org/content/repositories/public/org/eclipse/tycho/extras/tycho-eclipserun-plugin/0.21.0/tycho-eclipserun-plugin-0.21.0.pom. Return code is: 502 , ReasonPhrase:Proxy Error. -> [Help 1]
org.apache.maven.InternalErrorException: Internal error: java.lang.RuntimeException: org.apache.maven.MavenExecutionException: Could not setup plugin ClassRealm
        at org.apache.maven.DefaultMaven.execute(DefaultMaven.java:167)
        at org.apache.maven.cli.MavenCli.execute(MavenCli.java:584)
        at org.apache.maven.cli.MavenCli.doMain(MavenCli.java:216)
        at org.apache.maven.cli.MavenCli.main(MavenCli.java:160)
        at sun.reflect.NativeMethodAccessorImpl.invoke0(Native Method)
        at sun.reflect.NativeMethodAccessorImpl.invoke(NativeMethodAccessorImpl.java:62)
        at sun.reflect.DelegatingMethodAccessorImpl.invoke(DelegatingMethodAccessorImpl.java:43)
        at java.lang.reflect.Method.invoke(Method.java:498)
        at org.codehaus.plexus.classworlds.launcher.Launcher.launchEnhanced(Launcher.java:289)
        at org.codehaus.plexus.classworlds.launcher.Launcher.launch(Launcher.java:229)
        at org.codehaus.plexus.classworlds.launcher.Launcher.mainWithExitCode(Launcher.java:415)
        at org.codehaus.plexus.classworlds.launcher.Launcher.main(Launcher.java:356)
Caused by: java.lang.RuntimeException: org.apache.maven.MavenExecutionException: Could not setup plugin ClassRealm
        at org.eclipse.tycho.p2.resolver.P2DependencyResolver.getDependencyMetadata(P2DependencyResolver.java:168)
        at org.eclipse.tycho.p2.resolver.P2DependencyResolver.setupProjects(P2DependencyResolver.java:126)
        at org.eclipse.tycho.core.resolver.DefaultTychoResolver.setupProject(DefaultTychoResolver.java:87)
        at org.eclipse.tycho.core.maven.TychoMavenLifecycleParticipant.afterProjectsRead(TychoMavenLifecycleParticipant.java:70)
        at org.apache.maven.DefaultMaven.doExecute(DefaultMaven.java:318)
        at org.apache.maven.DefaultMaven.execute(DefaultMaven.java:155)
        ... 11 more
Caused by: org.apache.maven.MavenExecutionException: Could not setup plugin ClassRealm
        at org.eclipse.tycho.core.maven.utils.PluginRealmHelper.newMavenExecutionException(PluginRealmHelper.java:143)
        at org.eclipse.tycho.core.maven.utils.PluginRealmHelper.execute(PluginRealmHelper.java:130)
        at org.eclipse.tycho.p2.resolver.P2DependencyResolver.getDependencyMetadata(P2DependencyResolver.java:148)
        ... 16 more
Caused by: org.apache.maven.plugin.PluginResolutionException: Plugin org.eclipse.tycho.extras:tycho-eclipserun-plugin:0.21.0 or one of its dependencies could not be resolved: Failed to read artifact descriptor for org.eclipse.tycho.extras:tycho-eclipserun-plugin:jar:0.21.0
        at org.apache.maven.plugin.internal.DefaultPluginDependenciesResolver.resolve(DefaultPluginDependenciesResolver.java:122)
        at org.apache.maven.plugin.internal.DefaultMavenPluginManager.getPluginDescriptor(DefaultMavenPluginManager.java:150)
        at sun.reflect.GeneratedMethodAccessor18.invoke(Unknown Source)
        at sun.reflect.DelegatingMethodAccessorImpl.invoke(DelegatingMethodAccessorImpl.java:43)
        at java.lang.reflect.Method.invoke(Method.java:498)
        at org.eclipse.tycho.core.maven.utils.MavenCompatiblityHelper.getPluginDescriptor(MavenCompatiblityHelper.java:68)
        at org.eclipse.tycho.core.maven.utils.PluginRealmHelper.execute(PluginRealmHelper.java:95)
        ... 17 more
Caused by: org.eclipse.aether.resolution.ArtifactDescriptorException: Failed to read artifact descriptor for org.eclipse.tycho.extras:tycho-eclipserun-plugin:jar:0.21.0
        at org.apache.maven.repository.internal.DefaultArtifactDescriptorReader.loadPom(DefaultArtifactDescriptorReader.java:302)
        at org.apache.maven.repository.internal.DefaultArtifactDescriptorReader.readArtifactDescriptor(DefaultArtifactDescriptorReader.java:217)
        at org.eclipse.aether.internal.impl.DefaultRepositorySystem.readArtifactDescriptor(DefaultRepositorySystem.java:287)
        at org.apache.maven.plugin.internal.DefaultPluginDependenciesResolver.resolve(DefaultPluginDependenciesResolver.java:108)
        ... 23 more
Caused by: org.eclipse.aether.resolution.ArtifactResolutionException: Could not transfer artifact org.eclipse.tycho.extras:tycho-eclipserun-plugin:pom:0.21.0 from/to tycho (https://oss.sonatype.org/content/repositories/public/): Failed to transfer file: https://oss.sonatype.org/content/repositories/public/org/eclipse/tycho/extras/tycho-eclipserun-plugin/0.21.0/tycho-eclipserun-plugin-0.21.0.pom. Return code is: 502 , ReasonPhrase:Proxy Error.
        at org.eclipse.aether.internal.impl.DefaultArtifactResolver.resolve(DefaultArtifactResolver.java:444)
        at org.eclipse.aether.internal.impl.DefaultArtifactResolver.resolveArtifacts(DefaultArtifactResolver.java:246)
        at org.eclipse.aether.internal.impl.DefaultArtifactResolver.resolveArtifact(DefaultArtifactResolver.java:223)
        at org.apache.maven.repository.internal.DefaultArtifactDescriptorReader.loadPom(DefaultArtifactDescriptorReader.java:287)
        ... 26 more
Caused by: org.eclipse.aether.transfer.ArtifactTransferException: Could not transfer artifact org.eclipse.tycho.extras:tycho-eclipserun-plugin:pom:0.21.0 from/to tycho (https://oss.sonatype.org/content/repositories/public/): Failed to transfer file: https://oss.sonatype.org/content/repositories/public/org/eclipse/tycho/extras/tycho-eclipserun-plugin/0.21.0/tycho-eclipserun-plugin-0.21.0.pom. Return code is: 502 , ReasonPhrase:Proxy Error.
        at org.eclipse.aether.connector.basic.ArtifactTransportListener.transferFailed(ArtifactTransportListener.java:43)
        at org.eclipse.aether.connector.basic.BasicRepositoryConnector$TaskRunner.run(BasicRepositoryConnector.java:355)
        at org.eclipse.aether.util.concurrency.RunnableErrorForwarder$1.run(RunnableErrorForwarder.java:67)
        at org.eclipse.aether.connector.basic.BasicRepositoryConnector$DirectExecutor.execute(BasicRepositoryConnector.java:581)
        at org.eclipse.aether.connector.basic.BasicRepositoryConnector.get(BasicRepositoryConnector.java:249)
        at org.eclipse.aether.internal.impl.DefaultArtifactResolver.performDownloads(DefaultArtifactResolver.java:520)
        at org.eclipse.aether.internal.impl.DefaultArtifactResolver.resolve(DefaultArtifactResolver.java:421)
        ... 29 more
Caused by: org.apache.maven.wagon.TransferFailedException: Failed to transfer file: https://oss.sonatype.org/content/repositories/public/org/eclipse/tycho/extras/tycho-eclipserun-plugin/0.21.0/tycho-eclipserun-plugin-0.21.0.pom. Return code is: 502 , ReasonPhrase:Proxy Error.
        at org.apache.maven.wagon.providers.http.AbstractHttpClientWagon.fillInputData(AbstractHttpClientWagon.java:1039)
        at org.apache.maven.wagon.providers.http.AbstractHttpClientWagon.fillInputData(AbstractHttpClientWagon.java:977)
        at org.apache.maven.wagon.StreamWagon.getInputStream(StreamWagon.java:116)
        at org.apache.maven.wagon.StreamWagon.getIfNewer(StreamWagon.java:88)
        at org.apache.maven.wagon.StreamWagon.get(StreamWagon.java:61)
        at org.eclipse.aether.transport.wagon.WagonTransporter$GetTaskRunner.run(WagonTransporter.java:560)
        at org.eclipse.aether.transport.wagon.WagonTransporter.execute(WagonTransporter.java:427)
        at org.eclipse.aether.transport.wagon.WagonTransporter.get(WagonTransporter.java:404)
        at org.eclipse.aether.connector.basic.BasicRepositoryConnector$GetTaskRunner.runTask(BasicRepositoryConnector.java:447)
        at org.eclipse.aether.connector.basic.BasicRepositoryConnector$TaskRunner.run(BasicRepositoryConnector.java:350)
        ... 34 more
[ERROR]
[ERROR] To see the full stack trace of the errors, re-run Maven with the -e switch.
[ERROR] Re-run Maven using the -X switch to enable full debug logging.
[ERROR]
[ERROR] For more information about the errors and possible solutions, please read the following articles:
[ERROR] [Help 1] http://cwiki.apache.org/confluence/display/MAVEN/InternalErrorException
[DEBUG] Waiting for process to finish
[DEBUG] Result: 1
Terminating xvnc.
Archiving artifacts

--
This message is automatically generated by Hudson.
For more information on Hudson, see: http://hudson-ci.org/
_______________________________________________
wtp-releng mailing list
[hidden email]
To change your delivery options, retrieve your password, or unsubscribe from this list, visit
https://dev.eclipse.org/mailman/listinfo/wtp-releng
Reply | Threaded
Open this post in threaded view
|  
Report Content as Inappropriate

[Hudson] Hudson build is back to normal : WTP-R3_9_Integration #239

hudsonbuild
See <https://hudson.eclipse.org/webtools/job/WTP-R3_9_Integration/239/>


--
This message is automatically generated by Hudson.
For more information on Hudson, see: http://hudson-ci.org/
_______________________________________________
wtp-releng mailing list
[hidden email]
To change your delivery options, retrieve your password, or unsubscribe from this list, visit
https://dev.eclipse.org/mailman/listinfo/wtp-releng
Loading...