[Hudson] Build failed in Hudson: webtools-common_R3_10 #35

classic Classic list List threaded Threaded
3 messages Options
Reply | Threaded
Open this post in threaded view
|

[Hudson] Build failed in Hudson: webtools-common_R3_10 #35

hudsonbuild
See <https://hudson.eclipse.org/webtools/job/webtools-common_R3_10/35/>

------------------------------------------
[...truncated 14454 lines...]
[INFO]
[INFO] --- tycho-packaging-plugin:1.0.0:validate-version (default-validate-version) @ org.eclipse.wst.common.tests.validation.guard ---
[INFO]
[INFO] --- build-helper-maven-plugin:3.0.0:regex-property (regex-property) @ org.eclipse.wst.common.tests.validation.guard ---
[INFO]
[INFO] --- maven-resources-plugin:2.4.3:resources (default-resources) @ org.eclipse.wst.common.tests.validation.guard ---
[WARNING] Using platform encoding (UTF-8 actually) to copy filtered resources, i.e. build is platform dependent!
[INFO] skip non existing resourceDirectory /jobs/genie.webtools/webtools-common_R3_10/workspace/tests/org.eclipse.wst.common.tests.validation.guard/src/main/resources
[INFO]
[INFO] --- tycho-compiler-plugin:1.0.0:compile (default-compile) @ org.eclipse.wst.common.tests.validation.guard ---
[INFO] Compiling 3 source files to /jobs/genie.webtools/webtools-common_R3_10/workspace/tests/org.eclipse.wst.common.tests.validation.guard/target/classes
[INFO]
[INFO] --- maven-resources-plugin:2.4.3:testResources (default-testResources) @ org.eclipse.wst.common.tests.validation.guard ---
[WARNING] Using platform encoding (UTF-8 actually) to copy filtered resources, i.e. build is platform dependent!
[INFO] skip non existing resourceDirectory /jobs/genie.webtools/webtools-common_R3_10/workspace/tests/org.eclipse.wst.common.tests.validation.guard/src/test/resources
[INFO]
[INFO] --- tycho-source-plugin:1.0.0:plugin-source (plugin-source) @ org.eclipse.wst.common.tests.validation.guard ---
[INFO] Building jar: /jobs/genie.webtools/webtools-common_R3_10/workspace/tests/org.eclipse.wst.common.tests.validation.guard/target/org.eclipse.wst.common.tests.validation.guard-1.0.200-SNAPSHOT-sources.jar
[INFO]
[INFO] --- target-platform-configuration:1.0.0:target-platform (default-target-platform) @ org.eclipse.wst.common.tests.validation.guard ---
[INFO]
[INFO] --- tycho-packaging-plugin:1.0.0:package-plugin (default-package-plugin) @ org.eclipse.wst.common.tests.validation.guard ---
[INFO] Building jar: /jobs/genie.webtools/webtools-common_R3_10/workspace/tests/org.eclipse.wst.common.tests.validation.guard/target/org.eclipse.wst.common.tests.validation.guard-1.0.200-SNAPSHOT.jar
[INFO]
[INFO] --- tycho-p2-plugin:1.0.0:p2-metadata-default (default-p2-metadata-default) @ org.eclipse.wst.common.tests.validation.guard ---
[INFO]
[INFO] --- tycho-pack200a-plugin:1.0.0:normalize (pack200-normalize) @ org.eclipse.wst.common.tests.validation.guard ---
[INFO] Pack200 normalizing jar /jobs/genie.webtools/webtools-common_R3_10/workspace/tests/org.eclipse.wst.common.tests.validation.guard/target/org.eclipse.wst.common.tests.validation.guard-1.0.200-SNAPSHOT.jar
[INFO]
[INFO] --- eclipse-jarsigner-plugin:1.1.4:sign (sign) @ org.eclipse.wst.common.tests.validation.guard ---
[INFO] Signing jar: /jobs/genie.webtools/webtools-common_R3_10/workspace/tests/org.eclipse.wst.common.tests.validation.guard/target/org.eclipse.wst.common.tests.validation.guard-1.0.200-SNAPSHOT.jar
[INFO] Signing jar: /jobs/genie.webtools/webtools-common_R3_10/workspace/tests/org.eclipse.wst.common.tests.validation.guard/target/org.eclipse.wst.common.tests.validation.guard-1.0.200-SNAPSHOT-sources.jar
[INFO]
[INFO] --- tycho-pack200b-plugin:1.0.0:pack (pack200-pack) @ org.eclipse.wst.common.tests.validation.guard ---
[INFO] Pack200 packing jar /jobs/genie.webtools/webtools-common_R3_10/workspace/tests/org.eclipse.wst.common.tests.validation.guard/target/org.eclipse.wst.common.tests.validation.guard-1.0.200-SNAPSHOT.jar
[INFO]
[INFO] --- tycho-p2-plugin:1.0.0:p2-metadata (p2-metadata) @ org.eclipse.wst.common.tests.validation.guard ---
[INFO] No baseline version MavenProject: org.eclipse.webtools.common:org.eclipse.wst.common.tests.validation.guard:1.0.200-SNAPSHOT @ /jobs/genie.webtools/webtools-common_R3_10/workspace/tests/org.eclipse.wst.common.tests.validation.guard/pom.xml
[INFO]
[INFO] --- maven-install-plugin:2.3.1:install (default-install) @ org.eclipse.wst.common.tests.validation.guard ---
[INFO] Installing /jobs/genie.webtools/webtools-common_R3_10/workspace/tests/org.eclipse.wst.common.tests.validation.guard/target/org.eclipse.wst.common.tests.validation.guard-1.0.200-SNAPSHOT.jar to <https://hudson.eclipse.org/webtools/job/webtools-common_R3_10/ws/.maven/repo/org/eclipse/webtools/common/org.eclipse.wst.common.tests.validation.guard/1.0.200-SNAPSHOT/org.eclipse.wst.common.tests.validation.guard-1.0.200-SNAPSHOT.jar>
[INFO] Installing /jobs/genie.webtools/webtools-common_R3_10/workspace/tests/org.eclipse.wst.common.tests.validation.guard/pom.xml to <https://hudson.eclipse.org/webtools/job/webtools-common_R3_10/ws/.maven/repo/org/eclipse/webtools/common/org.eclipse.wst.common.tests.validation.guard/1.0.200-SNAPSHOT/org.eclipse.wst.common.tests.validation.guard-1.0.200-SNAPSHOT.pom>
[INFO] Installing /jobs/genie.webtools/webtools-common_R3_10/workspace/tests/org.eclipse.wst.common.tests.validation.guard/target/org.eclipse.wst.common.tests.validation.guard-1.0.200-SNAPSHOT-sources.jar to <https://hudson.eclipse.org/webtools/job/webtools-common_R3_10/ws/.maven/repo/org/eclipse/webtools/common/org.eclipse.wst.common.tests.validation.guard/1.0.200-SNAPSHOT/org.eclipse.wst.common.tests.validation.guard-1.0.200-SNAPSHOT-sources.jar>
[INFO] Installing /jobs/genie.webtools/webtools-common_R3_10/workspace/tests/org.eclipse.wst.common.tests.validation.guard/target/org.eclipse.wst.common.tests.validation.guard-1.0.200-SNAPSHOT.jar.pack.gz to <https://hudson.eclipse.org/webtools/job/webtools-common_R3_10/ws/.maven/repo/org/eclipse/webtools/common/org.eclipse.wst.common.tests.validation.guard/1.0.200-SNAPSHOT/org.eclipse.wst.common.tests.validation.guard-1.0.200-SNAPSHOT-pack200.jar.pack.gz>
[INFO] Installing /jobs/genie.webtools/webtools-common_R3_10/workspace/tests/org.eclipse.wst.common.tests.validation.guard/target/p2content.xml to <https://hudson.eclipse.org/webtools/job/webtools-common_R3_10/ws/.maven/repo/org/eclipse/webtools/common/org.eclipse.wst.common.tests.validation.guard/1.0.200-SNAPSHOT/org.eclipse.wst.common.tests.validation.guard-1.0.200-SNAPSHOT-p2metadata.xml>
[INFO] Installing /jobs/genie.webtools/webtools-common_R3_10/workspace/tests/org.eclipse.wst.common.tests.validation.guard/target/p2artifacts.xml to <https://hudson.eclipse.org/webtools/job/webtools-common_R3_10/ws/.maven/repo/org/eclipse/webtools/common/org.eclipse.wst.common.tests.validation.guard/1.0.200-SNAPSHOT/org.eclipse.wst.common.tests.validation.guard-1.0.200-SNAPSHOT-p2artifacts.xml>
[INFO]
[INFO] --- tycho-p2-plugin:1.0.0:update-local-index (default-update-local-index) @ org.eclipse.wst.common.tests.validation.guard ---
[INFO]                                                                        
[INFO] ------------------------------------------------------------------------
[INFO] Building org.eclipse.wst.internet.cache.tests 1.0.100-SNAPSHOT
[INFO] ------------------------------------------------------------------------
[INFO]
[INFO] --- maven-clean-plugin:2.5:clean (default-clean) @ org.eclipse.wst.internet.cache.tests ---
[INFO]
[INFO] --- tycho-packaging-plugin:1.0.0:build-qualifier (default-build-qualifier) @ org.eclipse.wst.internet.cache.tests ---
[INFO] The project's OSGi version is 1.0.100.v201004201859
[INFO]
[INFO] --- tycho-packaging-plugin:1.0.0:validate-id (default-validate-id) @ org.eclipse.wst.internet.cache.tests ---
[INFO]
[INFO] --- tycho-packaging-plugin:1.0.0:validate-version (default-validate-version) @ org.eclipse.wst.internet.cache.tests ---
[INFO]
[INFO] --- build-helper-maven-plugin:3.0.0:regex-property (regex-property) @ org.eclipse.wst.internet.cache.tests ---
[INFO]
[INFO] --- maven-resources-plugin:2.4.3:resources (default-resources) @ org.eclipse.wst.internet.cache.tests ---
[WARNING] Using platform encoding (UTF-8 actually) to copy filtered resources, i.e. build is platform dependent!
[INFO] skip non existing resourceDirectory /jobs/genie.webtools/webtools-common_R3_10/workspace/tests/org.eclipse.wst.internet.cache.tests/src/main/resources
[INFO]
[INFO] --- tycho-compiler-plugin:1.0.0:compile (default-compile) @ org.eclipse.wst.internet.cache.tests ---
[INFO] Compiling 7 source files to /jobs/genie.webtools/webtools-common_R3_10/workspace/tests/org.eclipse.wst.internet.cache.tests/target/classes
[INFO]
[INFO] --- maven-resources-plugin:2.4.3:testResources (default-testResources) @ org.eclipse.wst.internet.cache.tests ---
[WARNING] Using platform encoding (UTF-8 actually) to copy filtered resources, i.e. build is platform dependent!
[INFO] skip non existing resourceDirectory /jobs/genie.webtools/webtools-common_R3_10/workspace/tests/org.eclipse.wst.internet.cache.tests/src/test/resources
[INFO]
[INFO] --- tycho-source-plugin:1.0.0:plugin-source (plugin-source) @ org.eclipse.wst.internet.cache.tests ---
[INFO] Building jar: /jobs/genie.webtools/webtools-common_R3_10/workspace/tests/org.eclipse.wst.internet.cache.tests/target/org.eclipse.wst.internet.cache.tests-1.0.100-SNAPSHOT-sources.jar
[INFO]
[INFO] --- target-platform-configuration:1.0.0:target-platform (default-target-platform) @ org.eclipse.wst.internet.cache.tests ---
[INFO]
[INFO] --- tycho-packaging-plugin:1.0.0:package-plugin (default-package-plugin) @ org.eclipse.wst.internet.cache.tests ---
[INFO] Building jar: /jobs/genie.webtools/webtools-common_R3_10/workspace/tests/org.eclipse.wst.internet.cache.tests/tests.jar
[INFO] Building jar: /jobs/genie.webtools/webtools-common_R3_10/workspace/tests/org.eclipse.wst.internet.cache.tests/target/org.eclipse.wst.internet.cache.tests-1.0.100-SNAPSHOT.jar
[INFO]
[INFO] --- tycho-p2-plugin:1.0.0:p2-metadata-default (default-p2-metadata-default) @ org.eclipse.wst.internet.cache.tests ---
[INFO]
[INFO] --- tycho-surefire-plugin:1.0.0:test (default-test) @ org.eclipse.wst.internet.cache.tests ---
[INFO] Expected eclipse log file: /jobs/genie.webtools/webtools-common_R3_10/workspace/tests/org.eclipse.wst.internet.cache.tests/target/work/data/.metadata/.log
[INFO] Command line:
        [/opt/public/common/java/oracle/jdk1.8.0_162_x64/jre/bin/java, -Dosgi.noShutdown=false, -Dosgi.os=linux, -Dosgi.ws=gtk, -Dosgi.arch=x86_64, -Dosgi.clean=true, -jar, /jobs/genie.webtools/webtools-common_R3_10/workspace/.maven/repo/p2/osgi/bundle/org.eclipse.equinox.launcher/1.5.0.v20180119-0753/org.eclipse.equinox.launcher-1.5.0.v20180119-0753.jar, -data, /jobs/genie.webtools/webtools-common_R3_10/workspace/tests/org.eclipse.wst.internet.cache.tests/target/work/data, -install, /jobs/genie.webtools/webtools-common_R3_10/workspace/tests/org.eclipse.wst.internet.cache.tests/target/work, -configuration, /jobs/genie.webtools/webtools-common_R3_10/workspace/tests/org.eclipse.wst.internet.cache.tests/target/work/configuration, -application, org.eclipse.tycho.surefire.osgibooter.headlesstest, -testproperties, /jobs/genie.webtools/webtools-common_R3_10/workspace/tests/org.eclipse.wst.internet.cache.tests/target/surefire.properties]

-------------------------------------------------------
 T E S T S
-------------------------------------------------------
Running org.eclipse.wst.internet.cache.internal.CacheTest
Tests run: 10, Failures: 0, Errors: 0, Skipped: 0, Time elapsed: 2.365 sec - in org.eclipse.wst.internet.cache.internal.CacheTest
testResultStartsWithFile(org.eclipse.wst.internet.cache.internal.CacheTest)  Time elapsed: 1.353 sec
testClearCacheWithSingleEntry(org.eclipse.wst.internet.cache.internal.CacheTest)  Time elapsed: 0.058 sec
testDeleteNullCacheEntry(org.eclipse.wst.internet.cache.internal.CacheTest)  Time elapsed: 0.071 sec
testGetResourceThatExists(org.eclipse.wst.internet.cache.internal.CacheTest)  Time elapsed: 0.079 sec
testClearCacheWithMultipleEntries(org.eclipse.wst.internet.cache.internal.CacheTest)  Time elapsed: 0.46 sec
testGetNullResource(org.eclipse.wst.internet.cache.internal.CacheTest)  Time elapsed: 0 sec
testGetNonExistantResource(org.eclipse.wst.internet.cache.internal.CacheTest)  Time elapsed: 0.06 sec
testDeleteCacheEntry(org.eclipse.wst.internet.cache.internal.CacheTest)  Time elapsed: 0.061 sec
testGetCacheEntries(org.eclipse.wst.internet.cache.internal.CacheTest)  Time elapsed: 0.195 sec
testGetInstance(org.eclipse.wst.internet.cache.internal.CacheTest)  Time elapsed: 0 sec
Running org.eclipse.wst.internet.cache.internal.CacheURIResolverExtensionTest
Tests run: 7, Failures: 0, Errors: 0, Skipped: 0, Time elapsed: 0.197 sec - in org.eclipse.wst.internet.cache.internal.CacheURIResolverExtensionTest
testAbsoluteSystemIdNullBaselocation(org.eclipse.wst.internet.cache.internal.CacheURIResolverExtensionTest)  Time elapsed: 0.085 sec
testRelativeSystemIdWillNullBaselocation(org.eclipse.wst.internet.cache.internal.CacheURIResolverExtensionTest)  Time elapsed: 0 sec
testReturnsNullWhenDisabled(org.eclipse.wst.internet.cache.internal.CacheURIResolverExtensionTest)  Time elapsed: 0.001 sec
testResolveNullSystemIdAndBaselocation(org.eclipse.wst.internet.cache.internal.CacheURIResolverExtensionTest)  Time elapsed: 0 sec
testResolveNullSystemId(org.eclipse.wst.internet.cache.internal.CacheURIResolverExtensionTest)  Time elapsed: 0 sec
testRelativeSystemId(org.eclipse.wst.internet.cache.internal.CacheURIResolverExtensionTest)  Time elapsed: 0.054 sec
testAbsoluteSystemId(org.eclipse.wst.internet.cache.internal.CacheURIResolverExtensionTest)  Time elapsed: 0.056 sec
Running org.eclipse.wst.internet.cache.internal.LicenseRegistryTest
Tests run: 6, Failures: 0, Errors: 0, Skipped: 0, Time elapsed: 0.004 sec - in org.eclipse.wst.internet.cache.internal.LicenseRegistryTest
testDisgreeToLicense(org.eclipse.wst.internet.cache.internal.LicenseRegistryTest)  Time elapsed: 0.001 sec
testAddLicenseToRegistryTwice(org.eclipse.wst.internet.cache.internal.LicenseRegistryTest)  Time elapsed: 0 sec
testAddLicenseToRegistry(org.eclipse.wst.internet.cache.internal.LicenseRegistryTest)  Time elapsed: 0 sec
testAgreeToLicense(org.eclipse.wst.internet.cache.internal.LicenseRegistryTest)  Time elapsed: 0 sec
testAgreeToLicenseNotInRegistry(org.eclipse.wst.internet.cache.internal.LicenseRegistryTest)  Time elapsed: 0 sec
testDisagreeToLicenseNotInRegistry(org.eclipse.wst.internet.cache.internal.LicenseRegistryTest)  Time elapsed: 0 sec
Running org.eclipse.wst.internet.cache.internal.CacheEntryTest
Tests run: 3, Failures: 0, Errors: 0, Skipped: 0, Time elapsed: 0.002 sec - in org.eclipse.wst.internet.cache.internal.CacheEntryTest
testExpiredWhenLessThanSystemTime(org.eclipse.wst.internet.cache.internal.CacheEntryTest)  Time elapsed: 0 sec
testNotExpiredWhenMinusOne(org.eclipse.wst.internet.cache.internal.CacheEntryTest)  Time elapsed: 0 sec
testNotExpiredWhenGreaterThanSystemTime(org.eclipse.wst.internet.cache.internal.CacheEntryTest)  Time elapsed: 0 sec

Results :

Tests run: 26, Failures: 0, Errors: 0, Skipped: 0

[INFO] All tests passed!
[INFO]
[INFO] --- tycho-pack200a-plugin:1.0.0:normalize (pack200-normalize) @ org.eclipse.wst.internet.cache.tests ---
[INFO] Pack200 normalizing jar /jobs/genie.webtools/webtools-common_R3_10/workspace/tests/org.eclipse.wst.internet.cache.tests/target/org.eclipse.wst.internet.cache.tests-1.0.100-SNAPSHOT.jar
[INFO]
[INFO] --- eclipse-jarsigner-plugin:1.1.4:sign (sign) @ org.eclipse.wst.internet.cache.tests ---
[INFO] Signing of nested jars of '/jobs/genie.webtools/webtools-common_R3_10/workspace/tests/org.eclipse.wst.internet.cache.tests/target/org.eclipse.wst.internet.cache.tests-1.0.100-SNAPSHOT.jar_unpacked_7124361832519562639/tests.jar' is disabled.
[INFO] Signing jar: /jobs/genie.webtools/webtools-common_R3_10/workspace/tests/org.eclipse.wst.internet.cache.tests/target/org.eclipse.wst.internet.cache.tests-1.0.100-SNAPSHOT.jar_unpacked_7124361832519562639/tests.jar
[INFO] Signing jar: /jobs/genie.webtools/webtools-common_R3_10/workspace/tests/org.eclipse.wst.internet.cache.tests/target/org.eclipse.wst.internet.cache.tests-1.0.100-SNAPSHOT.jar
[INFO] Signing jar: /jobs/genie.webtools/webtools-common_R3_10/workspace/tests/org.eclipse.wst.internet.cache.tests/target/org.eclipse.wst.internet.cache.tests-1.0.100-SNAPSHOT-sources.jar
[INFO]
[INFO] --- tycho-pack200b-plugin:1.0.0:pack (pack200-pack) @ org.eclipse.wst.internet.cache.tests ---
[INFO] Pack200 packing jar /jobs/genie.webtools/webtools-common_R3_10/workspace/tests/org.eclipse.wst.internet.cache.tests/target/org.eclipse.wst.internet.cache.tests-1.0.100-SNAPSHOT.jar
[INFO]
[INFO] --- tycho-p2-plugin:1.0.0:p2-metadata (p2-metadata) @ org.eclipse.wst.internet.cache.tests ---
[INFO] No baseline version MavenProject: org.eclipse.webtools.common:org.eclipse.wst.internet.cache.tests:1.0.100-SNAPSHOT @ /jobs/genie.webtools/webtools-common_R3_10/workspace/tests/org.eclipse.wst.internet.cache.tests/pom.xml
[INFO]
[INFO] --- maven-install-plugin:2.3.1:install (default-install) @ org.eclipse.wst.internet.cache.tests ---
[INFO] Installing /jobs/genie.webtools/webtools-common_R3_10/workspace/tests/org.eclipse.wst.internet.cache.tests/target/org.eclipse.wst.internet.cache.tests-1.0.100-SNAPSHOT.jar to <https://hudson.eclipse.org/webtools/job/webtools-common_R3_10/ws/.maven/repo/org/eclipse/webtools/common/org.eclipse.wst.internet.cache.tests/1.0.100-SNAPSHOT/org.eclipse.wst.internet.cache.tests-1.0.100-SNAPSHOT.jar>
[INFO] Installing /jobs/genie.webtools/webtools-common_R3_10/workspace/tests/org.eclipse.wst.internet.cache.tests/pom.xml to <https://hudson.eclipse.org/webtools/job/webtools-common_R3_10/ws/.maven/repo/org/eclipse/webtools/common/org.eclipse.wst.internet.cache.tests/1.0.100-SNAPSHOT/org.eclipse.wst.internet.cache.tests-1.0.100-SNAPSHOT.pom>
[INFO] Installing /jobs/genie.webtools/webtools-common_R3_10/workspace/tests/org.eclipse.wst.internet.cache.tests/target/org.eclipse.wst.internet.cache.tests-1.0.100-SNAPSHOT-sources.jar to <https://hudson.eclipse.org/webtools/job/webtools-common_R3_10/ws/.maven/repo/org/eclipse/webtools/common/org.eclipse.wst.internet.cache.tests/1.0.100-SNAPSHOT/org.eclipse.wst.internet.cache.tests-1.0.100-SNAPSHOT-sources.jar>
[INFO] Installing /jobs/genie.webtools/webtools-common_R3_10/workspace/tests/org.eclipse.wst.internet.cache.tests/target/org.eclipse.wst.internet.cache.tests-1.0.100-SNAPSHOT.jar.pack.gz to <https://hudson.eclipse.org/webtools/job/webtools-common_R3_10/ws/.maven/repo/org/eclipse/webtools/common/org.eclipse.wst.internet.cache.tests/1.0.100-SNAPSHOT/org.eclipse.wst.internet.cache.tests-1.0.100-SNAPSHOT-pack200.jar.pack.gz>
[INFO] Installing /jobs/genie.webtools/webtools-common_R3_10/workspace/tests/org.eclipse.wst.internet.cache.tests/target/p2content.xml to <https://hudson.eclipse.org/webtools/job/webtools-common_R3_10/ws/.maven/repo/org/eclipse/webtools/common/org.eclipse.wst.internet.cache.tests/1.0.100-SNAPSHOT/org.eclipse.wst.internet.cache.tests-1.0.100-SNAPSHOT-p2metadata.xml>
[INFO] Installing /jobs/genie.webtools/webtools-common_R3_10/workspace/tests/org.eclipse.wst.internet.cache.tests/target/p2artifacts.xml to <https://hudson.eclipse.org/webtools/job/webtools-common_R3_10/ws/.maven/repo/org/eclipse/webtools/common/org.eclipse.wst.internet.cache.tests/1.0.100-SNAPSHOT/org.eclipse.wst.internet.cache.tests-1.0.100-SNAPSHOT-p2artifacts.xml>
[INFO]
[INFO] --- tycho-p2-plugin:1.0.0:update-local-index (default-update-local-index) @ org.eclipse.wst.internet.cache.tests ---
[INFO]                                                                        
[INFO] ------------------------------------------------------------------------
[INFO] Skipping org.eclipse.wst.common_tests.feature
[INFO] This project has been banned from the build due to previous failures.
[INFO] ------------------------------------------------------------------------
[INFO]                                                                        
[INFO] ------------------------------------------------------------------------
[INFO] Skipping org.eclipse.webtools.common.site
[INFO] This project has been banned from the build due to previous failures.
[INFO] ------------------------------------------------------------------------
[INFO] ------------------------------------------------------------------------
[INFO] Reactor Summary:
[INFO]
[INFO] org.eclipse.webtools.common ........................ SUCCESS [02:42 min]
[INFO] org.eclipse.webtools.common.docs ................... SUCCESS [  0.085 s]
[INFO] org.eclipse.wst.common.api.doc ..................... SUCCESS [02:20 min]
[INFO] org.eclipse.wst.validation.doc.isv ................. SUCCESS [ 14.776 s]
[INFO] org.eclipse.wst.validation.infopop ................. SUCCESS [ 23.102 s]
[INFO] org.eclipse.webtools.common.features ............... SUCCESS [  0.086 s]
[INFO] org.eclipse.webtools.common.plugins ................ SUCCESS [  0.072 s]
[INFO] org.eclipse.wst.common.project.facet.core .......... SUCCESS [ 34.280 s]
[INFO] org.eclipse.jst.common.project.facet.core .......... SUCCESS [ 51.263 s]
[INFO] org.eclipse.wst.common.project.facet.ui ............ SUCCESS [ 37.813 s]
[INFO] org.eclipse.jst.common.project.facet.ui ............ SUCCESS [ 20.893 s]
[INFO] org.eclipse.jst.common.fproj.enablement.jdt ........ SUCCESS [  3.422 s]
[INFO] org.eclipse.jst.common.fproj.enablement.jdt.sdk .... SUCCESS [ 13.156 s]
[INFO] org.eclipse.jst.common.fproj.enablement.jdt.sdk .... SUCCESS [ 11.760 s]
[INFO] org.eclipse.wst.common.core ........................ SUCCESS [ 11.386 s]
[INFO] org.eclipse.jem.util ............................... SUCCESS [ 18.816 s]
[INFO] org.eclipse.wst.common.environment ................. SUCCESS [ 20.995 s]
[INFO] org.eclipse.wst.common.frameworks .................. SUCCESS [ 45.529 s]
[INFO] org.eclipse.wst.common.emf ......................... SUCCESS [ 29.580 s]
[INFO] org.eclipse.wst.validation ......................... SUCCESS [ 19.552 s]
[INFO] org.eclipse.wst.common.emfworkbench.integration .... SUCCESS [ 40.007 s]
[INFO] org.eclipse.wst.common.uriresolver ................. SUCCESS [  6.867 s]
[INFO] org.eclipse.wst.common.modulecore .................. SUCCESS [ 39.283 s]
[INFO] org.eclipse.wst.common_core.feature ................ SUCCESS [ 15.140 s]
[INFO] org.eclipse.wst.common.fproj ....................... SUCCESS [  1.800 s]
[INFO] org.eclipse.wst.common.project.facet.doc.api ....... SUCCESS [  8.078 s]
[INFO] org.eclipse.wst.common.fproj.sdk ................... SUCCESS [ 19.472 s]
[INFO] org.eclipse.wst.common.fproj.sdk ................... SUCCESS [ 19.760 s]
[INFO] org.eclipse.wst.common.frameworks.ui ............... SUCCESS [ 47.001 s]
[INFO] org.eclipse.wst.common.modulecore.ui ............... SUCCESS [ 13.753 s]
[INFO] org.eclipse.wst.common.snippets .................... SUCCESS [ 29.775 s]
[INFO] org.eclipse.wst.common.ui .......................... SUCCESS [ 55.764 s]
[INFO] org.eclipse.wst.common.infopop ..................... SUCCESS [ 24.612 s]
[INFO] org.eclipse.wst.internet.cache ..................... SUCCESS [ 18.469 s]
[INFO] org.eclipse.wst.validation.ui ...................... SUCCESS [ 14.847 s]
[INFO] org.eclipse.wst.common_ui.feature .................. SUCCESS [  4.378 s]
[INFO] org.eclipse.wst.common_sdk.feature ................. SUCCESS [  7.844 s]
[INFO] org.eclipse.webtools.common.tests .................. SUCCESS [  0.077 s]
[INFO] org.eclipse.wst.common.project.facet.core.tests .... SUCCESS [ 42.868 s]
[INFO] org.eclipse.wst.common.project.facet.ui.tests ...... SUCCESS [ 13.808 s]
[INFO] org.eclipse.wst.common.snippets.tests .............. FAILURE [  2.695 s]
[INFO] org.eclipse.wst.common.tests.collector ............. SUCCESS [ 12.849 s]
[INFO] org.eclipse.wst.common.uriresolver.tests ........... SUCCESS [ 41.373 s]
[INFO] org.eclipse.wst.common.tests ....................... SUCCESS [09:52 min]
[INFO] org.eclipse.wst.common.tests.ui .................... SUCCESS [01:14 min]
[INFO] org.eclipse.wst.common.tests.validation ............ SUCCESS [03:29 min]
[INFO] org.eclipse.wst.common.tests.validation.guard ...... SUCCESS [ 19.235 s]
[INFO] org.eclipse.wst.internet.cache.tests ............... SUCCESS [01:08 min]
[INFO] org.eclipse.wst.common_tests.feature ............... SKIPPED
[INFO] org.eclipse.webtools.common.site ................... SKIPPED
[INFO] ------------------------------------------------------------------------
[INFO] BUILD FAILURE
[INFO] ------------------------------------------------------------------------
[INFO] Total time: 46:40 min
[INFO] Finished at: 2018-01-28T01:12:52-05:00
[INFO] Final Memory: 136M/3858M
[INFO] ------------------------------------------------------------------------
[INFO] o.h.m.e.h.MavenExecutionResultHandler - Build failed with exception(s)
[INFO] o.h.m.e.h.MavenExecutionResultHandler - [1] org.apache.maven.lifecycle.LifecycleExecutionException: Failed to execute goal org.eclipse.tycho:tycho-surefire-plugin:1.0.0:test (default-test) on project org.eclipse.wst.common.snippets.tests: Execution default-test of goal org.eclipse.tycho:tycho-surefire-plugin:1.0.0:test failed: Cannot resolve dependencies of MavenProject: org.eclipse.webtools.common:org.eclipse.wst.common.snippets.tests:1.0.400-SNAPSHOT @ /jobs/genie.webtools/webtools-common_R3_10/workspace/tests/org.eclipse.wst.common.snippets.tests/pom.xml
[DEBUG] Closing connection to remote
[ERROR] Failed to execute goal org.eclipse.tycho:tycho-surefire-plugin:1.0.0:test (default-test) on project org.eclipse.wst.common.snippets.tests: Execution default-test of goal org.eclipse.tycho:tycho-surefire-plugin:1.0.0:test failed: Cannot resolve dependencies of MavenProject: org.eclipse.webtools.common:org.eclipse.wst.common.snippets.tests:1.0.400-SNAPSHOT @ /jobs/genie.webtools/webtools-common_R3_10/workspace/tests/org.eclipse.wst.common.snippets.tests/pom.xml: See log for details -> [Help 1]
[ERROR]
[ERROR] To see the full stack trace of the errors, re-run Maven with the -e switch.
[ERROR] Re-run Maven using the -X switch to enable full debug logging.
[ERROR]
[ERROR] For more information about the errors and possible solutions, please read the following articles:
[ERROR] [Help 1] http://cwiki.apache.org/confluence/display/MAVEN/PluginExecutionException
[ERROR]
[ERROR] After correcting the problems, you can resume the build with the command
[ERROR]   mvn <goals> -rf :org.eclipse.wst.common.snippets.tests
[DEBUG] Waiting for process to finish
[DEBUG] Result: 1
Taking screenshot.
[workspace] $ import -window root -display :453 screenshot.jpg
Terminating xvnc.
Recording test results
Archiving artifacts

--
This message is automatically generated by Hudson.
For more information on Hudson, see: http://hudson-ci.org/
_______________________________________________
wtp-releng mailing list
[hidden email]
To change your delivery options, retrieve your password, or unsubscribe from this list, visit
https://dev.eclipse.org/mailman/listinfo/wtp-releng
Reply | Threaded
Open this post in threaded view
|

[Hudson] Build failed in Hudson: webtools-common_R3_10 #36

hudsonbuild
See <https://hudson.eclipse.org/webtools/job/webtools-common_R3_10/36/>

------------------------------------------
[...truncated 14453 lines...]
[INFO] --- build-helper-maven-plugin:3.0.0:regex-property (regex-property) @ org.eclipse.wst.common.tests.validation.guard ---
[INFO]
[INFO] --- maven-resources-plugin:2.4.3:resources (default-resources) @ org.eclipse.wst.common.tests.validation.guard ---
[WARNING] Using platform encoding (UTF-8 actually) to copy filtered resources, i.e. build is platform dependent!
[INFO] skip non existing resourceDirectory /jobs/genie.webtools/webtools-common_R3_10/workspace/tests/org.eclipse.wst.common.tests.validation.guard/src/main/resources
[INFO]
[INFO] --- tycho-compiler-plugin:1.0.0:compile (default-compile) @ org.eclipse.wst.common.tests.validation.guard ---
[INFO] Compiling 3 source files to /jobs/genie.webtools/webtools-common_R3_10/workspace/tests/org.eclipse.wst.common.tests.validation.guard/target/classes
[INFO]
[INFO] --- maven-resources-plugin:2.4.3:testResources (default-testResources) @ org.eclipse.wst.common.tests.validation.guard ---
[WARNING] Using platform encoding (UTF-8 actually) to copy filtered resources, i.e. build is platform dependent!
[INFO] skip non existing resourceDirectory /jobs/genie.webtools/webtools-common_R3_10/workspace/tests/org.eclipse.wst.common.tests.validation.guard/src/test/resources
[INFO]
[INFO] --- tycho-source-plugin:1.0.0:plugin-source (plugin-source) @ org.eclipse.wst.common.tests.validation.guard ---
[INFO] Building jar: /jobs/genie.webtools/webtools-common_R3_10/workspace/tests/org.eclipse.wst.common.tests.validation.guard/target/org.eclipse.wst.common.tests.validation.guard-1.0.200-SNAPSHOT-sources.jar
[INFO]
[INFO] --- target-platform-configuration:1.0.0:target-platform (default-target-platform) @ org.eclipse.wst.common.tests.validation.guard ---
[INFO]
[INFO] --- tycho-packaging-plugin:1.0.0:package-plugin (default-package-plugin) @ org.eclipse.wst.common.tests.validation.guard ---
[INFO] Building jar: /jobs/genie.webtools/webtools-common_R3_10/workspace/tests/org.eclipse.wst.common.tests.validation.guard/target/org.eclipse.wst.common.tests.validation.guard-1.0.200-SNAPSHOT.jar
[INFO]
[INFO] --- tycho-p2-plugin:1.0.0:p2-metadata-default (default-p2-metadata-default) @ org.eclipse.wst.common.tests.validation.guard ---
[INFO]
[INFO] --- tycho-pack200a-plugin:1.0.0:normalize (pack200-normalize) @ org.eclipse.wst.common.tests.validation.guard ---
[INFO] Pack200 normalizing jar /jobs/genie.webtools/webtools-common_R3_10/workspace/tests/org.eclipse.wst.common.tests.validation.guard/target/org.eclipse.wst.common.tests.validation.guard-1.0.200-SNAPSHOT.jar
[INFO]
[INFO] --- eclipse-jarsigner-plugin:1.1.4:sign (sign) @ org.eclipse.wst.common.tests.validation.guard ---
[INFO] Signing jar: /jobs/genie.webtools/webtools-common_R3_10/workspace/tests/org.eclipse.wst.common.tests.validation.guard/target/org.eclipse.wst.common.tests.validation.guard-1.0.200-SNAPSHOT.jar
[INFO] Signing jar: /jobs/genie.webtools/webtools-common_R3_10/workspace/tests/org.eclipse.wst.common.tests.validation.guard/target/org.eclipse.wst.common.tests.validation.guard-1.0.200-SNAPSHOT-sources.jar
[INFO]
[INFO] --- tycho-pack200b-plugin:1.0.0:pack (pack200-pack) @ org.eclipse.wst.common.tests.validation.guard ---
[INFO] Pack200 packing jar /jobs/genie.webtools/webtools-common_R3_10/workspace/tests/org.eclipse.wst.common.tests.validation.guard/target/org.eclipse.wst.common.tests.validation.guard-1.0.200-SNAPSHOT.jar
[INFO]
[INFO] --- tycho-p2-plugin:1.0.0:p2-metadata (p2-metadata) @ org.eclipse.wst.common.tests.validation.guard ---
[INFO] No baseline version MavenProject: org.eclipse.webtools.common:org.eclipse.wst.common.tests.validation.guard:1.0.200-SNAPSHOT @ /jobs/genie.webtools/webtools-common_R3_10/workspace/tests/org.eclipse.wst.common.tests.validation.guard/pom.xml
[INFO]
[INFO] --- maven-install-plugin:2.3.1:install (default-install) @ org.eclipse.wst.common.tests.validation.guard ---
[INFO] Installing /jobs/genie.webtools/webtools-common_R3_10/workspace/tests/org.eclipse.wst.common.tests.validation.guard/target/org.eclipse.wst.common.tests.validation.guard-1.0.200-SNAPSHOT.jar to <https://hudson.eclipse.org/webtools/job/webtools-common_R3_10/ws/.maven/repo/org/eclipse/webtools/common/org.eclipse.wst.common.tests.validation.guard/1.0.200-SNAPSHOT/org.eclipse.wst.common.tests.validation.guard-1.0.200-SNAPSHOT.jar>
[INFO] Installing /jobs/genie.webtools/webtools-common_R3_10/workspace/tests/org.eclipse.wst.common.tests.validation.guard/pom.xml to <https://hudson.eclipse.org/webtools/job/webtools-common_R3_10/ws/.maven/repo/org/eclipse/webtools/common/org.eclipse.wst.common.tests.validation.guard/1.0.200-SNAPSHOT/org.eclipse.wst.common.tests.validation.guard-1.0.200-SNAPSHOT.pom>
[INFO] Installing /jobs/genie.webtools/webtools-common_R3_10/workspace/tests/org.eclipse.wst.common.tests.validation.guard/target/org.eclipse.wst.common.tests.validation.guard-1.0.200-SNAPSHOT-sources.jar to <https://hudson.eclipse.org/webtools/job/webtools-common_R3_10/ws/.maven/repo/org/eclipse/webtools/common/org.eclipse.wst.common.tests.validation.guard/1.0.200-SNAPSHOT/org.eclipse.wst.common.tests.validation.guard-1.0.200-SNAPSHOT-sources.jar>
[INFO] Installing /jobs/genie.webtools/webtools-common_R3_10/workspace/tests/org.eclipse.wst.common.tests.validation.guard/target/org.eclipse.wst.common.tests.validation.guard-1.0.200-SNAPSHOT.jar.pack.gz to <https://hudson.eclipse.org/webtools/job/webtools-common_R3_10/ws/.maven/repo/org/eclipse/webtools/common/org.eclipse.wst.common.tests.validation.guard/1.0.200-SNAPSHOT/org.eclipse.wst.common.tests.validation.guard-1.0.200-SNAPSHOT-pack200.jar.pack.gz>
[INFO] Installing /jobs/genie.webtools/webtools-common_R3_10/workspace/tests/org.eclipse.wst.common.tests.validation.guard/target/p2content.xml to <https://hudson.eclipse.org/webtools/job/webtools-common_R3_10/ws/.maven/repo/org/eclipse/webtools/common/org.eclipse.wst.common.tests.validation.guard/1.0.200-SNAPSHOT/org.eclipse.wst.common.tests.validation.guard-1.0.200-SNAPSHOT-p2metadata.xml>
[INFO] Installing /jobs/genie.webtools/webtools-common_R3_10/workspace/tests/org.eclipse.wst.common.tests.validation.guard/target/p2artifacts.xml to <https://hudson.eclipse.org/webtools/job/webtools-common_R3_10/ws/.maven/repo/org/eclipse/webtools/common/org.eclipse.wst.common.tests.validation.guard/1.0.200-SNAPSHOT/org.eclipse.wst.common.tests.validation.guard-1.0.200-SNAPSHOT-p2artifacts.xml>
[INFO]
[INFO] --- tycho-p2-plugin:1.0.0:update-local-index (default-update-local-index) @ org.eclipse.wst.common.tests.validation.guard ---
[INFO]                                                                        
[INFO] ------------------------------------------------------------------------
[INFO] Building org.eclipse.wst.internet.cache.tests 1.0.100-SNAPSHOT
[INFO] ------------------------------------------------------------------------
[INFO]
[INFO] --- maven-clean-plugin:2.5:clean (default-clean) @ org.eclipse.wst.internet.cache.tests ---
[INFO]
[INFO] --- tycho-packaging-plugin:1.0.0:build-qualifier (default-build-qualifier) @ org.eclipse.wst.internet.cache.tests ---
[INFO] The project's OSGi version is 1.0.100.v201004201859
[INFO]
[INFO] --- tycho-packaging-plugin:1.0.0:validate-id (default-validate-id) @ org.eclipse.wst.internet.cache.tests ---
[INFO]
[INFO] --- tycho-packaging-plugin:1.0.0:validate-version (default-validate-version) @ org.eclipse.wst.internet.cache.tests ---
[INFO]
[INFO] --- build-helper-maven-plugin:3.0.0:regex-property (regex-property) @ org.eclipse.wst.internet.cache.tests ---
[INFO]
[INFO] --- maven-resources-plugin:2.4.3:resources (default-resources) @ org.eclipse.wst.internet.cache.tests ---
[WARNING] Using platform encoding (UTF-8 actually) to copy filtered resources, i.e. build is platform dependent!
[INFO] skip non existing resourceDirectory /jobs/genie.webtools/webtools-common_R3_10/workspace/tests/org.eclipse.wst.internet.cache.tests/src/main/resources
[INFO]
[INFO] --- tycho-compiler-plugin:1.0.0:compile (default-compile) @ org.eclipse.wst.internet.cache.tests ---
[INFO] Compiling 7 source files to /jobs/genie.webtools/webtools-common_R3_10/workspace/tests/org.eclipse.wst.internet.cache.tests/target/classes
[INFO]
[INFO] --- maven-resources-plugin:2.4.3:testResources (default-testResources) @ org.eclipse.wst.internet.cache.tests ---
[WARNING] Using platform encoding (UTF-8 actually) to copy filtered resources, i.e. build is platform dependent!
[INFO] skip non existing resourceDirectory /jobs/genie.webtools/webtools-common_R3_10/workspace/tests/org.eclipse.wst.internet.cache.tests/src/test/resources
[INFO]
[INFO] --- tycho-source-plugin:1.0.0:plugin-source (plugin-source) @ org.eclipse.wst.internet.cache.tests ---
[INFO] Building jar: /jobs/genie.webtools/webtools-common_R3_10/workspace/tests/org.eclipse.wst.internet.cache.tests/target/org.eclipse.wst.internet.cache.tests-1.0.100-SNAPSHOT-sources.jar
[INFO]
[INFO] --- target-platform-configuration:1.0.0:target-platform (default-target-platform) @ org.eclipse.wst.internet.cache.tests ---
[INFO]
[INFO] --- tycho-packaging-plugin:1.0.0:package-plugin (default-package-plugin) @ org.eclipse.wst.internet.cache.tests ---
[INFO] Building jar: /jobs/genie.webtools/webtools-common_R3_10/workspace/tests/org.eclipse.wst.internet.cache.tests/tests.jar
[INFO] Building jar: /jobs/genie.webtools/webtools-common_R3_10/workspace/tests/org.eclipse.wst.internet.cache.tests/target/org.eclipse.wst.internet.cache.tests-1.0.100-SNAPSHOT.jar
[INFO]
[INFO] --- tycho-p2-plugin:1.0.0:p2-metadata-default (default-p2-metadata-default) @ org.eclipse.wst.internet.cache.tests ---
[INFO]
[INFO] --- tycho-surefire-plugin:1.0.0:test (default-test) @ org.eclipse.wst.internet.cache.tests ---
[INFO] Fetching com.ibm.icu.base_58.2.0.v20170418-1837.jar.pack.gz from http://download.eclipse.org/tools/orbit/downloads/drops2/S20171130170529/repository/plugins/ (83.54kB)
[INFO] Fetching com.ibm.icu.base_58.2.0.v20170418-1837.jar.pack.gz from http://download.eclipse.org/tools/orbit/downloads/drops2/S20171130170529/repository/plugins/ (83.54kB)
[INFO] Unpacking com.ibm.icu.base_58.2.0.v20170418-1837...
[INFO] Expected eclipse log file: /jobs/genie.webtools/webtools-common_R3_10/workspace/tests/org.eclipse.wst.internet.cache.tests/target/work/data/.metadata/.log
[INFO] Command line:
        [/opt/public/common/java/oracle/jdk1.8.0_162_x64/jre/bin/java, -Dosgi.noShutdown=false, -Dosgi.os=linux, -Dosgi.ws=gtk, -Dosgi.arch=x86_64, -Dosgi.clean=true, -jar, /jobs/genie.webtools/webtools-common_R3_10/workspace/.maven/repo/p2/osgi/bundle/org.eclipse.equinox.launcher/1.5.0.v20180119-0753/org.eclipse.equinox.launcher-1.5.0.v20180119-0753.jar, -data, /jobs/genie.webtools/webtools-common_R3_10/workspace/tests/org.eclipse.wst.internet.cache.tests/target/work/data, -install, /jobs/genie.webtools/webtools-common_R3_10/workspace/tests/org.eclipse.wst.internet.cache.tests/target/work, -configuration, /jobs/genie.webtools/webtools-common_R3_10/workspace/tests/org.eclipse.wst.internet.cache.tests/target/work/configuration, -application, org.eclipse.tycho.surefire.osgibooter.headlesstest, -testproperties, /jobs/genie.webtools/webtools-common_R3_10/workspace/tests/org.eclipse.wst.internet.cache.tests/target/surefire.properties]

-------------------------------------------------------
 T E S T S
-------------------------------------------------------
Running org.eclipse.wst.internet.cache.internal.CacheTest
Tests run: 10, Failures: 0, Errors: 0, Skipped: 0, Time elapsed: 1.455 sec - in org.eclipse.wst.internet.cache.internal.CacheTest
testResultStartsWithFile(org.eclipse.wst.internet.cache.internal.CacheTest)  Time elapsed: 0.135 sec
testClearCacheWithSingleEntry(org.eclipse.wst.internet.cache.internal.CacheTest)  Time elapsed: 0.065 sec
testDeleteNullCacheEntry(org.eclipse.wst.internet.cache.internal.CacheTest)  Time elapsed: 0.066 sec
testGetResourceThatExists(org.eclipse.wst.internet.cache.internal.CacheTest)  Time elapsed: 0.064 sec
testClearCacheWithMultipleEntries(org.eclipse.wst.internet.cache.internal.CacheTest)  Time elapsed: 0.672 sec
testGetNullResource(org.eclipse.wst.internet.cache.internal.CacheTest)  Time elapsed: 0 sec
testGetNonExistantResource(org.eclipse.wst.internet.cache.internal.CacheTest)  Time elapsed: 0.049 sec
testDeleteCacheEntry(org.eclipse.wst.internet.cache.internal.CacheTest)  Time elapsed: 0.062 sec
testGetCacheEntries(org.eclipse.wst.internet.cache.internal.CacheTest)  Time elapsed: 0.313 sec
testGetInstance(org.eclipse.wst.internet.cache.internal.CacheTest)  Time elapsed: 0 sec
Running org.eclipse.wst.internet.cache.internal.CacheURIResolverExtensionTest
Tests run: 7, Failures: 0, Errors: 0, Skipped: 0, Time elapsed: 0.22 sec - in org.eclipse.wst.internet.cache.internal.CacheURIResolverExtensionTest
testAbsoluteSystemIdNullBaselocation(org.eclipse.wst.internet.cache.internal.CacheURIResolverExtensionTest)  Time elapsed: 0.092 sec
testRelativeSystemIdWillNullBaselocation(org.eclipse.wst.internet.cache.internal.CacheURIResolverExtensionTest)  Time elapsed: 0 sec
testReturnsNullWhenDisabled(org.eclipse.wst.internet.cache.internal.CacheURIResolverExtensionTest)  Time elapsed: 0 sec
testResolveNullSystemIdAndBaselocation(org.eclipse.wst.internet.cache.internal.CacheURIResolverExtensionTest)  Time elapsed: 0.001 sec
testResolveNullSystemId(org.eclipse.wst.internet.cache.internal.CacheURIResolverExtensionTest)  Time elapsed: 0 sec
testRelativeSystemId(org.eclipse.wst.internet.cache.internal.CacheURIResolverExtensionTest)  Time elapsed: 0.077 sec
testAbsoluteSystemId(org.eclipse.wst.internet.cache.internal.CacheURIResolverExtensionTest)  Time elapsed: 0.047 sec
Running org.eclipse.wst.internet.cache.internal.LicenseRegistryTest
Tests run: 6, Failures: 0, Errors: 0, Skipped: 0, Time elapsed: 0.004 sec - in org.eclipse.wst.internet.cache.internal.LicenseRegistryTest
testDisgreeToLicense(org.eclipse.wst.internet.cache.internal.LicenseRegistryTest)  Time elapsed: 0.001 sec
testAddLicenseToRegistryTwice(org.eclipse.wst.internet.cache.internal.LicenseRegistryTest)  Time elapsed: 0.001 sec
testAddLicenseToRegistry(org.eclipse.wst.internet.cache.internal.LicenseRegistryTest)  Time elapsed: 0 sec
testAgreeToLicense(org.eclipse.wst.internet.cache.internal.LicenseRegistryTest)  Time elapsed: 0 sec
testAgreeToLicenseNotInRegistry(org.eclipse.wst.internet.cache.internal.LicenseRegistryTest)  Time elapsed: 0 sec
testDisagreeToLicenseNotInRegistry(org.eclipse.wst.internet.cache.internal.LicenseRegistryTest)  Time elapsed: 0 sec
Running org.eclipse.wst.internet.cache.internal.CacheEntryTest
Tests run: 3, Failures: 0, Errors: 0, Skipped: 0, Time elapsed: 0.002 sec - in org.eclipse.wst.internet.cache.internal.CacheEntryTest
testExpiredWhenLessThanSystemTime(org.eclipse.wst.internet.cache.internal.CacheEntryTest)  Time elapsed: 0 sec
testNotExpiredWhenMinusOne(org.eclipse.wst.internet.cache.internal.CacheEntryTest)  Time elapsed: 0 sec
testNotExpiredWhenGreaterThanSystemTime(org.eclipse.wst.internet.cache.internal.CacheEntryTest)  Time elapsed: 0 sec

Results :

Tests run: 26, Failures: 0, Errors: 0, Skipped: 0

[INFO] All tests passed!
[INFO]
[INFO] --- tycho-pack200a-plugin:1.0.0:normalize (pack200-normalize) @ org.eclipse.wst.internet.cache.tests ---
[INFO] Pack200 normalizing jar /jobs/genie.webtools/webtools-common_R3_10/workspace/tests/org.eclipse.wst.internet.cache.tests/target/org.eclipse.wst.internet.cache.tests-1.0.100-SNAPSHOT.jar
[INFO]
[INFO] --- eclipse-jarsigner-plugin:1.1.4:sign (sign) @ org.eclipse.wst.internet.cache.tests ---
[INFO] Signing of nested jars of '/jobs/genie.webtools/webtools-common_R3_10/workspace/tests/org.eclipse.wst.internet.cache.tests/target/org.eclipse.wst.internet.cache.tests-1.0.100-SNAPSHOT.jar_unpacked_6283542138012230567/tests.jar' is disabled.
[INFO] Signing jar: /jobs/genie.webtools/webtools-common_R3_10/workspace/tests/org.eclipse.wst.internet.cache.tests/target/org.eclipse.wst.internet.cache.tests-1.0.100-SNAPSHOT.jar_unpacked_6283542138012230567/tests.jar
[INFO] Signing jar: /jobs/genie.webtools/webtools-common_R3_10/workspace/tests/org.eclipse.wst.internet.cache.tests/target/org.eclipse.wst.internet.cache.tests-1.0.100-SNAPSHOT.jar
[INFO] Signing jar: /jobs/genie.webtools/webtools-common_R3_10/workspace/tests/org.eclipse.wst.internet.cache.tests/target/org.eclipse.wst.internet.cache.tests-1.0.100-SNAPSHOT-sources.jar
[INFO]
[INFO] --- tycho-pack200b-plugin:1.0.0:pack (pack200-pack) @ org.eclipse.wst.internet.cache.tests ---
[INFO] Pack200 packing jar /jobs/genie.webtools/webtools-common_R3_10/workspace/tests/org.eclipse.wst.internet.cache.tests/target/org.eclipse.wst.internet.cache.tests-1.0.100-SNAPSHOT.jar
[INFO]
[INFO] --- tycho-p2-plugin:1.0.0:p2-metadata (p2-metadata) @ org.eclipse.wst.internet.cache.tests ---
[INFO] No baseline version MavenProject: org.eclipse.webtools.common:org.eclipse.wst.internet.cache.tests:1.0.100-SNAPSHOT @ /jobs/genie.webtools/webtools-common_R3_10/workspace/tests/org.eclipse.wst.internet.cache.tests/pom.xml
[INFO]
[INFO] --- maven-install-plugin:2.3.1:install (default-install) @ org.eclipse.wst.internet.cache.tests ---
[INFO] Installing /jobs/genie.webtools/webtools-common_R3_10/workspace/tests/org.eclipse.wst.internet.cache.tests/target/org.eclipse.wst.internet.cache.tests-1.0.100-SNAPSHOT.jar to <https://hudson.eclipse.org/webtools/job/webtools-common_R3_10/ws/.maven/repo/org/eclipse/webtools/common/org.eclipse.wst.internet.cache.tests/1.0.100-SNAPSHOT/org.eclipse.wst.internet.cache.tests-1.0.100-SNAPSHOT.jar>
[INFO] Installing /jobs/genie.webtools/webtools-common_R3_10/workspace/tests/org.eclipse.wst.internet.cache.tests/pom.xml to <https://hudson.eclipse.org/webtools/job/webtools-common_R3_10/ws/.maven/repo/org/eclipse/webtools/common/org.eclipse.wst.internet.cache.tests/1.0.100-SNAPSHOT/org.eclipse.wst.internet.cache.tests-1.0.100-SNAPSHOT.pom>
[INFO] Installing /jobs/genie.webtools/webtools-common_R3_10/workspace/tests/org.eclipse.wst.internet.cache.tests/target/org.eclipse.wst.internet.cache.tests-1.0.100-SNAPSHOT-sources.jar to <https://hudson.eclipse.org/webtools/job/webtools-common_R3_10/ws/.maven/repo/org/eclipse/webtools/common/org.eclipse.wst.internet.cache.tests/1.0.100-SNAPSHOT/org.eclipse.wst.internet.cache.tests-1.0.100-SNAPSHOT-sources.jar>
[INFO] Installing /jobs/genie.webtools/webtools-common_R3_10/workspace/tests/org.eclipse.wst.internet.cache.tests/target/org.eclipse.wst.internet.cache.tests-1.0.100-SNAPSHOT.jar.pack.gz to <https://hudson.eclipse.org/webtools/job/webtools-common_R3_10/ws/.maven/repo/org/eclipse/webtools/common/org.eclipse.wst.internet.cache.tests/1.0.100-SNAPSHOT/org.eclipse.wst.internet.cache.tests-1.0.100-SNAPSHOT-pack200.jar.pack.gz>
[INFO] Installing /jobs/genie.webtools/webtools-common_R3_10/workspace/tests/org.eclipse.wst.internet.cache.tests/target/p2content.xml to <https://hudson.eclipse.org/webtools/job/webtools-common_R3_10/ws/.maven/repo/org/eclipse/webtools/common/org.eclipse.wst.internet.cache.tests/1.0.100-SNAPSHOT/org.eclipse.wst.internet.cache.tests-1.0.100-SNAPSHOT-p2metadata.xml>
[INFO] Installing /jobs/genie.webtools/webtools-common_R3_10/workspace/tests/org.eclipse.wst.internet.cache.tests/target/p2artifacts.xml to <https://hudson.eclipse.org/webtools/job/webtools-common_R3_10/ws/.maven/repo/org/eclipse/webtools/common/org.eclipse.wst.internet.cache.tests/1.0.100-SNAPSHOT/org.eclipse.wst.internet.cache.tests-1.0.100-SNAPSHOT-p2artifacts.xml>
[INFO]
[INFO] --- tycho-p2-plugin:1.0.0:update-local-index (default-update-local-index) @ org.eclipse.wst.internet.cache.tests ---
[INFO]                                                                        
[INFO] ------------------------------------------------------------------------
[INFO] Skipping org.eclipse.wst.common_tests.feature
[INFO] This project has been banned from the build due to previous failures.
[INFO] ------------------------------------------------------------------------
[INFO]                                                                        
[INFO] ------------------------------------------------------------------------
[INFO] Skipping org.eclipse.webtools.common.site
[INFO] This project has been banned from the build due to previous failures.
[INFO] ------------------------------------------------------------------------
[INFO] ------------------------------------------------------------------------
[INFO] Reactor Summary:
[INFO]
[INFO] org.eclipse.webtools.common ........................ SUCCESS [01:26 min]
[INFO] org.eclipse.webtools.common.docs ................... SUCCESS [  0.047 s]
[INFO] org.eclipse.wst.common.api.doc ..................... SUCCESS [ 46.992 s]
[INFO] org.eclipse.wst.validation.doc.isv ................. SUCCESS [  2.627 s]
[INFO] org.eclipse.wst.validation.infopop ................. SUCCESS [  6.063 s]
[INFO] org.eclipse.webtools.common.features ............... SUCCESS [  0.066 s]
[INFO] org.eclipse.webtools.common.plugins ................ SUCCESS [  0.132 s]
[INFO] org.eclipse.wst.common.project.facet.core .......... SUCCESS [  8.651 s]
[INFO] org.eclipse.jst.common.project.facet.core .......... SUCCESS [ 14.265 s]
[INFO] org.eclipse.wst.common.project.facet.ui ............ SUCCESS [  6.530 s]
[INFO] org.eclipse.jst.common.project.facet.ui ............ SUCCESS [  7.481 s]
[INFO] org.eclipse.jst.common.fproj.enablement.jdt ........ SUCCESS [  2.151 s]
[INFO] org.eclipse.jst.common.fproj.enablement.jdt.sdk .... SUCCESS [  5.523 s]
[INFO] org.eclipse.jst.common.fproj.enablement.jdt.sdk .... SUCCESS [  2.372 s]
[INFO] org.eclipse.wst.common.core ........................ SUCCESS [  4.599 s]
[INFO] org.eclipse.jem.util ............................... SUCCESS [  7.105 s]
[INFO] org.eclipse.wst.common.environment ................. SUCCESS [  7.902 s]
[INFO] org.eclipse.wst.common.frameworks .................. SUCCESS [ 10.887 s]
[INFO] org.eclipse.wst.common.emf ......................... SUCCESS [  7.736 s]
[INFO] org.eclipse.wst.validation ......................... SUCCESS [  9.003 s]
[INFO] org.eclipse.wst.common.emfworkbench.integration .... SUCCESS [  8.120 s]
[INFO] org.eclipse.wst.common.uriresolver ................. SUCCESS [  3.717 s]
[INFO] org.eclipse.wst.common.modulecore .................. SUCCESS [  8.382 s]
[INFO] org.eclipse.wst.common_core.feature ................ SUCCESS [  2.513 s]
[INFO] org.eclipse.wst.common.fproj ....................... SUCCESS [  1.095 s]
[INFO] org.eclipse.wst.common.project.facet.doc.api ....... SUCCESS [  3.328 s]
[INFO] org.eclipse.wst.common.fproj.sdk ................... SUCCESS [  2.854 s]
[INFO] org.eclipse.wst.common.fproj.sdk ................... SUCCESS [  1.326 s]
[INFO] org.eclipse.wst.common.frameworks.ui ............... SUCCESS [  5.102 s]
[INFO] org.eclipse.wst.common.modulecore.ui ............... SUCCESS [  4.926 s]
[INFO] org.eclipse.wst.common.snippets .................... SUCCESS [  5.312 s]
[INFO] org.eclipse.wst.common.ui .......................... SUCCESS [  8.701 s]
[INFO] org.eclipse.wst.common.infopop ..................... SUCCESS [  4.726 s]
[INFO] org.eclipse.wst.internet.cache ..................... SUCCESS [  4.939 s]
[INFO] org.eclipse.wst.validation.ui ...................... SUCCESS [  9.971 s]
[INFO] org.eclipse.wst.common_ui.feature .................. SUCCESS [  3.496 s]
[INFO] org.eclipse.wst.common_sdk.feature ................. SUCCESS [  2.469 s]
[INFO] org.eclipse.webtools.common.tests .................. SUCCESS [  0.394 s]
[INFO] org.eclipse.wst.common.project.facet.core.tests .... SUCCESS [ 14.838 s]
[INFO] org.eclipse.wst.common.project.facet.ui.tests ...... SUCCESS [  5.982 s]
[INFO] org.eclipse.wst.common.snippets.tests .............. FAILURE [  1.362 s]
[INFO] org.eclipse.wst.common.tests.collector ............. SUCCESS [  9.064 s]
[INFO] org.eclipse.wst.common.uriresolver.tests ........... SUCCESS [  8.100 s]
[INFO] org.eclipse.wst.common.tests ....................... SUCCESS [ 22.480 s]
[INFO] org.eclipse.wst.common.tests.ui .................... SUCCESS [  3.634 s]
[INFO] org.eclipse.wst.common.tests.validation ............ SUCCESS [01:06 min]
[INFO] org.eclipse.wst.common.tests.validation.guard ...... SUCCESS [  2.748 s]
[INFO] org.eclipse.wst.internet.cache.tests ............... SUCCESS [ 10.701 s]
[INFO] org.eclipse.wst.common_tests.feature ............... SKIPPED
[INFO] org.eclipse.webtools.common.site ................... SKIPPED
[INFO] ------------------------------------------------------------------------
[INFO] BUILD FAILURE
[INFO] ------------------------------------------------------------------------
[INFO] Total time: 13:35 min
[INFO] Finished at: 2018-01-28T15:07:10-05:00
[INFO] Final Memory: 155M/4046M
[INFO] ------------------------------------------------------------------------
[INFO] o.h.m.e.h.MavenExecutionResultHandler - Build failed with exception(s)
[INFO] o.h.m.e.h.MavenExecutionResultHandler - [1] org.apache.maven.lifecycle.LifecycleExecutionException: Failed to execute goal org.eclipse.tycho:tycho-surefire-plugin:1.0.0:test (default-test) on project org.eclipse.wst.common.snippets.tests: Execution default-test of goal org.eclipse.tycho:tycho-surefire-plugin:1.0.0:test failed: Cannot resolve dependencies of MavenProject: org.eclipse.webtools.common:org.eclipse.wst.common.snippets.tests:1.0.400-SNAPSHOT @ /jobs/genie.webtools/webtools-common_R3_10/workspace/tests/org.eclipse.wst.common.snippets.tests/pom.xml
[DEBUG] Closing connection to remote
[ERROR] Failed to execute goal org.eclipse.tycho:tycho-surefire-plugin:1.0.0:test (default-test) on project org.eclipse.wst.common.snippets.tests: Execution default-test of goal org.eclipse.tycho:tycho-surefire-plugin:1.0.0:test failed: Cannot resolve dependencies of MavenProject: org.eclipse.webtools.common:org.eclipse.wst.common.snippets.tests:1.0.400-SNAPSHOT @ /jobs/genie.webtools/webtools-common_R3_10/workspace/tests/org.eclipse.wst.common.snippets.tests/pom.xml: See log for details -> [Help 1]
[ERROR]
[ERROR] To see the full stack trace of the errors, re-run Maven with the -e switch.
[ERROR] Re-run Maven using the -X switch to enable full debug logging.
[ERROR]
[ERROR] For more information about the errors and possible solutions, please read the following articles:
[ERROR] [Help 1] http://cwiki.apache.org/confluence/display/MAVEN/PluginExecutionException
[ERROR]
[ERROR] After correcting the problems, you can resume the build with the command
[ERROR]   mvn <goals> -rf :org.eclipse.wst.common.snippets.tests
[DEBUG] Waiting for process to finish
[DEBUG] Result: 1
Taking screenshot.
[workspace] $ import -window root -display :456 screenshot.jpg
Terminating xvnc.
Recording test results
Archiving artifacts

--
This message is automatically generated by Hudson.
For more information on Hudson, see: http://hudson-ci.org/
_______________________________________________
wtp-releng mailing list
[hidden email]
To change your delivery options, retrieve your password, or unsubscribe from this list, visit
https://dev.eclipse.org/mailman/listinfo/wtp-releng
Reply | Threaded
Open this post in threaded view
|

[Hudson] Hudson build is back to normal : webtools-common_R3_10 #37

hudsonbuild
See <https://hudson.eclipse.org/webtools/job/webtools-common_R3_10/37/>


--
This message is automatically generated by Hudson.
For more information on Hudson, see: http://hudson-ci.org/
_______________________________________________
wtp-releng mailing list
[hidden email]
To change your delivery options, retrieve your password, or unsubscribe from this list, visit
https://dev.eclipse.org/mailman/listinfo/wtp-releng