[Hudson] Build failed in Hudson: webtools-servertools_R3_10 #31

classic Classic list List threaded Threaded
2 messages Options
Reply | Threaded
Open this post in threaded view
|

[Hudson] Build failed in Hudson: webtools-servertools_R3_10 #31

hudsonbuild
See <https://hudson.eclipse.org/webtools/job/webtools-servertools_R3_10/31/>

------------------------------------------
[...truncated 13007 lines...]
[INFO] skip non existing resourceDirectory /jobs/genie.webtools/webtools-servertools_R3_10/workspace/tests/org.eclipse.jst.server.ui.tests/src/test/resources
[INFO]
[INFO] --- tycho-source-plugin:1.1.0-SNAPSHOT:plugin-source (plugin-source) @ org.eclipse.jst.server.ui.tests ---
[WARNING] bundle localization file /jobs/genie.webtools/webtools-servertools_R3_10/workspace/tests/org.eclipse.jst.server.ui.tests/plugin.properties not found
[INFO] Building jar: /jobs/genie.webtools/webtools-servertools_R3_10/workspace/tests/org.eclipse.jst.server.ui.tests/target/org.eclipse.jst.server.ui.tests-1.1.100-SNAPSHOT-sources.jar
[INFO]
[INFO] --- target-platform-configuration:1.1.0-SNAPSHOT:target-platform (default-target-platform) @ org.eclipse.jst.server.ui.tests ---
[INFO]
[INFO] --- tycho-packaging-plugin:1.1.0-SNAPSHOT:package-plugin (default-package-plugin) @ org.eclipse.jst.server.ui.tests ---
[INFO] Building jar: /jobs/genie.webtools/webtools-servertools_R3_10/workspace/tests/org.eclipse.jst.server.ui.tests/tests.jar
[INFO] Building jar: /jobs/genie.webtools/webtools-servertools_R3_10/workspace/tests/org.eclipse.jst.server.ui.tests/target/org.eclipse.jst.server.ui.tests-1.1.100-SNAPSHOT.jar
[INFO]
[INFO] --- tycho-p2-plugin:1.1.0-SNAPSHOT:p2-metadata-default (default-p2-metadata-default) @ org.eclipse.jst.server.ui.tests ---
[INFO]
[INFO] --- tycho-surefire-plugin:1.1.0-SNAPSHOT:test (default-test) @ org.eclipse.jst.server.ui.tests ---
[INFO] Expected eclipse log file: /jobs/genie.webtools/webtools-servertools_R3_10/workspace/tests/org.eclipse.jst.server.ui.tests/target/work/data/.metadata/.log
[INFO] Command line:
        [/opt/public/common/java/oracle/jdk1.8.0_162_x64/jre/bin/java, -Dosgi.noShutdown=false, -Dosgi.os=linux, -Dosgi.ws=gtk, -Dosgi.arch=x86_64, -Dosgi.clean=true, -jar, /jobs/genie.webtools/webtools-servertools_R3_10/workspace/.maven/repo/p2/osgi/bundle/org.eclipse.equinox.launcher/1.5.0.v20180119-0753/org.eclipse.equinox.launcher-1.5.0.v20180119-0753.jar, -data, /jobs/genie.webtools/webtools-servertools_R3_10/workspace/tests/org.eclipse.jst.server.ui.tests/target/work/data, -install, /jobs/genie.webtools/webtools-servertools_R3_10/workspace/tests/org.eclipse.jst.server.ui.tests/target/work, -configuration, /jobs/genie.webtools/webtools-servertools_R3_10/workspace/tests/org.eclipse.jst.server.ui.tests/target/work/configuration, -application, org.eclipse.tycho.surefire.osgibooter.uitest, -testproperties, /jobs/genie.webtools/webtools-servertools_R3_10/workspace/tests/org.eclipse.jst.server.ui.tests/target/surefire.properties]
Picked up JAVA_TOOL_OPTIONS: -Xmx2G -Djava.io.tmpdir=/tmp/genie.webtools

-------------------------------------------------------
 T E S T S
-------------------------------------------------------
Running org.eclipse.jst.server.ui.tests.AllTests
Tests run: 4, Failures: 0, Errors: 0, Skipped: 0, Time elapsed: 2.526 sec - in org.eclipse.jst.server.ui.tests.AllTests
testPluginExists(org.eclipse.jst.server.ui.tests.ExistenceTest)  Time elapsed: 0.003 sec
testContextExists(org.eclipse.jst.server.ui.tests.ExistenceTest)  Time elapsed: 0 sec
testLabelProvider(org.eclipse.jst.server.ui.tests.LabelProviderTest)  Time elapsed: 0.027 sec
testImageResource2(org.eclipse.jst.server.ui.tests.ImageResourceTest)  Time elapsed: 2.474 sec

Results :

Tests run: 4, Failures: 0, Errors: 0, Skipped: 0

[INFO] All tests passed!
[INFO]
[INFO] --- tycho-pack200a-plugin:1.1.0-SNAPSHOT:normalize (pack200-normalize) @ org.eclipse.jst.server.ui.tests ---
[INFO] Pack200 normalizing jar /jobs/genie.webtools/webtools-servertools_R3_10/workspace/tests/org.eclipse.jst.server.ui.tests/target/org.eclipse.jst.server.ui.tests-1.1.100-SNAPSHOT.jar
Picked up JAVA_TOOL_OPTIONS: -Xmx2G -Djava.io.tmpdir=/tmp/genie.webtools
Picked up JAVA_TOOL_OPTIONS: -Xmx2G -Djava.io.tmpdir=/tmp/genie.webtools
[INFO]
[INFO] --- eclipse-jarsigner-plugin:1.1.4:sign (sign) @ org.eclipse.jst.server.ui.tests ---
[INFO] Signing of nested jars of '/jobs/genie.webtools/webtools-servertools_R3_10/workspace/tests/org.eclipse.jst.server.ui.tests/target/org.eclipse.jst.server.ui.tests-1.1.100-SNAPSHOT.jar_unpacked_3545967636459205218/tests.jar' is disabled.
[INFO] Signing jar: /jobs/genie.webtools/webtools-servertools_R3_10/workspace/tests/org.eclipse.jst.server.ui.tests/target/org.eclipse.jst.server.ui.tests-1.1.100-SNAPSHOT.jar_unpacked_3545967636459205218/tests.jar
[INFO] Signing jar: /jobs/genie.webtools/webtools-servertools_R3_10/workspace/tests/org.eclipse.jst.server.ui.tests/target/org.eclipse.jst.server.ui.tests-1.1.100-SNAPSHOT.jar
[INFO] Signing jar: /jobs/genie.webtools/webtools-servertools_R3_10/workspace/tests/org.eclipse.jst.server.ui.tests/target/org.eclipse.jst.server.ui.tests-1.1.100-SNAPSHOT-sources.jar
[INFO]
[INFO] --- tycho-pack200b-plugin:1.1.0-SNAPSHOT:pack (pack200-pack) @ org.eclipse.jst.server.ui.tests ---
[INFO] Pack200 packing jar /jobs/genie.webtools/webtools-servertools_R3_10/workspace/tests/org.eclipse.jst.server.ui.tests/target/org.eclipse.jst.server.ui.tests-1.1.100-SNAPSHOT.jar
Picked up JAVA_TOOL_OPTIONS: -Xmx2G -Djava.io.tmpdir=/tmp/genie.webtools
[INFO]
[INFO] --- tycho-p2-plugin:1.1.0-SNAPSHOT:p2-metadata (p2-metadata) @ org.eclipse.jst.server.ui.tests ---
[INFO] No baseline version MavenProject: org.eclipse.webtools.servertools:org.eclipse.jst.server.ui.tests:1.1.100-SNAPSHOT @ /jobs/genie.webtools/webtools-servertools_R3_10/workspace/tests/org.eclipse.jst.server.ui.tests/pom.xml
[INFO]
[INFO] --- maven-install-plugin:2.3.1:install (default-install) @ org.eclipse.jst.server.ui.tests ---
[INFO] Installing /jobs/genie.webtools/webtools-servertools_R3_10/workspace/tests/org.eclipse.jst.server.ui.tests/target/org.eclipse.jst.server.ui.tests-1.1.100-SNAPSHOT.jar to <https://hudson.eclipse.org/webtools/job/webtools-servertools_R3_10/ws/.maven/repo/org/eclipse/webtools/servertools/org.eclipse.jst.server.ui.tests/1.1.100-SNAPSHOT/org.eclipse.jst.server.ui.tests-1.1.100-SNAPSHOT.jar>
[INFO] Installing /jobs/genie.webtools/webtools-servertools_R3_10/workspace/tests/org.eclipse.jst.server.ui.tests/pom.xml to <https://hudson.eclipse.org/webtools/job/webtools-servertools_R3_10/ws/.maven/repo/org/eclipse/webtools/servertools/org.eclipse.jst.server.ui.tests/1.1.100-SNAPSHOT/org.eclipse.jst.server.ui.tests-1.1.100-SNAPSHOT.pom>
[INFO] Installing /jobs/genie.webtools/webtools-servertools_R3_10/workspace/tests/org.eclipse.jst.server.ui.tests/target/org.eclipse.jst.server.ui.tests-1.1.100-SNAPSHOT-sources.jar to <https://hudson.eclipse.org/webtools/job/webtools-servertools_R3_10/ws/.maven/repo/org/eclipse/webtools/servertools/org.eclipse.jst.server.ui.tests/1.1.100-SNAPSHOT/org.eclipse.jst.server.ui.tests-1.1.100-SNAPSHOT-sources.jar>
[INFO] Installing /jobs/genie.webtools/webtools-servertools_R3_10/workspace/tests/org.eclipse.jst.server.ui.tests/target/org.eclipse.jst.server.ui.tests-1.1.100-SNAPSHOT.jar.pack.gz to <https://hudson.eclipse.org/webtools/job/webtools-servertools_R3_10/ws/.maven/repo/org/eclipse/webtools/servertools/org.eclipse.jst.server.ui.tests/1.1.100-SNAPSHOT/org.eclipse.jst.server.ui.tests-1.1.100-SNAPSHOT-pack200.jar.pack.gz>
[INFO] Installing /jobs/genie.webtools/webtools-servertools_R3_10/workspace/tests/org.eclipse.jst.server.ui.tests/target/p2content.xml to <https://hudson.eclipse.org/webtools/job/webtools-servertools_R3_10/ws/.maven/repo/org/eclipse/webtools/servertools/org.eclipse.jst.server.ui.tests/1.1.100-SNAPSHOT/org.eclipse.jst.server.ui.tests-1.1.100-SNAPSHOT-p2metadata.xml>
[INFO] Installing /jobs/genie.webtools/webtools-servertools_R3_10/workspace/tests/org.eclipse.jst.server.ui.tests/target/p2artifacts.xml to <https://hudson.eclipse.org/webtools/job/webtools-servertools_R3_10/ws/.maven/repo/org/eclipse/webtools/servertools/org.eclipse.jst.server.ui.tests/1.1.100-SNAPSHOT/org.eclipse.jst.server.ui.tests-1.1.100-SNAPSHOT-p2artifacts.xml>
[INFO]
[INFO] --- tycho-p2-plugin:1.1.0-SNAPSHOT:update-local-index (default-update-local-index) @ org.eclipse.jst.server.ui.tests ---
[INFO]
[INFO] ------------------------------------------------------------------------
[INFO] Skipping org.eclipse.wst.internet.monitor.ui.tests
[INFO] This project has been banned from the build due to previous failures.
[INFO] ------------------------------------------------------------------------
[INFO]
[INFO] ------------------------------------------------------------------------
[INFO] Building org.eclipse.jst.server_tests.feature 3.2.300-SNAPSHOT
[INFO] ------------------------------------------------------------------------
[INFO]
[INFO] --- maven-clean-plugin:2.5:clean (default-clean) @ org.eclipse.jst.server_tests.feature ---
[INFO]
[INFO] --- tycho-packaging-plugin:1.1.0-SNAPSHOT:build-qualifier-aggregator (default-build-qualifier-aggregator) @ org.eclipse.jst.server_tests.feature ---
[INFO] The project's OSGi version is 3.2.300.v201710101758
[INFO]
[INFO] --- tycho-packaging-plugin:1.1.0-SNAPSHOT:validate-id (default-validate-id) @ org.eclipse.jst.server_tests.feature ---
[INFO]
[INFO] --- tycho-packaging-plugin:1.1.0-SNAPSHOT:validate-version (default-validate-version) @ org.eclipse.jst.server_tests.feature ---
[INFO]
[INFO] --- build-helper-maven-plugin:3.0.0:regex-property (regex-property) @ org.eclipse.jst.server_tests.feature ---
[INFO]
[INFO] --- tycho-source-plugin:1.1.0-SNAPSHOT:plugin-source (plugin-source) @ org.eclipse.jst.server_tests.feature ---
[INFO]
[INFO] --- target-platform-configuration:1.1.0-SNAPSHOT:target-platform (default-target-platform) @ org.eclipse.jst.server_tests.feature ---
[INFO]
[INFO] --- tycho-packaging-plugin:1.1.0-SNAPSHOT:package-feature (default-package-feature) @ org.eclipse.jst.server_tests.feature ---
[INFO] Building jar: /jobs/genie.webtools/webtools-servertools_R3_10/workspace/features/org.eclipse.jst.server_tests.feature/target/org.eclipse.jst.server_tests.feature-3.2.300-SNAPSHOT.jar
[INFO]
[INFO] --- tycho-p2-plugin:1.1.0-SNAPSHOT:p2-metadata-default (default-p2-metadata-default) @ org.eclipse.jst.server_tests.feature ---
[INFO]
[INFO] --- tycho-p2-plugin:1.1.0-SNAPSHOT:feature-p2-metadata (default-feature-p2-metadata) @ org.eclipse.jst.server_tests.feature ---
[INFO]
[INFO] --- tycho-pack200a-plugin:1.1.0-SNAPSHOT:normalize (pack200-normalize) @ org.eclipse.jst.server_tests.feature ---
[INFO]
[INFO] --- eclipse-jarsigner-plugin:1.1.4:sign (sign) @ org.eclipse.jst.server_tests.feature ---
[INFO] Signing jar: /jobs/genie.webtools/webtools-servertools_R3_10/workspace/features/org.eclipse.jst.server_tests.feature/target/org.eclipse.jst.server_tests.feature-3.2.300-SNAPSHOT.jar
[INFO]
[INFO] --- tycho-pack200b-plugin:1.1.0-SNAPSHOT:pack (pack200-pack) @ org.eclipse.jst.server_tests.feature ---
[INFO]
[INFO] --- tycho-p2-plugin:1.1.0-SNAPSHOT:p2-metadata (p2-metadata) @ org.eclipse.jst.server_tests.feature ---
[INFO] No baseline version MavenProject: org.eclipse.webtools.servertools:org.eclipse.jst.server_tests.feature:3.2.300-SNAPSHOT @ /jobs/genie.webtools/webtools-servertools_R3_10/workspace/features/org.eclipse.jst.server_tests.feature/pom.xml
[INFO]
[INFO] --- maven-install-plugin:2.3.1:install (default-install) @ org.eclipse.jst.server_tests.feature ---
[INFO] Installing /jobs/genie.webtools/webtools-servertools_R3_10/workspace/features/org.eclipse.jst.server_tests.feature/target/org.eclipse.jst.server_tests.feature-3.2.300-SNAPSHOT.jar to <https://hudson.eclipse.org/webtools/job/webtools-servertools_R3_10/ws/.maven/repo/org/eclipse/webtools/servertools/org.eclipse.jst.server_tests.feature/3.2.300-SNAPSHOT/org.eclipse.jst.server_tests.feature-3.2.300-SNAPSHOT.jar>
[INFO] Installing /jobs/genie.webtools/webtools-servertools_R3_10/workspace/features/org.eclipse.jst.server_tests.feature/pom.xml to <https://hudson.eclipse.org/webtools/job/webtools-servertools_R3_10/ws/.maven/repo/org/eclipse/webtools/servertools/org.eclipse.jst.server_tests.feature/3.2.300-SNAPSHOT/org.eclipse.jst.server_tests.feature-3.2.300-SNAPSHOT.pom>
[INFO] Installing /jobs/genie.webtools/webtools-servertools_R3_10/workspace/features/org.eclipse.jst.server_tests.feature/target/p2content.xml to <https://hudson.eclipse.org/webtools/job/webtools-servertools_R3_10/ws/.maven/repo/org/eclipse/webtools/servertools/org.eclipse.jst.server_tests.feature/3.2.300-SNAPSHOT/org.eclipse.jst.server_tests.feature-3.2.300-SNAPSHOT-p2metadata.xml>
[INFO] Installing /jobs/genie.webtools/webtools-servertools_R3_10/workspace/features/org.eclipse.jst.server_tests.feature/target/p2artifacts.xml to <https://hudson.eclipse.org/webtools/job/webtools-servertools_R3_10/ws/.maven/repo/org/eclipse/webtools/servertools/org.eclipse.jst.server_tests.feature/3.2.300-SNAPSHOT/org.eclipse.jst.server_tests.feature-3.2.300-SNAPSHOT-p2artifacts.xml>
[INFO]
[INFO] --- tycho-p2-plugin:1.1.0-SNAPSHOT:update-local-index (default-update-local-index) @ org.eclipse.jst.server_tests.feature ---
[INFO]
[INFO] ------------------------------------------------------------------------
[INFO] Building org.eclipse.jst.server_adapters.ext_tests.feature 3.3.201-SNAPSHOT
[INFO] ------------------------------------------------------------------------
[INFO]
[INFO] --- maven-clean-plugin:2.5:clean (default-clean) @ org.eclipse.jst.server_adapters.ext_tests.feature ---
[INFO]
[INFO] --- tycho-packaging-plugin:1.1.0-SNAPSHOT:build-qualifier-aggregator (default-build-qualifier-aggregator) @ org.eclipse.jst.server_adapters.ext_tests.feature ---
[INFO] The project's OSGi version is 3.3.201.v201802020432
[INFO]
[INFO] --- tycho-packaging-plugin:1.1.0-SNAPSHOT:validate-id (default-validate-id) @ org.eclipse.jst.server_adapters.ext_tests.feature ---
[INFO]
[INFO] --- tycho-packaging-plugin:1.1.0-SNAPSHOT:validate-version (default-validate-version) @ org.eclipse.jst.server_adapters.ext_tests.feature ---
[INFO]
[INFO] --- build-helper-maven-plugin:3.0.0:regex-property (regex-property) @ org.eclipse.jst.server_adapters.ext_tests.feature ---
[INFO]
[INFO] --- tycho-source-plugin:1.1.0-SNAPSHOT:plugin-source (plugin-source) @ org.eclipse.jst.server_adapters.ext_tests.feature ---
[INFO]
[INFO] --- target-platform-configuration:1.1.0-SNAPSHOT:target-platform (default-target-platform) @ org.eclipse.jst.server_adapters.ext_tests.feature ---
[INFO]
[INFO] --- tycho-packaging-plugin:1.1.0-SNAPSHOT:package-feature (default-package-feature) @ org.eclipse.jst.server_adapters.ext_tests.feature ---
[INFO] Building jar: /jobs/genie.webtools/webtools-servertools_R3_10/workspace/features/org.eclipse.jst.server_adapters.ext_tests.feature/target/org.eclipse.jst.server_adapters.ext_tests.feature-3.3.201-SNAPSHOT.jar
[INFO]
[INFO] --- tycho-p2-plugin:1.1.0-SNAPSHOT:p2-metadata-default (default-p2-metadata-default) @ org.eclipse.jst.server_adapters.ext_tests.feature ---
[INFO]
[INFO] --- tycho-p2-plugin:1.1.0-SNAPSHOT:feature-p2-metadata (default-feature-p2-metadata) @ org.eclipse.jst.server_adapters.ext_tests.feature ---
[INFO]
[INFO] --- tycho-pack200a-plugin:1.1.0-SNAPSHOT:normalize (pack200-normalize) @ org.eclipse.jst.server_adapters.ext_tests.feature ---
[INFO]
[INFO] --- eclipse-jarsigner-plugin:1.1.4:sign (sign) @ org.eclipse.jst.server_adapters.ext_tests.feature ---
[INFO] Signing jar: /jobs/genie.webtools/webtools-servertools_R3_10/workspace/features/org.eclipse.jst.server_adapters.ext_tests.feature/target/org.eclipse.jst.server_adapters.ext_tests.feature-3.3.201-SNAPSHOT.jar
[INFO]
[INFO] --- tycho-pack200b-plugin:1.1.0-SNAPSHOT:pack (pack200-pack) @ org.eclipse.jst.server_adapters.ext_tests.feature ---
[INFO]
[INFO] --- tycho-p2-plugin:1.1.0-SNAPSHOT:p2-metadata (p2-metadata) @ org.eclipse.jst.server_adapters.ext_tests.feature ---
[INFO] No baseline version MavenProject: org.eclipse.webtools.servertools:org.eclipse.jst.server_adapters.ext_tests.feature:3.3.201-SNAPSHOT @ /jobs/genie.webtools/webtools-servertools_R3_10/workspace/features/org.eclipse.jst.server_adapters.ext_tests.feature/pom.xml
[INFO]
[INFO] --- maven-install-plugin:2.3.1:install (default-install) @ org.eclipse.jst.server_adapters.ext_tests.feature ---
[INFO] Installing /jobs/genie.webtools/webtools-servertools_R3_10/workspace/features/org.eclipse.jst.server_adapters.ext_tests.feature/target/org.eclipse.jst.server_adapters.ext_tests.feature-3.3.201-SNAPSHOT.jar to <https://hudson.eclipse.org/webtools/job/webtools-servertools_R3_10/ws/.maven/repo/org/eclipse/webtools/servertools/org.eclipse.jst.server_adapters.ext_tests.feature/3.3.201-SNAPSHOT/org.eclipse.jst.server_adapters.ext_tests.feature-3.3.201-SNAPSHOT.jar>
[INFO] Installing /jobs/genie.webtools/webtools-servertools_R3_10/workspace/features/org.eclipse.jst.server_adapters.ext_tests.feature/pom.xml to <https://hudson.eclipse.org/webtools/job/webtools-servertools_R3_10/ws/.maven/repo/org/eclipse/webtools/servertools/org.eclipse.jst.server_adapters.ext_tests.feature/3.3.201-SNAPSHOT/org.eclipse.jst.server_adapters.ext_tests.feature-3.3.201-SNAPSHOT.pom>
[INFO] Installing /jobs/genie.webtools/webtools-servertools_R3_10/workspace/features/org.eclipse.jst.server_adapters.ext_tests.feature/target/p2content.xml to <https://hudson.eclipse.org/webtools/job/webtools-servertools_R3_10/ws/.maven/repo/org/eclipse/webtools/servertools/org.eclipse.jst.server_adapters.ext_tests.feature/3.3.201-SNAPSHOT/org.eclipse.jst.server_adapters.ext_tests.feature-3.3.201-SNAPSHOT-p2metadata.xml>
[INFO] Installing /jobs/genie.webtools/webtools-servertools_R3_10/workspace/features/org.eclipse.jst.server_adapters.ext_tests.feature/target/p2artifacts.xml to <https://hudson.eclipse.org/webtools/job/webtools-servertools_R3_10/ws/.maven/repo/org/eclipse/webtools/servertools/org.eclipse.jst.server_adapters.ext_tests.feature/3.3.201-SNAPSHOT/org.eclipse.jst.server_adapters.ext_tests.feature-3.3.201-SNAPSHOT-p2artifacts.xml>
[INFO]
[INFO] --- tycho-p2-plugin:1.1.0-SNAPSHOT:update-local-index (default-update-local-index) @ org.eclipse.jst.server_adapters.ext_tests.feature ---
[INFO]
[INFO] ------------------------------------------------------------------------
[INFO] Skipping org.eclipse.wst.server_tests.feature
[INFO] This project has been banned from the build due to previous failures.
[INFO] ------------------------------------------------------------------------
[INFO]
[INFO] ------------------------------------------------------------------------
[INFO] Skipping org.eclipse.webtools.servertools.site.integration
[INFO] This project has been banned from the build due to previous failures.
[INFO] ------------------------------------------------------------------------
[INFO] ------------------------------------------------------------------------
[INFO] Reactor Summary:
[INFO]
[INFO] org.eclipse.webtools.servertools ................... SUCCESS [01:03 min]
[INFO] org.eclipse.wst.server.discovery ................... SUCCESS [01:25 min]
[INFO] org.eclipse.wst.server.core ........................ SUCCESS [01:31 min]
[INFO] org.eclipse.jst.server.core ........................ SUCCESS [ 14.817 s]
[INFO] org.eclipse.jst.server.generic.core ................ SUCCESS [ 44.127 s]
[INFO] org.eclipse.wst.internet.monitor.core .............. SUCCESS [ 10.596 s]
[INFO] org.eclipse.wst.server.ui .......................... SUCCESS [01:19 min]
[INFO] org.eclipse.jst.server.generic.ui .................. SUCCESS [  3.373 s]
[INFO] org.eclipse.jst.server.ui .......................... SUCCESS [  3.522 s]
[INFO] org.eclipse.jst.server.generic.jonas ............... SUCCESS [  3.572 s]
[INFO] org.eclipse.jst.server.tomcat.core ................. SUCCESS [ 15.182 s]
[INFO] org.eclipse.jst.server.tomcat.ui ................... SUCCESS [  4.591 s]
[INFO] org.eclipse.jst.server_adapters.ext.feature ........ SUCCESS [  2.849 s]
[INFO] org.eclipse.jst.server_adapters.ext.sdk.feature .... SUCCESS [  1.288 s]
[INFO] org.eclipse.jst.server.preview.adapter ............. SUCCESS [  3.718 s]
[INFO] org.eclipse.jst.server_adapters.feature ............ SUCCESS [  2.447 s]
[INFO] org.eclipse.jst.server_adapters.sdk.feature ........ SUCCESS [  2.552 s]
[INFO] org.eclipse.jst.server_core.feature ................ SUCCESS [ 58.653 s]
[INFO] org.eclipse.jst.server.ui.doc.user ................. SUCCESS [ 38.951 s]
[INFO] org.eclipse.jst.server_userdoc.feature ............. SUCCESS [  3.727 s]
[INFO] org.eclipse.jst.server.ui.infopop .................. SUCCESS [  4.348 s]
[INFO] org.eclipse.jst.server_ui.feature .................. SUCCESS [  4.252 s]
[INFO] org.eclipse.jst.server_sdk.feature ................. SUCCESS [  1.371 s]
[INFO] org.eclipse.wst.server.http.core ................... SUCCESS [01:26 min]
[INFO] org.eclipse.wst.server.http.ui ..................... SUCCESS [01:06 min]
[INFO] org.eclipse.wst.server.preview ..................... SUCCESS [ 35.893 s]
[INFO] org.eclipse.wst.server.preview.adapter ............. SUCCESS [ 19.857 s]
[INFO] org.eclipse.wst.server_adapters.feature ............ SUCCESS [  7.521 s]
[INFO] org.eclipse.wst.server_adapters.sdk.feature ........ SUCCESS [  1.561 s]
[INFO] org.eclipse.wst.server_core.feature ................ SUCCESS [ 25.268 s]
[INFO] org.eclipse.wst.internet.monitor.ui ................ FAILURE [03:15 min]
[INFO] org.eclipse.wst.server.ui.doc.user ................. SUCCESS [ 28.698 s]
[INFO] org.eclipse.wst.server_userdoc.feature ............. SUCCESS [  2.572 s]
[INFO] org.eclipse.wst.server.ui.infopop .................. SUCCESS [  4.069 s]
[INFO] org.eclipse.wst.server_ui.feature .................. SKIPPED
[INFO] org.eclipse.servertools.doc.isv .................... SUCCESS [  4.815 s]
[INFO] org.eclipse.wst.server_sdk.feature ................. SKIPPED
[INFO] org.eclipse.wst.internet.monitor.core.tests ........ SUCCESS [ 10.248 s]
[INFO] org.eclipse.wst.server.core.tests .................. SUCCESS [ 13.772 s]
[INFO] org.eclipse.wst.server.http.core.tests ............. SUCCESS [  9.562 s]
[INFO] org.eclipse.wst.server.util.tests .................. SUCCESS [  3.062 s]
[INFO] org.eclipse.webtools.servertools.site .............. SKIPPED
[INFO] org.eclipse.jst.server.core.tests .................. SUCCESS [ 40.577 s]
[INFO] org.eclipse.jst.server.generic.tests ............... SUCCESS [04:06 min]
[INFO] org.eclipse.jst.server.tomcat.core.tests ........... SUCCESS [02:54 min]
[INFO] org.eclipse.wst.server.ui.tests .................... SUCCESS [01:15 min]
[INFO] org.eclipse.jst.server.tomcat.ui.tests ............. SUCCESS [01:16 min]
[INFO] org.eclipse.jst.server.ui.tests .................... SUCCESS [06:40 min]
[INFO] org.eclipse.wst.internet.monitor.ui.tests .......... SKIPPED
[INFO] org.eclipse.jst.server_tests.feature ............... SUCCESS [  1.563 s]
[INFO] org.eclipse.jst.server_adapters.ext_tests.feature .. SUCCESS [ 18.715 s]
[INFO] org.eclipse.wst.server_tests.feature ............... SKIPPED
[INFO] org.eclipse.webtools.servertools.site.integration .. SKIPPED
[INFO] ------------------------------------------------------------------------
[INFO] BUILD FAILURE
[INFO] ------------------------------------------------------------------------
[INFO] Total time: 44:29 min
[INFO] Finished at: 2018-02-02T00:16:48-05:00
[INFO] Final Memory: 178M/1132M
[INFO] ------------------------------------------------------------------------
[INFO] o.h.m.e.h.MavenExecutionResultHandler - Build failed with exception(s)
[INFO] o.h.m.e.h.MavenExecutionResultHandler - [1] org.apache.maven.lifecycle.LifecycleExecutionException: Failed to execute goal org.eclipse.tycho.extras:tycho-pack200a-plugin:1.1.0-SNAPSHOT:normalize (pack200-normalize) on project org.eclipse.wst.internet.monitor.ui: Execution pack200-normalize of goal org.eclipse.tycho.extras:tycho-pack200a-plugin:1.1.0-SNAPSHOT:normalize failed: Could not execute pack200, see log for details.
[DEBUG] Closing connection to remote
[ERROR] Failed to execute goal org.eclipse.tycho.extras:tycho-pack200a-plugin:1.1.0-SNAPSHOT:normalize (pack200-normalize) on project org.eclipse.wst.internet.monitor.ui: Execution pack200-normalize of goal org.eclipse.tycho.extras:tycho-pack200a-plugin:1.1.0-SNAPSHOT:normalize failed: Could not execute pack200, see log for details. Error while executing external command, process killed. Process timeout out after 100 seconds -> [Help 1]
[ERROR]
[ERROR] To see the full stack trace of the errors, re-run Maven with the -e switch.
[ERROR] Re-run Maven using the -X switch to enable full debug logging.
[ERROR]
[ERROR] For more information about the errors and possible solutions, please read the following articles:
[ERROR] [Help 1] http://cwiki.apache.org/confluence/display/MAVEN/PluginExecutionException
[ERROR]
[ERROR] After correcting the problems, you can resume the build with the command
[ERROR]   mvn <goals> -rf :org.eclipse.wst.internet.monitor.ui
[DEBUG] Waiting for process to finish
[DEBUG] Result: 1
Taking screenshot.
[workspace] $ import -window root -display :457 screenshot.jpg
Terminating xvnc.
Recording test results
Archiving artifacts

--
This message is automatically generated by Hudson.
For more information on Hudson, see: http://hudson-ci.org/
_______________________________________________
wtp-releng mailing list
[hidden email]
To change your delivery options, retrieve your password, or unsubscribe from this list, visit
https://dev.eclipse.org/mailman/listinfo/wtp-releng
Reply | Threaded
Open this post in threaded view
|

[Hudson] Hudson build is back to normal : webtools-servertools_R3_10 #32

hudsonbuild
See <https://hudson.eclipse.org/webtools/job/webtools-servertools_R3_10/32/changes>


--
This message is automatically generated by Hudson.
For more information on Hudson, see: http://hudson-ci.org/
_______________________________________________
wtp-releng mailing list
[hidden email]
To change your delivery options, retrieve your password, or unsubscribe from this list, visit
https://dev.eclipse.org/mailman/listinfo/wtp-releng