[Hudson] Build failed in Hudson: webtools-sourceediting_R3_10 #54

classic Classic list List threaded Threaded
2 messages Options
Reply | Threaded
Open this post in threaded view
|

[Hudson] Build failed in Hudson: webtools-sourceediting_R3_10 #54

hudsonbuild
See <https://hudson.eclipse.org/webtools/job/webtools-sourceediting_R3_10/54/>

------------------------------------------
[...truncated 512788 lines...]
[INFO] Installing /jobs/genie.webtools/webtools-sourceediting_R3_10/workspace/site/target/p2artifacts.xml to <https://hudson.eclipse.org/webtools/job/webtools-sourceediting_R3_10/ws/.maven/repo/org/eclipse/webtools/sourceediting/org.eclipse.webtools.sourceediting.site/3.6.0-SNAPSHOT/org.eclipse.webtools.sourceediting.site-3.6.0-SNAPSHOT-p2artifacts.xml>
[DEBUG] Writing tracking file <https://hudson.eclipse.org/webtools/job/webtools-sourceediting_R3_10/ws/.maven/repo/org/eclipse/webtools/sourceediting/org.eclipse.webtools.sourceediting.site/3.6.0-SNAPSHOT/_remote.repositories>
[DEBUG] Installing org.eclipse.webtools.sourceediting:org.eclipse.webtools.sourceediting.site:3.6.0-SNAPSHOT/maven-metadata.xml to <https://hudson.eclipse.org/webtools/job/webtools-sourceediting_R3_10/ws/.maven/repo/org/eclipse/webtools/sourceediting/org.eclipse.webtools.sourceediting.site/3.6.0-SNAPSHOT/maven-metadata-local.xml>
[DEBUG] Installing org.eclipse.webtools.sourceediting:org.eclipse.webtools.sourceediting.site/maven-metadata.xml to <https://hudson.eclipse.org/webtools/job/webtools-sourceediting_R3_10/ws/.maven/repo/org/eclipse/webtools/sourceediting/org.eclipse.webtools.sourceediting.site/maven-metadata-local.xml>
[INFO]
[INFO] --- tycho-p2-plugin:1.1.0-SNAPSHOT:update-local-index (default-update-local-index) @ org.eclipse.webtools.sourceediting.site ---
[DEBUG] Configuring mojo org.eclipse.tycho:tycho-p2-plugin:1.1.0-SNAPSHOT:update-local-index from plugin realm ClassRealm[plugin>org.eclipse.tycho:tycho-p2-plugin:1.1.0-SNAPSHOT, parent: sun.misc.Launcher$AppClassLoader@33909752]
[DEBUG] Configuring mojo 'org.eclipse.tycho:tycho-p2-plugin:1.1.0-SNAPSHOT:update-local-index' with basic configurator -->
[DEBUG]   (f) project = MavenProject: org.eclipse.webtools.sourceediting:org.eclipse.webtools.sourceediting.site:3.6.0-SNAPSHOT @ /jobs/genie.webtools/webtools-sourceediting_R3_10/workspace/site/pom.xml
[DEBUG] -- end configuration --
[INFO] ------------------------------------------------------------------------
[INFO] Reactor Summary:
[INFO]
[INFO] sourceediting-parent ............................... SUCCESS [02:19 min]
[INFO] sourceediting.core ................................. SUCCESS [  0.137 s]
[INFO] sourceediting.core.bundles ......................... SUCCESS [  0.080 s]
[INFO] org.eclipse.wst.sse.core ........................... SUCCESS [ 54.203 s]
[INFO] org.eclipse.wst.sse.ui ............................. SUCCESS [ 11.855 s]
[INFO] sourceediting.core.docs ............................ SUCCESS [  0.133 s]
[INFO] org.eclipse.wst.sse.doc.user ....................... SUCCESS [  2.942 s]
[INFO] org.eclipse.wst.sse.ui.infopop ..................... SUCCESS [  2.944 s]
[INFO] sourceediting.core.tests ........................... SUCCESS [  0.111 s]
[INFO] sourceediting.xml .................................. SUCCESS [  0.133 s]
[INFO] sourceediting.xml.bundles .......................... SUCCESS [  0.115 s]
[INFO] org.eclipse.wst.xml.core ........................... SUCCESS [ 13.514 s]
[INFO] org.eclipse.wst.sse.core.tests ..................... SUCCESS [ 12.563 s]
[INFO] org.eclipse.wst.xml.ui ............................. SUCCESS [  9.335 s]
[INFO] org.eclipse.wst.sse.ui.tests ....................... SUCCESS [ 38.956 s]
[INFO] sourceediting.json ................................. SUCCESS [  0.140 s]
[INFO] sourceediting.json.bundles ......................... SUCCESS [  0.103 s]
[INFO] org.eclipse.json ................................... SUCCESS [  7.549 s]
[INFO] org.eclipse.wst.json.bower.core .................... SUCCESS [  5.737 s]
[INFO] org.eclipse.wst.json.core .......................... SUCCESS [ 18.366 s]
[INFO] org.eclipse.wst.json.schemaprocessor ............... SUCCESS [  3.971 s]
[INFO] org.eclipse.wst.json.ui ............................ SUCCESS [ 19.938 s]
[INFO] org.eclipse.wst.json.bower.ui ...................... SUCCESS [  5.059 s]
[INFO] org.eclipse.wst.json.eslint.core ................... SUCCESS [  4.609 s]
[INFO] org.eclipse.wst.json.eslint.ui ..................... SUCCESS [  4.090 s]
[INFO] org.eclipse.wst.json.jshint.core ................... SUCCESS [  4.159 s]
[INFO] org.eclipse.wst.json.jshint.ui ..................... SUCCESS [  3.941 s]
[INFO] org.eclipse.wst.json.npm.core ...................... SUCCESS [  4.059 s]
[INFO] org.eclipse.wst.json.npm.ui ........................ SUCCESS [  5.341 s]
[INFO] sourceediting.json.features ........................ SUCCESS [  0.122 s]
[INFO] org.eclipse.wst.json_core.feature .................. SUCCESS [  2.874 s]
[INFO] org.eclipse.wst.json_ui.feature .................... SUCCESS [  2.354 s]
[INFO] org.eclipse.wst.json_sdk.feature ................... SUCCESS [  1.556 s]
[INFO] sourceediting.json.tests ........................... SUCCESS [  0.090 s]
[INFO] org.eclipse.wst.json.core.tests .................... SUCCESS [ 11.171 s]
[INFO] org.eclipse.wst.json_tests.feature ................. SUCCESS [  1.250 s]
[INFO] org.eclipse.wst.dtd.core ........................... SUCCESS [ 23.115 s]
[INFO] org.eclipse.wst.dtd.ui ............................. SUCCESS [ 16.608 s]
[INFO] org.eclipse.wst.standard.schemas ................... SUCCESS [  5.935 s]
[INFO] org.eclipse.wst.xsd.core ........................... SUCCESS [  6.913 s]
[INFO] org.eclipse.wst.xsd.ui ............................. SUCCESS [ 11.617 s]
[INFO] org.eclipse.wtp.xml.capabilities ................... SUCCESS [  7.086 s]
[INFO] sourceediting.xml.docs ............................. SUCCESS [  0.134 s]
[INFO] org.eclipse.wst.dtdeditor.doc.user ................. SUCCESS [  2.717 s]
[INFO] org.eclipse.wst.dtd.ui.infopop ..................... SUCCESS [  2.624 s]
[INFO] org.eclipse.wst.xmleditor.doc.user ................. SUCCESS [  3.062 s]
[INFO] org.eclipse.wst.xml.ui.infopop ..................... SUCCESS [  3.051 s]
[INFO] org.eclipse.wst.xsdeditor.doc.user ................. SUCCESS [  3.015 s]
[INFO] sourceediting.xml.features ......................... SUCCESS [  0.171 s]
[INFO] org.eclipse.wst.xml_core.feature ................... SUCCESS [  3.197 s]
[INFO] org.eclipse.wst.xml_userdoc.feature ................ SUCCESS [  1.416 s]
[INFO] org.eclipse.wst.xml_ui.feature ..................... SUCCESS [  2.605 s]
[INFO] org.eclipse.wst.xml_sdk.feature .................... SUCCESS [  3.073 s]
[INFO] sourceediting.xml.tests ............................ SUCCESS [  0.165 s]
[INFO] org.eclipse.wst.dtd.core.tests ..................... SUCCESS [ 10.843 s]
[INFO] org.eclipse.wst.dtd.ui.tests ....................... SUCCESS [ 17.154 s]
[INFO] org.eclipse.wst.xml.catalog.tests .................. SUCCESS [  9.738 s]
[INFO] sourceediting.web .................................. SUCCESS [  0.084 s]
[INFO] sourceediting.web.bundles .......................... SUCCESS [  0.137 s]
[INFO] org.eclipse.jst.standard.schemas ................... SUCCESS [  4.547 s]
[INFO] org.eclipse.wst.xml.core.tests ..................... SUCCESS [ 21.378 s]
[INFO] org.eclipse.wst.css.core ........................... SUCCESS [ 32.325 s]
[INFO] org.eclipse.wst.html.core .......................... SUCCESS [ 43.369 s]
[INFO] org.eclipse.jst.jsp.core ........................... SUCCESS [ 33.585 s]
[INFO] org.eclipse.wst.xml.tests.encoding ................. SUCCESS [ 44.305 s]
[INFO] org.eclipse.wst.css.ui ............................. SUCCESS [ 17.944 s]
[INFO] org.eclipse.wst.html.ui ............................ SUCCESS [ 21.350 s]
[INFO] org.eclipse.jst.jsp.ui ............................. SUCCESS [  6.382 s]
[INFO] org.eclipse.wst.xml.ui.tests ....................... SUCCESS [ 52.858 s]
[INFO] org.eclipse.wst.xml.validation.tests ............... SUCCESS [ 17.489 s]
[INFO] org.eclipse.wst.xsd.validation.tests ............... SUCCESS [ 23.207 s]
[INFO] org.eclipse.wst.xsd.core.tests ..................... SUCCESS [ 14.609 s]
[INFO] org.eclipse.wst.xsd.ui.tests ....................... SUCCESS [ 32.069 s]
[INFO] org.eclipse.wst.xml_tests.feature .................. SUCCESS [  1.575 s]
[INFO] sourceediting.xpath ................................ SUCCESS [  0.089 s]
[INFO] sourceediting.xpath.bundles ........................ SUCCESS [  0.100 s]
[INFO] PsychoPath XPath 2.0 Processor: Branding Plug-in ... SUCCESS [  3.770 s]
[INFO] PsychoPath XPath 2.0 Processor ..................... SUCCESS [ 46.864 s]
[INFO] PsychoPath XPath 2.0 Processor ..................... SUCCESS [  4.042 s]
[INFO] org.eclipse.wst.xml.xpath.core ..................... SUCCESS [  5.217 s]
[INFO] org.eclipse.wst.xml.xpath.ui ....................... SUCCESS [  8.304 s]
[INFO] sourceediting.xpath.docs ........................... SUCCESS [  0.086 s]
[INFO] PsychoPath XPath 2.0 Processor: User Documentation . SUCCESS [  6.512 s]
[INFO] PsychoPath XPath 2.0 Processor: SDK Documentation .. SUCCESS [ 26.492 s]
[INFO] sourceediting.xpath.features ....................... SUCCESS [  0.106 s]
[INFO] PsychoPath XPath 2.0 Processor Feature ............. SUCCESS [  2.397 s]
[INFO] PsychoPath XPath 2.0 Processor: SDK Feature ........ SUCCESS [  1.192 s]
[INFO] sourceediting.xpath.tests .......................... SUCCESS [  0.081 s]
[INFO] PsychoPath XPath 2.0 Processor: XQuery Test Suite .. SUCCESS [03:22 min]
[INFO] PsychoPath XPath 2.0 Processor: Tests .............. SUCCESS [01:44 min]
[INFO] PsychoPath XPath 2.0 Processor: Tests for WTP type support SUCCESS [ 15.901 s]
[INFO] org.eclipse.wst.xml.xpath.core.tests ............... SUCCESS [ 14.389 s]
[INFO] org.eclipse.wst.xml.xpath.ui.tests ................. SUCCESS [ 12.915 s]
[INFO] sourceediting.xsl .................................. SUCCESS [  0.158 s]
[INFO] sourceediting.xsl.bundles .......................... SUCCESS [  0.086 s]
[INFO] XSL Tools Branding Plugin .......................... SUCCESS [  2.485 s]
[INFO] XSLT Core Plugin ................................... SUCCESS [  4.087 s]
[INFO] XSLT Launching Plugin .............................. SUCCESS [  3.585 s]
[INFO] XSLT Debug UI Plugin ............................... SUCCESS [  3.505 s]
[INFO] XSLT EXSLT Core Plugin ............................. SUCCESS [  2.514 s]
[INFO] XSLT UI Plugin ..................................... SUCCESS [  5.099 s]
[INFO] XSLT EXSLT UI Plugin ............................... SUCCESS [  4.077 s]
[INFO] XSLT JAXP Debug Plugin ............................. SUCCESS [  3.057 s]
[INFO] XSLT JAXP Launching UI Plugin ...................... SUCCESS [  3.358 s]
[INFO] XSLT JAXP Debug UI Plugin .......................... SUCCESS [  5.872 s]
[INFO] XSLT Saxon Plugin .................................. SUCCESS [  2.679 s]
[INFO] XSLT Xalan Plugin .................................. FAILURE [  0.312 s]
[INFO] sourceediting.xsl.docs ............................. SUCCESS [  0.070 s]
[INFO] org.eclipse.wst.xsl.doc ............................ SUCCESS [  3.366 s]
[INFO] org.eclipse.wst.xsl.sdk.documentation .............. SUCCESS [  3.085 s]
[INFO] sourceediting.xsl.features ......................... SUCCESS [  0.132 s]
[INFO] XSLT FeaturePlugin ................................. SKIPPED
[INFO] org.eclipse.wst.xsl_sdk.feature .................... SKIPPED
[INFO] sourceediting.xsl.tests ............................ SUCCESS [  0.066 s]
[INFO] XSLT Core Tests .................................... SUCCESS [  4.192 s]
[INFO] EXSLT Core Tests ................................... SUCCESS [  3.583 s]
[INFO] XSLT UI Tests ...................................... SUCCESS [  3.310 s]
[INFO] EXSLT UI Tests ..................................... SUCCESS [  2.964 s]
[INFO] JAXP Debug Tests ................................... SUCCESS [  4.688 s]
[INFO] XSL Launching Tests ................................ SKIPPED
[INFO] org.eclipse.wst.xsl.tests .......................... SKIPPED
[INFO] org.eclipse.wst.xsl_tests.feature .................. SKIPPED
[INFO] org.eclipse.wst.jsdt.web.core ...................... SUCCESS [  4.296 s]
[INFO] org.eclipse.wst.jsdt.web.ui ........................ SUCCESS [  4.207 s]
[INFO] org.eclipse.wst.jsdt.web.support.jsp ............... SUCCESS [  3.616 s]
[INFO] org.eclipse.wst.web ................................ SUCCESS [  3.121 s]
[INFO] org.eclipse.wst.web.ui ............................. SUCCESS [  3.656 s]
[INFO] org.eclipse.wtp.javascript.capabilities ............ SUCCESS [  1.420 s]
[INFO] org.eclipse.wtp.web.capabilities ................... SUCCESS [  1.305 s]
[INFO] sourceediting.web.docs ............................. SUCCESS [  0.130 s]
[INFO] org.eclipse.jst.jsp.ui.infopop ..................... SUCCESS [  2.766 s]
[INFO] org.eclipse.wst.doc.user ........................... SUCCESS [  7.211 s]
[INFO] org.eclipse.wst.html.ui.infopop .................... SUCCESS [  2.854 s]
[INFO] org.eclipse.wst.webtools.doc.user .................. SUCCESS [  5.135 s]
[INFO] org.eclipse.wst.web.ui.infopop ..................... SUCCESS [  3.618 s]
[INFO] sourceediting.web.features ......................... SUCCESS [  0.105 s]
[INFO] org.eclipse.wst.web_core.feature ................... SUCCESS [  3.579 s]
[INFO] org.eclipse.wst.web_userdoc.feature ................ SUCCESS [  1.059 s]
[INFO] org.eclipse.wst.web_ui.feature ..................... SUCCESS [  2.572 s]
[INFO] org.eclipse.wst.web_sdk.feature .................... SUCCESS [  1.488 s]
[INFO] sourceediting.web.tests ............................ SUCCESS [  0.181 s]
[INFO] org.eclipse.wst.css.core.tests ..................... SUCCESS [ 19.597 s]
[INFO] org.eclipse.wst.css.tests.encoding ................. SUCCESS [ 12.192 s]
[INFO] org.eclipse.wst.css.ui.tests ....................... SUCCESS [ 21.169 s]
[INFO] org.eclipse.wst.html.core.tests .................... SUCCESS [ 20.988 s]
[INFO] org.eclipse.wst.html.tests.encoding ................ SUCCESS [ 12.005 s]
[INFO] org.eclipse.wst.html.ui.tests ...................... SUCCESS [ 16.962 s]
[INFO] org.eclipse.wst.jsdt.web.core.tests ................ SUCCESS [ 13.729 s]
[INFO] org.eclipse.wst.jsdt.web.ui.tests .................. SUCCESS [ 23.228 s]
[INFO] org.eclipse.wst.web_tests.feature .................. SUCCESS [  1.240 s]
[INFO] org.eclipse.jst.jsp.core.tests ..................... SUCCESS [01:38 min]
[INFO] org.eclipse.jst.jsp.tests.encoding ................. SUCCESS [ 13.956 s]
[INFO] org.eclipse.jst.jsp.ui.tests ....................... SUCCESS [ 55.436 s]
[INFO] org.eclipse.webtools.sourceediting.site ............ SUCCESS [ 25.892 s]
[INFO] ------------------------------------------------------------------------
[INFO] BUILD FAILURE
[INFO] ------------------------------------------------------------------------
[INFO] Total time: 39:45 min
[INFO] Finished at: 2018-01-30T10:26:51-05:00
[INFO] Final Memory: 326M/4529M
[INFO] ------------------------------------------------------------------------
[INFO] o.h.m.e.h.MavenExecutionResultHandler - Build failed with exception(s)
[INFO] o.h.m.e.h.MavenExecutionResultHandler - [1] org.apache.maven.lifecycle.LifecycleExecutionException: Failed to execute goal org.eclipse.tycho:tycho-compiler-plugin:1.1.0-SNAPSHOT:compile (default-compile) on project org.eclipse.wst.xsl.xalan: Compilation failure
[DEBUG] Closing connection to remote
[ERROR] Failed to execute goal org.eclipse.tycho:tycho-compiler-plugin:1.1.0-SNAPSHOT:compile (default-compile) on project org.eclipse.wst.xsl.xalan: Compilation failure: Compilation failure:
[ERROR] /jobs/genie.webtools/webtools-sourceediting_R3_10/workspace/xsl/bundles/org.eclipse.wst.xsl.xalan/src-debugger/org/eclipse/wst/xsl/xalan/debugger/XalanDebugger.java:[46]
[ERROR] lastTransformerInChain.getSerializationHandler().flushPending();
[ERROR]                       ^^^^^^^^^^^^^^^^^^^^^^^
[ERROR] The method getSerializationHandler() is undefined for the type TransformerImpl
[ERROR] /jobs/genie.webtools/webtools-sourceediting_R3_10/workspace/xsl/bundles/org.eclipse.wst.xsl.xalan/src-debugger/org/eclipse/wst/xsl/xalan/debugger/XalanStyleFrame.java:[131]
[ERROR] currentLine = e.m_styleNode.getEndLineNumber();
[ERROR]                            ^^^^^^^^^^^^^^^^
[ERROR] The method getEndLineNumber() is undefined for the type ElemTemplateElement
[ERROR] 2 problems (2 errors)
[ERROR] -> [Help 1]
org.apache.maven.lifecycle.LifecycleExecutionException: Failed to execute goal org.eclipse.tycho:tycho-compiler-plugin:1.1.0-SNAPSHOT:compile (default-compile) on project org.eclipse.wst.xsl.xalan: Compilation failure
    at org.apache.maven.lifecycle.internal.MojoExecutor.execute (MojoExecutor.java:213)
    at org.apache.maven.lifecycle.internal.MojoExecutor.execute (MojoExecutor.java:154)
    at org.apache.maven.lifecycle.internal.MojoExecutor.execute (MojoExecutor.java:146)
    at org.apache.maven.lifecycle.internal.LifecycleModuleBuilder.buildProject (LifecycleModuleBuilder.java:117)
    at org.apache.maven.lifecycle.internal.LifecycleModuleBuilder.buildProject (LifecycleModuleBuilder.java:81)
    at org.apache.maven.lifecycle.internal.builder.singlethreaded.SingleThreadedBuilder.build (SingleThreadedBuilder.java:51)
    at org.apache.maven.lifecycle.internal.LifecycleStarter.execute (LifecycleStarter.java:128)
    at org.apache.maven.DefaultMaven.doExecute (DefaultMaven.java:309)
    at org.apache.maven.DefaultMaven.doExecute (DefaultMaven.java:194)
    at org.apache.maven.DefaultMaven.execute (DefaultMaven.java:107)
    at org.apache.maven.cli.MavenCli.execute (MavenCli.java:955)
    at org.apache.maven.cli.MavenCli.doMain (MavenCli.java:290)
    at org.apache.maven.cli.MavenCli.main (MavenCli.java:194)
    at sun.reflect.NativeMethodAccessorImpl.invoke0 (Native Method)
    at sun.reflect.NativeMethodAccessorImpl.invoke (NativeMethodAccessorImpl.java:62)
    at sun.reflect.DelegatingMethodAccessorImpl.invoke (DelegatingMethodAccessorImpl.java:43)
    at java.lang.reflect.Method.invoke (Method.java:498)
    at org.codehaus.plexus.classworlds.launcher.Launcher.launchEnhanced (Launcher.java:289)
    at org.codehaus.plexus.classworlds.launcher.Launcher.launch (Launcher.java:229)
    at org.codehaus.plexus.classworlds.launcher.Launcher.mainWithExitCode (Launcher.java:415)
    at org.codehaus.plexus.classworlds.launcher.Launcher.main (Launcher.java:356)
Caused by: copied.org.apache.maven.plugin.CompilationFailureException: Compilation failure
    at copied.org.apache.maven.plugin.AbstractCompilerMojo.execute (AbstractCompilerMojo.java:420)
    at org.eclipse.tycho.compiler.AbstractOsgiCompilerMojo.execute (AbstractOsgiCompilerMojo.java:293)
    at org.apache.maven.plugin.DefaultBuildPluginManager.executeMojo (DefaultBuildPluginManager.java:134)
    at org.apache.maven.lifecycle.internal.MojoExecutor.execute (MojoExecutor.java:208)
    at org.apache.maven.lifecycle.internal.MojoExecutor.execute (MojoExecutor.java:154)
    at org.apache.maven.lifecycle.internal.MojoExecutor.execute (MojoExecutor.java:146)
    at org.apache.maven.lifecycle.internal.LifecycleModuleBuilder.buildProject (LifecycleModuleBuilder.java:117)
    at org.apache.maven.lifecycle.internal.LifecycleModuleBuilder.buildProject (LifecycleModuleBuilder.java:81)
    at org.apache.maven.lifecycle.internal.builder.singlethreaded.SingleThreadedBuilder.build (SingleThreadedBuilder.java:51)
    at org.apache.maven.lifecycle.internal.LifecycleStarter.execute (LifecycleStarter.java:128)
    at org.apache.maven.DefaultMaven.doExecute (DefaultMaven.java:309)
    at org.apache.maven.DefaultMaven.doExecute (DefaultMaven.java:194)
    at org.apache.maven.DefaultMaven.execute (DefaultMaven.java:107)
    at org.apache.maven.cli.MavenCli.execute (MavenCli.java:955)
    at org.apache.maven.cli.MavenCli.doMain (MavenCli.java:290)
    at org.apache.maven.cli.MavenCli.main (MavenCli.java:194)
    at sun.reflect.NativeMethodAccessorImpl.invoke0 (Native Method)
    at sun.reflect.NativeMethodAccessorImpl.invoke (NativeMethodAccessorImpl.java:62)
    at sun.reflect.DelegatingMethodAccessorImpl.invoke (DelegatingMethodAccessorImpl.java:43)
    at java.lang.reflect.Method.invoke (Method.java:498)
    at org.codehaus.plexus.classworlds.launcher.Launcher.launchEnhanced (Launcher.java:289)
    at org.codehaus.plexus.classworlds.launcher.Launcher.launch (Launcher.java:229)
    at org.codehaus.plexus.classworlds.launcher.Launcher.mainWithExitCode (Launcher.java:415)
    at org.codehaus.plexus.classworlds.launcher.Launcher.main (Launcher.java:356)
[ERROR]
[ERROR]
[ERROR] For more information about the errors and possible solutions, please read the following articles:
[ERROR] [Help 1] http://cwiki.apache.org/confluence/display/MAVEN/MojoFailureException
[ERROR]
[ERROR] After correcting the problems, you can resume the build with the command
[ERROR]   mvn <goals> -rf :org.eclipse.wst.xsl.xalan
[DEBUG] Waiting for process to finish
[DEBUG] Result: 1
Taking screenshot.
[workspace] $ import -window root -display :452 screenshot.jpg
Terminating xvnc.
Recording test results
Archiving artifacts

--
This message is automatically generated by Hudson.
For more information on Hudson, see: http://hudson-ci.org/
_______________________________________________
wtp-releng mailing list
[hidden email]
To change your delivery options, retrieve your password, or unsubscribe from this list, visit
https://dev.eclipse.org/mailman/listinfo/wtp-releng
Reply | Threaded
Open this post in threaded view
|

[Hudson] Build failed in Hudson: webtools-sourceediting_R3_10 #55

hudsonbuild
See <https://hudson.eclipse.org/webtools/job/webtools-sourceediting_R3_10/55/>

------------------------------------------
[...truncated 513239 lines...]
[INFO] Installing /jobs/genie.webtools/webtools-sourceediting_R3_10/workspace/site/target/p2artifacts.xml to <https://hudson.eclipse.org/webtools/job/webtools-sourceediting_R3_10/ws/.maven/repo/org/eclipse/webtools/sourceediting/org.eclipse.webtools.sourceediting.site/3.6.0-SNAPSHOT/org.eclipse.webtools.sourceediting.site-3.6.0-SNAPSHOT-p2artifacts.xml>
[DEBUG] Writing tracking file <https://hudson.eclipse.org/webtools/job/webtools-sourceediting_R3_10/ws/.maven/repo/org/eclipse/webtools/sourceediting/org.eclipse.webtools.sourceediting.site/3.6.0-SNAPSHOT/_remote.repositories>
[DEBUG] Installing org.eclipse.webtools.sourceediting:org.eclipse.webtools.sourceediting.site:3.6.0-SNAPSHOT/maven-metadata.xml to <https://hudson.eclipse.org/webtools/job/webtools-sourceediting_R3_10/ws/.maven/repo/org/eclipse/webtools/sourceediting/org.eclipse.webtools.sourceediting.site/3.6.0-SNAPSHOT/maven-metadata-local.xml>
[DEBUG] Installing org.eclipse.webtools.sourceediting:org.eclipse.webtools.sourceediting.site/maven-metadata.xml to <https://hudson.eclipse.org/webtools/job/webtools-sourceediting_R3_10/ws/.maven/repo/org/eclipse/webtools/sourceediting/org.eclipse.webtools.sourceediting.site/maven-metadata-local.xml>
[INFO]
[INFO] --- tycho-p2-plugin:1.1.0-SNAPSHOT:update-local-index (default-update-local-index) @ org.eclipse.webtools.sourceediting.site ---
[DEBUG] Configuring mojo org.eclipse.tycho:tycho-p2-plugin:1.1.0-SNAPSHOT:update-local-index from plugin realm ClassRealm[plugin>org.eclipse.tycho:tycho-p2-plugin:1.1.0-SNAPSHOT, parent: sun.misc.Launcher$AppClassLoader@33909752]
[DEBUG] Configuring mojo 'org.eclipse.tycho:tycho-p2-plugin:1.1.0-SNAPSHOT:update-local-index' with basic configurator -->
[DEBUG]   (f) project = MavenProject: org.eclipse.webtools.sourceediting:org.eclipse.webtools.sourceediting.site:3.6.0-SNAPSHOT @ /jobs/genie.webtools/webtools-sourceediting_R3_10/workspace/site/pom.xml
[DEBUG] -- end configuration --
[INFO] ------------------------------------------------------------------------
[INFO] Reactor Summary:
[INFO]
[INFO] sourceediting-parent ............................... SUCCESS [01:00 min]
[INFO] sourceediting.core ................................. SUCCESS [  0.043 s]
[INFO] sourceediting.core.bundles ......................... SUCCESS [  0.083 s]
[INFO] org.eclipse.wst.sse.core ........................... SUCCESS [01:09 min]
[INFO] org.eclipse.wst.sse.ui ............................. SUCCESS [01:25 min]
[INFO] sourceediting.core.docs ............................ SUCCESS [  0.089 s]
[INFO] org.eclipse.wst.sse.doc.user ....................... SUCCESS [  6.080 s]
[INFO] org.eclipse.wst.sse.ui.infopop ..................... SUCCESS [  4.943 s]
[INFO] sourceediting.core.tests ........................... SUCCESS [  0.088 s]
[INFO] sourceediting.xml .................................. SUCCESS [  0.081 s]
[INFO] sourceediting.xml.bundles .......................... SUCCESS [  0.067 s]
[INFO] org.eclipse.wst.xml.core ........................... SUCCESS [ 17.939 s]
[INFO] org.eclipse.wst.sse.core.tests ..................... SUCCESS [  8.694 s]
[INFO] org.eclipse.wst.xml.ui ............................. SUCCESS [ 15.801 s]
[INFO] org.eclipse.wst.sse.ui.tests ....................... SUCCESS [ 34.192 s]
[INFO] sourceediting.json ................................. SUCCESS [  0.084 s]
[INFO] sourceediting.json.bundles ......................... SUCCESS [  0.071 s]
[INFO] org.eclipse.json ................................... SUCCESS [  3.662 s]
[INFO] org.eclipse.wst.json.bower.core .................... SUCCESS [  2.690 s]
[INFO] org.eclipse.wst.json.core .......................... SUCCESS [  7.151 s]
[INFO] org.eclipse.wst.json.schemaprocessor ............... SUCCESS [  6.668 s]
[INFO] org.eclipse.wst.json.ui ............................ SUCCESS [  4.713 s]
[INFO] org.eclipse.wst.json.bower.ui ...................... SUCCESS [  2.929 s]
[INFO] org.eclipse.wst.json.eslint.core ................... SUCCESS [  2.827 s]
[INFO] org.eclipse.wst.json.eslint.ui ..................... SUCCESS [  2.918 s]
[INFO] org.eclipse.wst.json.jshint.core ................... SUCCESS [  2.903 s]
[INFO] org.eclipse.wst.json.jshint.ui ..................... SUCCESS [  5.073 s]
[INFO] org.eclipse.wst.json.npm.core ...................... SUCCESS [  8.265 s]
[INFO] org.eclipse.wst.json.npm.ui ........................ SUCCESS [  4.905 s]
[INFO] sourceediting.json.features ........................ SUCCESS [  0.083 s]
[INFO] org.eclipse.wst.json_core.feature .................. SUCCESS [  2.778 s]
[INFO] org.eclipse.wst.json_ui.feature .................... SUCCESS [  4.197 s]
[INFO] org.eclipse.wst.json_sdk.feature ................... SUCCESS [  1.290 s]
[INFO] sourceediting.json.tests ........................... SUCCESS [  0.096 s]
[INFO] org.eclipse.wst.json.core.tests .................... SUCCESS [ 23.350 s]
[INFO] org.eclipse.wst.json_tests.feature ................. SUCCESS [  1.572 s]
[INFO] org.eclipse.wst.dtd.core ........................... SUCCESS [01:11 min]
[INFO] org.eclipse.wst.dtd.ui ............................. SUCCESS [ 25.506 s]
[INFO] org.eclipse.wst.standard.schemas ................... SUCCESS [ 10.104 s]
[INFO] org.eclipse.wst.xsd.core ........................... SUCCESS [  8.125 s]
[INFO] org.eclipse.wst.xsd.ui ............................. SUCCESS [ 37.337 s]
[INFO] org.eclipse.wtp.xml.capabilities ................... SUCCESS [  1.004 s]
[INFO] sourceediting.xml.docs ............................. SUCCESS [  0.075 s]
[INFO] org.eclipse.wst.dtdeditor.doc.user ................. SUCCESS [  6.145 s]
[INFO] org.eclipse.wst.dtd.ui.infopop ..................... SUCCESS [  3.363 s]
[INFO] org.eclipse.wst.xmleditor.doc.user ................. SUCCESS [  3.997 s]
[INFO] org.eclipse.wst.xml.ui.infopop ..................... SUCCESS [  2.500 s]
[INFO] org.eclipse.wst.xsdeditor.doc.user ................. SUCCESS [  4.989 s]
[INFO] sourceediting.xml.features ......................... SUCCESS [  0.071 s]
[INFO] org.eclipse.wst.xml_core.feature ................... SUCCESS [  3.174 s]
[INFO] org.eclipse.wst.xml_userdoc.feature ................ SUCCESS [  1.436 s]
[INFO] org.eclipse.wst.xml_ui.feature ..................... SUCCESS [  2.013 s]
[INFO] org.eclipse.wst.xml_sdk.feature .................... SUCCESS [  3.589 s]
[INFO] sourceediting.xml.tests ............................ SUCCESS [  0.124 s]
[INFO] org.eclipse.wst.dtd.core.tests ..................... SUCCESS [ 17.417 s]
[INFO] org.eclipse.wst.dtd.ui.tests ....................... SUCCESS [ 24.218 s]
[INFO] org.eclipse.wst.xml.catalog.tests .................. SUCCESS [ 18.049 s]
[INFO] sourceediting.web .................................. SUCCESS [  0.079 s]
[INFO] sourceediting.web.bundles .......................... SUCCESS [  0.081 s]
[INFO] org.eclipse.jst.standard.schemas ................... SUCCESS [ 19.272 s]
[INFO] org.eclipse.wst.xml.core.tests ..................... SUCCESS [01:17 min]
[INFO] org.eclipse.wst.css.core ........................... SUCCESS [ 54.945 s]
[INFO] org.eclipse.wst.html.core .......................... SUCCESS [ 55.272 s]
[INFO] org.eclipse.jst.jsp.core ........................... SUCCESS [  7.093 s]
[INFO] org.eclipse.wst.xml.tests.encoding ................. SUCCESS [ 21.234 s]
[INFO] org.eclipse.wst.css.ui ............................. SUCCESS [  9.047 s]
[INFO] org.eclipse.wst.html.ui ............................ SUCCESS [  8.235 s]
[INFO] org.eclipse.jst.jsp.ui ............................. SUCCESS [ 11.294 s]
[INFO] org.eclipse.wst.xml.ui.tests ....................... SUCCESS [01:06 min]
[INFO] org.eclipse.wst.xml.validation.tests ............... SUCCESS [ 24.371 s]
[INFO] org.eclipse.wst.xsd.validation.tests ............... SUCCESS [ 40.866 s]
[INFO] org.eclipse.wst.xsd.core.tests ..................... SUCCESS [ 16.864 s]
[INFO] org.eclipse.wst.xsd.ui.tests ....................... SUCCESS [ 30.871 s]
[INFO] org.eclipse.wst.xml_tests.feature .................. SUCCESS [  1.310 s]
[INFO] sourceediting.xpath ................................ SUCCESS [  0.064 s]
[INFO] sourceediting.xpath.bundles ........................ SUCCESS [  0.067 s]
[INFO] PsychoPath XPath 2.0 Processor: Branding Plug-in ... SUCCESS [  4.566 s]
[INFO] PsychoPath XPath 2.0 Processor ..................... SUCCESS [ 56.364 s]
[INFO] PsychoPath XPath 2.0 Processor ..................... SUCCESS [  3.495 s]
[INFO] org.eclipse.wst.xml.xpath.core ..................... SUCCESS [  3.125 s]
[INFO] org.eclipse.wst.xml.xpath.ui ....................... SUCCESS [  3.653 s]
[INFO] sourceediting.xpath.docs ........................... SUCCESS [  0.083 s]
[INFO] PsychoPath XPath 2.0 Processor: User Documentation . SUCCESS [ 41.385 s]
[INFO] PsychoPath XPath 2.0 Processor: SDK Documentation .. SUCCESS [  4.230 s]
[INFO] sourceediting.xpath.features ....................... SUCCESS [  0.068 s]
[INFO] PsychoPath XPath 2.0 Processor Feature ............. SUCCESS [  3.104 s]
[INFO] PsychoPath XPath 2.0 Processor: SDK Feature ........ SUCCESS [  1.288 s]
[INFO] sourceediting.xpath.tests .......................... SUCCESS [  0.074 s]
[INFO] PsychoPath XPath 2.0 Processor: XQuery Test Suite .. SUCCESS [08:31 min]
[INFO] PsychoPath XPath 2.0 Processor: Tests .............. SUCCESS [ 56.316 s]
[INFO] PsychoPath XPath 2.0 Processor: Tests for WTP type support SUCCESS [  9.863 s]
[INFO] org.eclipse.wst.xml.xpath.core.tests ............... SUCCESS [ 12.587 s]
[INFO] org.eclipse.wst.xml.xpath.ui.tests ................. SUCCESS [  8.901 s]
[INFO] sourceediting.xsl .................................. SUCCESS [  0.059 s]
[INFO] sourceediting.xsl.bundles .......................... SUCCESS [  0.059 s]
[INFO] XSL Tools Branding Plugin .......................... SUCCESS [  8.002 s]
[INFO] XSLT Core Plugin ................................... SUCCESS [  8.307 s]
[INFO] XSLT Launching Plugin .............................. SUCCESS [  3.058 s]
[INFO] XSLT Debug UI Plugin ............................... SUCCESS [  4.067 s]
[INFO] XSLT EXSLT Core Plugin ............................. SUCCESS [ 12.353 s]
[INFO] XSLT UI Plugin ..................................... SUCCESS [ 47.750 s]
[INFO] XSLT EXSLT UI Plugin ............................... SUCCESS [  8.918 s]
[INFO] XSLT JAXP Debug Plugin ............................. SUCCESS [ 17.342 s]
[INFO] XSLT JAXP Launching UI Plugin ...................... SUCCESS [ 17.857 s]
[INFO] XSLT JAXP Debug UI Plugin .......................... SUCCESS [ 21.676 s]
[INFO] XSLT Saxon Plugin .................................. SUCCESS [  7.856 s]
[INFO] XSLT Xalan Plugin .................................. FAILURE [  0.313 s]
[INFO] sourceediting.xsl.docs ............................. SUCCESS [  0.085 s]
[INFO] org.eclipse.wst.xsl.doc ............................ SUCCESS [ 21.191 s]
[INFO] org.eclipse.wst.xsl.sdk.documentation .............. SUCCESS [ 20.598 s]
[INFO] sourceediting.xsl.features ......................... SUCCESS [  0.081 s]
[INFO] XSLT FeaturePlugin ................................. SKIPPED
[INFO] org.eclipse.wst.xsl_sdk.feature .................... SKIPPED
[INFO] sourceediting.xsl.tests ............................ SUCCESS [  0.081 s]
[INFO] XSLT Core Tests .................................... SUCCESS [  8.312 s]
[INFO] EXSLT Core Tests ................................... SUCCESS [ 18.642 s]
[INFO] XSLT UI Tests ...................................... SUCCESS [ 10.853 s]
[INFO] EXSLT UI Tests ..................................... SUCCESS [  2.622 s]
[INFO] JAXP Debug Tests ................................... SUCCESS [  2.488 s]
[INFO] XSL Launching Tests ................................ SKIPPED
[INFO] org.eclipse.wst.xsl.tests .......................... SKIPPED
[INFO] org.eclipse.wst.xsl_tests.feature .................. SKIPPED
[INFO] org.eclipse.wst.jsdt.web.core ...................... SUCCESS [  8.826 s]
[INFO] org.eclipse.wst.jsdt.web.ui ........................ SUCCESS [  7.217 s]
[INFO] org.eclipse.wst.jsdt.web.support.jsp ............... SUCCESS [  2.580 s]
[INFO] org.eclipse.wst.web ................................ SUCCESS [  3.860 s]
[INFO] org.eclipse.wst.web.ui ............................. SUCCESS [  3.507 s]
[INFO] org.eclipse.wtp.javascript.capabilities ............ SUCCESS [  1.174 s]
[INFO] org.eclipse.wtp.web.capabilities ................... SUCCESS [  1.063 s]
[INFO] sourceediting.web.docs ............................. SUCCESS [  0.083 s]
[INFO] org.eclipse.jst.jsp.ui.infopop ..................... SUCCESS [ 10.868 s]
[INFO] org.eclipse.wst.doc.user ........................... SUCCESS [  9.219 s]
[INFO] org.eclipse.wst.html.ui.infopop .................... SUCCESS [  2.720 s]
[INFO] org.eclipse.wst.webtools.doc.user .................. SUCCESS [  6.503 s]
[INFO] org.eclipse.wst.web.ui.infopop ..................... SUCCESS [  4.252 s]
[INFO] sourceediting.web.features ......................... SUCCESS [  2.075 s]
[INFO] org.eclipse.wst.web_core.feature ................... SUCCESS [  3.097 s]
[INFO] org.eclipse.wst.web_userdoc.feature ................ SUCCESS [  0.990 s]
[INFO] org.eclipse.wst.web_ui.feature ..................... SUCCESS [  3.356 s]
[INFO] org.eclipse.wst.web_sdk.feature .................... SUCCESS [  1.322 s]
[INFO] sourceediting.web.tests ............................ SUCCESS [  0.078 s]
[INFO] org.eclipse.wst.css.core.tests ..................... SUCCESS [ 16.483 s]
[INFO] org.eclipse.wst.css.tests.encoding ................. SUCCESS [ 16.933 s]
[INFO] org.eclipse.wst.css.ui.tests ....................... SUCCESS [ 39.127 s]
[INFO] org.eclipse.wst.html.core.tests .................... SUCCESS [ 55.146 s]
[INFO] org.eclipse.wst.html.tests.encoding ................ SUCCESS [ 31.800 s]
[INFO] org.eclipse.wst.html.ui.tests ...................... SUCCESS [ 30.785 s]
[INFO] org.eclipse.wst.jsdt.web.core.tests ................ SUCCESS [ 43.916 s]
[INFO] org.eclipse.wst.jsdt.web.ui.tests .................. SUCCESS [ 26.591 s]
[INFO] org.eclipse.wst.web_tests.feature .................. SUCCESS [  5.232 s]
[INFO] org.eclipse.jst.jsp.core.tests ..................... SUCCESS [01:43 min]
[INFO] org.eclipse.jst.jsp.tests.encoding ................. SUCCESS [ 23.855 s]
[INFO] org.eclipse.jst.jsp.ui.tests ....................... SUCCESS [02:35 min]
[INFO] org.eclipse.webtools.sourceediting.site ............ SUCCESS [01:58 min]
[INFO] ------------------------------------------------------------------------
[INFO] BUILD FAILURE
[INFO] ------------------------------------------------------------------------
[INFO] Total time: 54:23 min
[INFO] Finished at: 2018-02-01T23:00:52-05:00
[INFO] Final Memory: 309M/2019M
[INFO] ------------------------------------------------------------------------
[INFO] o.h.m.e.h.MavenExecutionResultHandler - Build failed with exception(s)
[INFO] o.h.m.e.h.MavenExecutionResultHandler - [1] org.apache.maven.lifecycle.LifecycleExecutionException: Failed to execute goal org.eclipse.tycho:tycho-compiler-plugin:1.1.0-SNAPSHOT:compile (default-compile) on project org.eclipse.wst.xsl.xalan: Compilation failure
[DEBUG] Closing connection to remote
[ERROR] Failed to execute goal org.eclipse.tycho:tycho-compiler-plugin:1.1.0-SNAPSHOT:compile (default-compile) on project org.eclipse.wst.xsl.xalan: Compilation failure: Compilation failure:
[ERROR] /jobs/genie.webtools/webtools-sourceediting_R3_10/workspace/xsl/bundles/org.eclipse.wst.xsl.xalan/src-debugger/org/eclipse/wst/xsl/xalan/debugger/XalanDebugger.java:[46]
[ERROR] lastTransformerInChain.getSerializationHandler().flushPending();
[ERROR]                       ^^^^^^^^^^^^^^^^^^^^^^^
[ERROR] The method getSerializationHandler() is undefined for the type TransformerImpl
[ERROR] /jobs/genie.webtools/webtools-sourceediting_R3_10/workspace/xsl/bundles/org.eclipse.wst.xsl.xalan/src-debugger/org/eclipse/wst/xsl/xalan/debugger/XalanStyleFrame.java:[131]
[ERROR] currentLine = e.m_styleNode.getEndLineNumber();
[ERROR]                            ^^^^^^^^^^^^^^^^
[ERROR] The method getEndLineNumber() is undefined for the type ElemTemplateElement
[ERROR] 2 problems (2 errors)
[ERROR] -> [Help 1]
org.apache.maven.lifecycle.LifecycleExecutionException: Failed to execute goal org.eclipse.tycho:tycho-compiler-plugin:1.1.0-SNAPSHOT:compile (default-compile) on project org.eclipse.wst.xsl.xalan: Compilation failure
    at org.apache.maven.lifecycle.internal.MojoExecutor.execute (MojoExecutor.java:213)
    at org.apache.maven.lifecycle.internal.MojoExecutor.execute (MojoExecutor.java:154)
    at org.apache.maven.lifecycle.internal.MojoExecutor.execute (MojoExecutor.java:146)
    at org.apache.maven.lifecycle.internal.LifecycleModuleBuilder.buildProject (LifecycleModuleBuilder.java:117)
    at org.apache.maven.lifecycle.internal.LifecycleModuleBuilder.buildProject (LifecycleModuleBuilder.java:81)
    at org.apache.maven.lifecycle.internal.builder.singlethreaded.SingleThreadedBuilder.build (SingleThreadedBuilder.java:51)
    at org.apache.maven.lifecycle.internal.LifecycleStarter.execute (LifecycleStarter.java:128)
    at org.apache.maven.DefaultMaven.doExecute (DefaultMaven.java:309)
    at org.apache.maven.DefaultMaven.doExecute (DefaultMaven.java:194)
    at org.apache.maven.DefaultMaven.execute (DefaultMaven.java:107)
    at org.apache.maven.cli.MavenCli.execute (MavenCli.java:955)
    at org.apache.maven.cli.MavenCli.doMain (MavenCli.java:290)
    at org.apache.maven.cli.MavenCli.main (MavenCli.java:194)
    at sun.reflect.NativeMethodAccessorImpl.invoke0 (Native Method)
    at sun.reflect.NativeMethodAccessorImpl.invoke (NativeMethodAccessorImpl.java:62)
    at sun.reflect.DelegatingMethodAccessorImpl.invoke (DelegatingMethodAccessorImpl.java:43)
    at java.lang.reflect.Method.invoke (Method.java:498)
    at org.codehaus.plexus.classworlds.launcher.Launcher.launchEnhanced (Launcher.java:289)
    at org.codehaus.plexus.classworlds.launcher.Launcher.launch (Launcher.java:229)
    at org.codehaus.plexus.classworlds.launcher.Launcher.mainWithExitCode (Launcher.java:415)
    at org.codehaus.plexus.classworlds.launcher.Launcher.main (Launcher.java:356)
Caused by: copied.org.apache.maven.plugin.CompilationFailureException: Compilation failure
    at copied.org.apache.maven.plugin.AbstractCompilerMojo.execute (AbstractCompilerMojo.java:420)
    at org.eclipse.tycho.compiler.AbstractOsgiCompilerMojo.execute (AbstractOsgiCompilerMojo.java:293)
    at org.apache.maven.plugin.DefaultBuildPluginManager.executeMojo (DefaultBuildPluginManager.java:134)
    at org.apache.maven.lifecycle.internal.MojoExecutor.execute (MojoExecutor.java:208)
    at org.apache.maven.lifecycle.internal.MojoExecutor.execute (MojoExecutor.java:154)
    at org.apache.maven.lifecycle.internal.MojoExecutor.execute (MojoExecutor.java:146)
    at org.apache.maven.lifecycle.internal.LifecycleModuleBuilder.buildProject (LifecycleModuleBuilder.java:117)
    at org.apache.maven.lifecycle.internal.LifecycleModuleBuilder.buildProject (LifecycleModuleBuilder.java:81)
    at org.apache.maven.lifecycle.internal.builder.singlethreaded.SingleThreadedBuilder.build (SingleThreadedBuilder.java:51)
    at org.apache.maven.lifecycle.internal.LifecycleStarter.execute (LifecycleStarter.java:128)
    at org.apache.maven.DefaultMaven.doExecute (DefaultMaven.java:309)
    at org.apache.maven.DefaultMaven.doExecute (DefaultMaven.java:194)
    at org.apache.maven.DefaultMaven.execute (DefaultMaven.java:107)
    at org.apache.maven.cli.MavenCli.execute (MavenCli.java:955)
    at org.apache.maven.cli.MavenCli.doMain (MavenCli.java:290)
    at org.apache.maven.cli.MavenCli.main (MavenCli.java:194)
    at sun.reflect.NativeMethodAccessorImpl.invoke0 (Native Method)
    at sun.reflect.NativeMethodAccessorImpl.invoke (NativeMethodAccessorImpl.java:62)
    at sun.reflect.DelegatingMethodAccessorImpl.invoke (DelegatingMethodAccessorImpl.java:43)
    at java.lang.reflect.Method.invoke (Method.java:498)
    at org.codehaus.plexus.classworlds.launcher.Launcher.launchEnhanced (Launcher.java:289)
    at org.codehaus.plexus.classworlds.launcher.Launcher.launch (Launcher.java:229)
    at org.codehaus.plexus.classworlds.launcher.Launcher.mainWithExitCode (Launcher.java:415)
    at org.codehaus.plexus.classworlds.launcher.Launcher.main (Launcher.java:356)
[ERROR]
[ERROR]
[ERROR] For more information about the errors and possible solutions, please read the following articles:
[ERROR] [Help 1] http://cwiki.apache.org/confluence/display/MAVEN/MojoFailureException
[ERROR]
[ERROR] After correcting the problems, you can resume the build with the command
[ERROR]   mvn <goals> -rf :org.eclipse.wst.xsl.xalan
[DEBUG] Waiting for process to finish
[DEBUG] Result: 1
Taking screenshot.
[workspace] $ import -window root -display :455 screenshot.jpg
Terminating xvnc.
Recording test results
Archiving artifacts

--
This message is automatically generated by Hudson.
For more information on Hudson, see: http://hudson-ci.org/
_______________________________________________
wtp-releng mailing list
[hidden email]
To change your delivery options, retrieve your password, or unsubscribe from this list, visit
https://dev.eclipse.org/mailman/listinfo/wtp-releng