[Hudson] Build failed in Hudson: webtools-webservices_R3_10 #25

classic Classic list List threaded Threaded
2 messages Options
Reply | Threaded
Open this post in threaded view
|

[Hudson] Build failed in Hudson: webtools-webservices_R3_10 #25

hudsonbuild
See <https://hudson.eclipse.org/webtools/job/webtools-webservices_R3_10/25/>

------------------------------------------
[...truncated 6342 lines...]
HandlesDocumentationElements(org.eclipse.wst.wsdl.tests.BugFixesTest$16)  Time elapsed: 0.005 sec
SupportsLocalNSForExtensibilityElements(org.eclipse.wst.wsdl.tests.BugFixesTest$17)  Time elapsed: 0.004 sec
InlineTypesFromImportsAreVisible(org.eclipse.wst.wsdl.tests.BugFixesTest$18)  Time elapsed: 0.004 sec
PropagatesTargetNamespaceChange(org.eclipse.wst.wsdl.tests.BugFixesTest$19)  Time elapsed: 0.005 sec
RemoveBinding(org.eclipse.wst.wsdl.tests.BugFixesTest$20)  Time elapsed: 0.018 sec
RemoveMessage(org.eclipse.wst.wsdl.tests.BugFixesTest$21)  Time elapsed: 0.013 sec
RemovePortType(org.eclipse.wst.wsdl.tests.BugFixesTest$22)  Time elapsed: 0.012 sec
RemoveService(org.eclipse.wst.wsdl.tests.BugFixesTest$23)  Time elapsed: 0.012 sec
GetWSDLType(org.eclipse.wst.wsdl.tests.BugFixesTest$24)  Time elapsed: 0.006 sec
InvalidXSDImports(org.eclipse.wst.wsdl.tests.BugFixesTest$25)  Time elapsed: 0.005 sec
ReconcileNonWSDLElements(org.eclipse.wst.wsdl.tests.BugFixesTest$26)  Time elapsed: 0.043 sec
ReconcilesImportsWithNoLocation(org.eclipse.wst.wsdl.tests.BugFixesTest$27)  Time elapsed: 0.002 sec
ReconcilesExtensibleElements(org.eclipse.wst.wsdl.tests.BugFixesTest$28)  Time elapsed: 0.009 sec
ImportsWithNonStandardFileExtension(org.eclipse.wst.wsdl.tests.BugFixesTest$29)  Time elapsed: 0.015 sec
LocalDefaultNamespace(org.eclipse.wst.wsdl.tests.BugFixesTest$30)  Time elapsed: 0.003 sec
MoveOperation(org.eclipse.wst.wsdl.tests.BugFixesTest$31)  Time elapsed: 0.026 sec
SOAPBodyForMIME(org.eclipse.wst.wsdl.tests.BugFixesTest$32)  Time elapsed: 0.007 sec
null(org.eclipse.wst.wsdl.tests.LocationTrackingTest$1)  Time elapsed: 0.007 sec
Refactoring(org.eclipse.wst.wsdl.tests.RefactoringTest$1)  Time elapsed: 0.003 sec
SOAPExtensionsCreation(org.eclipse.wst.wsdl.tests.extensions.SOAPExtensionsTest$1)  Time elapsed: 0.007 sec
EMFSerialization(org.eclipse.wst.wsdl.tests.extensions.SOAPExtensionsTest$2)  Time elapsed: 0.087 sec
SOAPExtensionsReconciliation(org.eclipse.wst.wsdl.tests.extensions.SOAPExtensionsTest$3)  Time elapsed: 0.008 sec
SOAPContentGenerator(org.eclipse.wst.wsdl.tests.extensions.SOAPExtensionsTest$4)  Time elapsed: 0.007 sec
HTTPExtensionsCreation(org.eclipse.wst.wsdl.tests.extensions.HTTPExtensionsTest$1)  Time elapsed: 0.011 sec
EMFSerialization(org.eclipse.wst.wsdl.tests.extensions.HTTPExtensionsTest$2)  Time elapsed: 0.011 sec
HTTPExtensionsReconciliation(org.eclipse.wst.wsdl.tests.extensions.HTTPExtensionsTest$3)  Time elapsed: 0.003 sec
HTTPContentGenerator(org.eclipse.wst.wsdl.tests.extensions.HTTPExtensionsTest$4)  Time elapsed: 0.007 sec
MIMEExtensionsCreation(org.eclipse.wst.wsdl.tests.extensions.MIMEExtensionsTest$1)  Time elapsed: 0.007 sec
EMFSerialization(org.eclipse.wst.wsdl.tests.extensions.MIMEExtensionsTest$2)  Time elapsed: 0.011 sec
MIMEExtensionsReconciliation(org.eclipse.wst.wsdl.tests.extensions.MIMEExtensionsTest$3)  Time elapsed: 0.004 sec

Results :

Tests run: 58, Failures: 0, Errors: 0, Skipped: 0

[INFO] All tests passed!
[INFO]
[INFO] --- tycho-pack200a-plugin:1.0.0:normalize (pack200-normalize) @ org.eclipse.wst.wsdl.tests ---
[INFO] Pack200 normalizing jar /jobs/genie.webtools/webtools-webservices_R3_10/workspace/tests/org.eclipse.wst.wsdl.tests/target/org.eclipse.wst.wsdl.tests-1.0.550-SNAPSHOT.jar
[INFO]
[INFO] --- eclipse-jarsigner-plugin:1.1.4:sign (sign) @ org.eclipse.wst.wsdl.tests ---
[INFO] Signing of nested jars of '/jobs/genie.webtools/webtools-webservices_R3_10/workspace/tests/org.eclipse.wst.wsdl.tests/target/org.eclipse.wst.wsdl.tests-1.0.550-SNAPSHOT.jar_unpacked_2279794460696356129/wsdl.tests.jar' is disabled.
[INFO] Signing jar: /jobs/genie.webtools/webtools-webservices_R3_10/workspace/tests/org.eclipse.wst.wsdl.tests/target/org.eclipse.wst.wsdl.tests-1.0.550-SNAPSHOT.jar_unpacked_2279794460696356129/wsdl.tests.jar
[INFO] Signing jar: /jobs/genie.webtools/webtools-webservices_R3_10/workspace/tests/org.eclipse.wst.wsdl.tests/target/org.eclipse.wst.wsdl.tests-1.0.550-SNAPSHOT.jar
[INFO] Signing jar: /jobs/genie.webtools/webtools-webservices_R3_10/workspace/tests/org.eclipse.wst.wsdl.tests/target/org.eclipse.wst.wsdl.tests-1.0.550-SNAPSHOT-sources.jar
[INFO]
[INFO] --- tycho-pack200b-plugin:1.0.0:pack (pack200-pack) @ org.eclipse.wst.wsdl.tests ---
[INFO] Pack200 packing jar /jobs/genie.webtools/webtools-webservices_R3_10/workspace/tests/org.eclipse.wst.wsdl.tests/target/org.eclipse.wst.wsdl.tests-1.0.550-SNAPSHOT.jar
[INFO]
[INFO] --- tycho-p2-plugin:1.0.0:p2-metadata (p2-metadata) @ org.eclipse.wst.wsdl.tests ---
[INFO] No baseline version MavenProject: org.eclipse.webtools.webservices:org.eclipse.wst.wsdl.tests:1.0.550-SNAPSHOT @ /jobs/genie.webtools/webtools-webservices_R3_10/workspace/tests/org.eclipse.wst.wsdl.tests/pom.xml
[INFO]
[INFO] --- maven-install-plugin:2.3.1:install (default-install) @ org.eclipse.wst.wsdl.tests ---
[INFO] Installing /jobs/genie.webtools/webtools-webservices_R3_10/workspace/tests/org.eclipse.wst.wsdl.tests/target/org.eclipse.wst.wsdl.tests-1.0.550-SNAPSHOT.jar to <https://hudson.eclipse.org/webtools/job/webtools-webservices_R3_10/ws/.maven/repo/org/eclipse/webtools/webservices/org.eclipse.wst.wsdl.tests/1.0.550-SNAPSHOT/org.eclipse.wst.wsdl.tests-1.0.550-SNAPSHOT.jar>
[INFO] Installing /jobs/genie.webtools/webtools-webservices_R3_10/workspace/tests/org.eclipse.wst.wsdl.tests/pom.xml to <https://hudson.eclipse.org/webtools/job/webtools-webservices_R3_10/ws/.maven/repo/org/eclipse/webtools/webservices/org.eclipse.wst.wsdl.tests/1.0.550-SNAPSHOT/org.eclipse.wst.wsdl.tests-1.0.550-SNAPSHOT.pom>
[INFO] Installing /jobs/genie.webtools/webtools-webservices_R3_10/workspace/tests/org.eclipse.wst.wsdl.tests/target/org.eclipse.wst.wsdl.tests-1.0.550-SNAPSHOT-sources.jar to <https://hudson.eclipse.org/webtools/job/webtools-webservices_R3_10/ws/.maven/repo/org/eclipse/webtools/webservices/org.eclipse.wst.wsdl.tests/1.0.550-SNAPSHOT/org.eclipse.wst.wsdl.tests-1.0.550-SNAPSHOT-sources.jar>
[INFO] Installing /jobs/genie.webtools/webtools-webservices_R3_10/workspace/tests/org.eclipse.wst.wsdl.tests/target/org.eclipse.wst.wsdl.tests-1.0.550-SNAPSHOT.jar.pack.gz to <https://hudson.eclipse.org/webtools/job/webtools-webservices_R3_10/ws/.maven/repo/org/eclipse/webtools/webservices/org.eclipse.wst.wsdl.tests/1.0.550-SNAPSHOT/org.eclipse.wst.wsdl.tests-1.0.550-SNAPSHOT-pack200.jar.pack.gz>
[INFO] Installing /jobs/genie.webtools/webtools-webservices_R3_10/workspace/tests/org.eclipse.wst.wsdl.tests/target/p2content.xml to <https://hudson.eclipse.org/webtools/job/webtools-webservices_R3_10/ws/.maven/repo/org/eclipse/webtools/webservices/org.eclipse.wst.wsdl.tests/1.0.550-SNAPSHOT/org.eclipse.wst.wsdl.tests-1.0.550-SNAPSHOT-p2metadata.xml>
[INFO] Installing /jobs/genie.webtools/webtools-webservices_R3_10/workspace/tests/org.eclipse.wst.wsdl.tests/target/p2artifacts.xml to <https://hudson.eclipse.org/webtools/job/webtools-webservices_R3_10/ws/.maven/repo/org/eclipse/webtools/webservices/org.eclipse.wst.wsdl.tests/1.0.550-SNAPSHOT/org.eclipse.wst.wsdl.tests-1.0.550-SNAPSHOT-p2artifacts.xml>
[INFO]
[INFO] --- tycho-p2-plugin:1.0.0:update-local-index (default-update-local-index) @ org.eclipse.wst.wsdl.tests ---
[INFO]                                                                        
[INFO] ------------------------------------------------------------------------
[INFO] Building org.eclipse.wst.wsdl.tests.ui 1.0.300-SNAPSHOT
[INFO] ------------------------------------------------------------------------
[INFO]
[INFO] --- maven-clean-plugin:2.5:clean (default-clean) @ org.eclipse.wst.wsdl.tests.ui ---
[INFO]
[INFO] --- tycho-packaging-plugin:1.0.0:build-qualifier (default-build-qualifier) @ org.eclipse.wst.wsdl.tests.ui ---
[INFO] The project's OSGi version is 1.0.300.v201309242123
[INFO]
[INFO] --- tycho-packaging-plugin:1.0.0:validate-id (default-validate-id) @ org.eclipse.wst.wsdl.tests.ui ---
[INFO]
[INFO] --- tycho-packaging-plugin:1.0.0:validate-version (default-validate-version) @ org.eclipse.wst.wsdl.tests.ui ---
[INFO]
[INFO] --- build-helper-maven-plugin:3.0.0:regex-property (regex-property) @ org.eclipse.wst.wsdl.tests.ui ---
[INFO]
[INFO] --- maven-resources-plugin:2.4.3:resources (default-resources) @ org.eclipse.wst.wsdl.tests.ui ---
[WARNING] Using platform encoding (UTF-8 actually) to copy filtered resources, i.e. build is platform dependent!
[INFO] skip non existing resourceDirectory /jobs/genie.webtools/webtools-webservices_R3_10/workspace/tests/org.eclipse.wst.wsdl.tests.ui/src/main/resources
[INFO]
[INFO] --- tycho-compiler-plugin:1.0.0:compile (default-compile) @ org.eclipse.wst.wsdl.tests.ui ---
[INFO] Compiling 2 source files to /jobs/genie.webtools/webtools-webservices_R3_10/workspace/tests/org.eclipse.wst.wsdl.tests.ui/target/classes
[INFO]
[INFO] --- maven-resources-plugin:2.4.3:testResources (default-testResources) @ org.eclipse.wst.wsdl.tests.ui ---
[WARNING] Using platform encoding (UTF-8 actually) to copy filtered resources, i.e. build is platform dependent!
[INFO] skip non existing resourceDirectory /jobs/genie.webtools/webtools-webservices_R3_10/workspace/tests/org.eclipse.wst.wsdl.tests.ui/src/test/resources
[INFO]
[INFO] --- tycho-source-plugin:1.0.0:plugin-source (plugin-source) @ org.eclipse.wst.wsdl.tests.ui ---
[INFO] Building jar: /jobs/genie.webtools/webtools-webservices_R3_10/workspace/tests/org.eclipse.wst.wsdl.tests.ui/target/org.eclipse.wst.wsdl.tests.ui-1.0.300-SNAPSHOT-sources.jar
[INFO]
[INFO] --- target-platform-configuration:1.0.0:target-platform (default-target-platform) @ org.eclipse.wst.wsdl.tests.ui ---
[INFO]
[INFO] --- tycho-packaging-plugin:1.0.0:package-plugin (default-package-plugin) @ org.eclipse.wst.wsdl.tests.ui ---
[INFO] Building jar: /jobs/genie.webtools/webtools-webservices_R3_10/workspace/tests/org.eclipse.wst.wsdl.tests.ui/wsdl.tests.ui.jar
[INFO] Building jar: /jobs/genie.webtools/webtools-webservices_R3_10/workspace/tests/org.eclipse.wst.wsdl.tests.ui/target/org.eclipse.wst.wsdl.tests.ui-1.0.300-SNAPSHOT.jar
[INFO]
[INFO] --- tycho-p2-plugin:1.0.0:p2-metadata-default (default-p2-metadata-default) @ org.eclipse.wst.wsdl.tests.ui ---
[INFO]
[INFO] --- tycho-pack200a-plugin:1.0.0:normalize (pack200-normalize) @ org.eclipse.wst.wsdl.tests.ui ---
[INFO] Pack200 normalizing jar /jobs/genie.webtools/webtools-webservices_R3_10/workspace/tests/org.eclipse.wst.wsdl.tests.ui/target/org.eclipse.wst.wsdl.tests.ui-1.0.300-SNAPSHOT.jar
[INFO]
[INFO] --- eclipse-jarsigner-plugin:1.1.4:sign (sign) @ org.eclipse.wst.wsdl.tests.ui ---
[INFO] Signing of nested jars of '/jobs/genie.webtools/webtools-webservices_R3_10/workspace/tests/org.eclipse.wst.wsdl.tests.ui/target/org.eclipse.wst.wsdl.tests.ui-1.0.300-SNAPSHOT.jar_unpacked_2664019799435501344/wsdl.tests.ui.jar' is disabled.
[INFO] Signing jar: /jobs/genie.webtools/webtools-webservices_R3_10/workspace/tests/org.eclipse.wst.wsdl.tests.ui/target/org.eclipse.wst.wsdl.tests.ui-1.0.300-SNAPSHOT.jar_unpacked_2664019799435501344/wsdl.tests.ui.jar
[INFO] Signing jar: /jobs/genie.webtools/webtools-webservices_R3_10/workspace/tests/org.eclipse.wst.wsdl.tests.ui/target/org.eclipse.wst.wsdl.tests.ui-1.0.300-SNAPSHOT.jar
[INFO] Signing jar: /jobs/genie.webtools/webtools-webservices_R3_10/workspace/tests/org.eclipse.wst.wsdl.tests.ui/target/org.eclipse.wst.wsdl.tests.ui-1.0.300-SNAPSHOT-sources.jar
[INFO]
[INFO] --- tycho-pack200b-plugin:1.0.0:pack (pack200-pack) @ org.eclipse.wst.wsdl.tests.ui ---
[INFO] Pack200 packing jar /jobs/genie.webtools/webtools-webservices_R3_10/workspace/tests/org.eclipse.wst.wsdl.tests.ui/target/org.eclipse.wst.wsdl.tests.ui-1.0.300-SNAPSHOT.jar
[INFO]
[INFO] --- tycho-p2-plugin:1.0.0:p2-metadata (p2-metadata) @ org.eclipse.wst.wsdl.tests.ui ---
[INFO] No baseline version MavenProject: org.eclipse.webtools.webservices:org.eclipse.wst.wsdl.tests.ui:1.0.300-SNAPSHOT @ /jobs/genie.webtools/webtools-webservices_R3_10/workspace/tests/org.eclipse.wst.wsdl.tests.ui/pom.xml
[INFO]
[INFO] --- maven-install-plugin:2.3.1:install (default-install) @ org.eclipse.wst.wsdl.tests.ui ---
[INFO] Installing /jobs/genie.webtools/webtools-webservices_R3_10/workspace/tests/org.eclipse.wst.wsdl.tests.ui/target/org.eclipse.wst.wsdl.tests.ui-1.0.300-SNAPSHOT.jar to <https://hudson.eclipse.org/webtools/job/webtools-webservices_R3_10/ws/.maven/repo/org/eclipse/webtools/webservices/org.eclipse.wst.wsdl.tests.ui/1.0.300-SNAPSHOT/org.eclipse.wst.wsdl.tests.ui-1.0.300-SNAPSHOT.jar>
[INFO] Installing /jobs/genie.webtools/webtools-webservices_R3_10/workspace/tests/org.eclipse.wst.wsdl.tests.ui/pom.xml to <https://hudson.eclipse.org/webtools/job/webtools-webservices_R3_10/ws/.maven/repo/org/eclipse/webtools/webservices/org.eclipse.wst.wsdl.tests.ui/1.0.300-SNAPSHOT/org.eclipse.wst.wsdl.tests.ui-1.0.300-SNAPSHOT.pom>
[INFO] Installing /jobs/genie.webtools/webtools-webservices_R3_10/workspace/tests/org.eclipse.wst.wsdl.tests.ui/target/org.eclipse.wst.wsdl.tests.ui-1.0.300-SNAPSHOT-sources.jar to <https://hudson.eclipse.org/webtools/job/webtools-webservices_R3_10/ws/.maven/repo/org/eclipse/webtools/webservices/org.eclipse.wst.wsdl.tests.ui/1.0.300-SNAPSHOT/org.eclipse.wst.wsdl.tests.ui-1.0.300-SNAPSHOT-sources.jar>
[INFO] Installing /jobs/genie.webtools/webtools-webservices_R3_10/workspace/tests/org.eclipse.wst.wsdl.tests.ui/target/org.eclipse.wst.wsdl.tests.ui-1.0.300-SNAPSHOT.jar.pack.gz to <https://hudson.eclipse.org/webtools/job/webtools-webservices_R3_10/ws/.maven/repo/org/eclipse/webtools/webservices/org.eclipse.wst.wsdl.tests.ui/1.0.300-SNAPSHOT/org.eclipse.wst.wsdl.tests.ui-1.0.300-SNAPSHOT-pack200.jar.pack.gz>
[INFO] Installing /jobs/genie.webtools/webtools-webservices_R3_10/workspace/tests/org.eclipse.wst.wsdl.tests.ui/target/p2content.xml to <https://hudson.eclipse.org/webtools/job/webtools-webservices_R3_10/ws/.maven/repo/org/eclipse/webtools/webservices/org.eclipse.wst.wsdl.tests.ui/1.0.300-SNAPSHOT/org.eclipse.wst.wsdl.tests.ui-1.0.300-SNAPSHOT-p2metadata.xml>
[INFO] Installing /jobs/genie.webtools/webtools-webservices_R3_10/workspace/tests/org.eclipse.wst.wsdl.tests.ui/target/p2artifacts.xml to <https://hudson.eclipse.org/webtools/job/webtools-webservices_R3_10/ws/.maven/repo/org/eclipse/webtools/webservices/org.eclipse.wst.wsdl.tests.ui/1.0.300-SNAPSHOT/org.eclipse.wst.wsdl.tests.ui-1.0.300-SNAPSHOT-p2artifacts.xml>
[INFO]
[INFO] --- tycho-p2-plugin:1.0.0:update-local-index (default-update-local-index) @ org.eclipse.wst.wsdl.tests.ui ---
[INFO]                                                                        
[INFO] ------------------------------------------------------------------------
[INFO] Skipping org.eclipse.wst.wsdl.validation.tests
[INFO] This project has been banned from the build due to previous failures.
[INFO] ------------------------------------------------------------------------
[INFO]                                                                        
[INFO] ------------------------------------------------------------------------
[INFO] Skipping org.eclipse.wst.wsi.tests
[INFO] This project has been banned from the build due to previous failures.
[INFO] ------------------------------------------------------------------------
[INFO]                                                                        
[INFO] ------------------------------------------------------------------------
[INFO] Skipping org.eclipse.wst.wsdl.ui.tests
[INFO] This project has been banned from the build due to previous failures.
[INFO] ------------------------------------------------------------------------
[INFO]                                                                        
[INFO] ------------------------------------------------------------------------
[INFO] Skipping org.eclipse.wst.ws_tests.feature
[INFO] This project has been banned from the build due to previous failures.
[INFO] ------------------------------------------------------------------------
[INFO]                                                                        
[INFO] ------------------------------------------------------------------------
[INFO] Skipping org.eclipse.jst.ws.axis.consumption.core.tests
[INFO] This project has been banned from the build due to previous failures.
[INFO] ------------------------------------------------------------------------
[INFO]                                                                        
[INFO] ------------------------------------------------------------------------
[INFO] Skipping org.eclipse.jst.ws.tests
[INFO] This project has been banned from the build due to previous failures.
[INFO] ------------------------------------------------------------------------
[INFO]                                                                        
[INFO] ------------------------------------------------------------------------
[INFO] Skipping org.eclipse.jst.ws.tests.performance
[INFO] This project has been banned from the build due to previous failures.
[INFO] ------------------------------------------------------------------------
[INFO]                                                                        
[INFO] ------------------------------------------------------------------------
[INFO] Skipping org.eclipse.webtools.webservices.site
[INFO] This project has been banned from the build due to previous failures.
[INFO] ------------------------------------------------------------------------
[INFO] ------------------------------------------------------------------------
[INFO] Reactor Summary:
[INFO]
[INFO] org.eclipse.webtools.webservices ................... SUCCESS [05:00 min]
[INFO] org.eclipse.wst.command.env.core ................... FAILURE [03:22 min]
[INFO] org.eclipse.wst.command.env ........................ SKIPPED
[INFO] org.eclipse.wst.wsdl ............................... SUCCESS [01:22 min]
[INFO] org.eclipse.wst.ws.parser .......................... SKIPPED
[INFO] org.eclipse.wst.ws.service.policy .................. SUCCESS [  3.568 s]
[INFO] org.eclipse.wst.ws ................................. SKIPPED
[INFO] org.eclipse.jst.ws ................................. SKIPPED
[INFO] org.eclipse.jst.ws.axis.consumption.core ........... SKIPPED
[INFO] org.eclipse.jst.ws.consumption ..................... SKIPPED
[INFO] org.eclipse.wst.command.env.ui ..................... SKIPPED
[INFO] org.eclipse.wst.ws.ui .............................. SKIPPED
[INFO] org.eclipse.wst.ws.explorer ........................ SKIPPED
[INFO] org.eclipse.jst.ws.ui .............................. SKIPPED
[INFO] org.eclipse.wst.wsdl.validation .................... SUCCESS [ 17.020 s]
[INFO] org.eclipse.jst.ws.consumption.ui .................. SKIPPED
[INFO] org.eclipse.jst.ws.axis.consumption.ui ............. SKIPPED
[INFO] org.eclipse.jst.ws.axis.creation.ui ................ SKIPPED
[INFO] org.eclipse.jst.ws.creation.ejb.ui ................. SKIPPED
[INFO] org.eclipse.jst.ws.creation.ui ..................... SKIPPED
[INFO] org.eclipse.jst.ws.jaxrs.core ...................... SUCCESS [ 10.479 s]
[INFO] org.eclipse.jst.ws.jaxrs.ui ........................ SUCCESS [ 21.502 s]
[INFO] org.eclipse.jst.ws.uddiregistry .................... SKIPPED
[INFO] org.eclipse.wst.ws.service.policy.ui ............... SUCCESS [ 11.835 s]
[INFO] org.eclipse.wst.wsdl.ui ............................ SKIPPED
[INFO] org.eclipse.wst.wsi ................................ SKIPPED
[INFO] org.eclipse.wst.wsi.ui ............................. SKIPPED
[INFO] org.eclipse.jst.ws.axis.infopop .................... SUCCESS [  8.530 s]
[INFO] org.eclipse.jst.ws.axis.ui.doc.user ................ SUCCESS [ 11.314 s]
[INFO] org.eclipse.jst.ws.consumption.infopop ............. SUCCESS [  2.882 s]
[INFO] org.eclipse.jst.ws.consumption.ui.doc.user ......... SUCCESS [  4.037 s]
[INFO] org.eclipse.jst.ws.doc.user ........................ SUCCESS [ 18.569 s]
[INFO] org.eclipse.jst.ws.infopop ......................... SUCCESS [  8.421 s]
[INFO] org.eclipse.wst.command.env.doc.user ............... SUCCESS [ 10.387 s]
[INFO] org.eclipse.wst.command.env.infopop ................ SUCCESS [ 10.503 s]
[INFO] org.eclipse.wst.ws.api.doc ......................... SUCCESS [ 12.016 s]
[INFO] org.eclipse.wst.wsdl.doc.isv ....................... SUCCESS [  9.567 s]
[INFO] org.eclipse.wst.wsdl.ui.doc.user ................... SUCCESS [  5.992 s]
[INFO] org.eclipse.wst.ws.infopop ......................... SUCCESS [  4.082 s]
[INFO] org.eclipse.wst.wsi.ui.doc.user .................... SUCCESS [  5.187 s]
[INFO] org.eclipse.wst.ws_wsdl15.feature .................. SUCCESS [  3.038 s]
[INFO] org.eclipse.wst.ws_core.feature .................... SKIPPED
[INFO] org.eclipse.wst.ws_userdoc.feature ................. SUCCESS [  4.114 s]
[INFO] org.eclipse.wst.ws_ui.feature ...................... SKIPPED
[INFO] org.eclipse.wst.ws_sdk.feature ..................... SKIPPED
[INFO] org.eclipse.wst.ws.tests ........................... SKIPPED
[INFO] org.eclipse.wst.wsdl.tests ......................... SUCCESS [ 16.378 s]
[INFO] org.eclipse.wst.wsdl.tests.ui ...................... SUCCESS [ 17.154 s]
[INFO] org.eclipse.wst.wsdl.validation.tests .............. SKIPPED
[INFO] org.eclipse.wst.wsi.tests .......................... SKIPPED
[INFO] org.eclipse.wst.wsdl.ui.tests ...................... SKIPPED
[INFO] org.eclipse.wst.ws_tests.feature ................... SKIPPED
[INFO] org.eclipse.jst.ws.axis.consumption.core.tests ..... SKIPPED
[INFO] org.eclipse.jst.ws.tests ........................... SKIPPED
[INFO] org.eclipse.jst.ws.tests.performance ............... SKIPPED
[INFO] org.eclipse.webtools.webservices.site .............. SKIPPED
[INFO] ------------------------------------------------------------------------
[INFO] BUILD FAILURE
[INFO] ------------------------------------------------------------------------
[INFO] Total time: 29:10 min
[INFO] Finished at: 2018-01-24T00:27:23-05:00
[INFO] Final Memory: 170M/4144M
[INFO] ------------------------------------------------------------------------
[INFO] o.h.m.e.h.MavenExecutionResultHandler - Build failed with exception(s)
[INFO] o.h.m.e.h.MavenExecutionResultHandler - [1] org.apache.maven.lifecycle.LifecycleExecutionException: Failed to execute goal org.eclipse.tycho.extras:tycho-pack200a-plugin:1.0.0:normalize (pack200-normalize) on project org.eclipse.wst.command.env.core: Execution pack200-normalize of goal org.eclipse.tycho.extras:tycho-pack200a-plugin:1.0.0:normalize failed: Could not execute pack200, see log for details.
[DEBUG] Closing connection to remote
[ERROR] Failed to execute goal org.eclipse.tycho.extras:tycho-pack200a-plugin:1.0.0:normalize (pack200-normalize) on project org.eclipse.wst.command.env.core: Execution pack200-normalize of goal org.eclipse.tycho.extras:tycho-pack200a-plugin:1.0.0:normalize failed: Could not execute pack200, see log for details. Error while executing external command, process killed. Process timeout out after 100 seconds -> [Help 1]
[ERROR]
[ERROR] To see the full stack trace of the errors, re-run Maven with the -e switch.
[ERROR] Re-run Maven using the -X switch to enable full debug logging.
[ERROR]
[ERROR] For more information about the errors and possible solutions, please read the following articles:
[ERROR] [Help 1] http://cwiki.apache.org/confluence/display/MAVEN/PluginExecutionException
[ERROR]
[ERROR] After correcting the problems, you can resume the build with the command
[ERROR]   mvn <goals> -rf :org.eclipse.wst.command.env.core
[DEBUG] Waiting for process to finish
[DEBUG] Result: 1
Taking screenshot.
[workspace] $ import -window root -display :455 screenshot.jpg
Terminating xvnc.
Recording test results
Archiving artifacts

--
This message is automatically generated by Hudson.
For more information on Hudson, see: http://hudson-ci.org/
_______________________________________________
wtp-releng mailing list
[hidden email]
To change your delivery options, retrieve your password, or unsubscribe from this list, visit
https://dev.eclipse.org/mailman/listinfo/wtp-releng
Reply | Threaded
Open this post in threaded view
|

[Hudson] Hudson build is back to normal : webtools-webservices_R3_10 #26

hudsonbuild
See <https://hudson.eclipse.org/webtools/job/webtools-webservices_R3_10/26/>


--
This message is automatically generated by Hudson.
For more information on Hudson, see: http://hudson-ci.org/
_______________________________________________
wtp-releng mailing list
[hidden email]
To change your delivery options, retrieve your password, or unsubscribe from this list, visit
https://dev.eclipse.org/mailman/listinfo/wtp-releng